setup
checks.aarch64-linux.psql_17_slim
· build #169
· raw
1these 3 derivations will be built:2 /nix/store/j15d9is1dyn364v69fz193h5p3bif34p-start-postgres-server-test.drv3 /nix/store/ir9172cccq9g0942hynsdc0mj0bwzlyk-postgres-17-check-harness.drv4 /nix/store/bml7nrl87n4z1hcaj897pkcz04bhb34g-run-check-harness-psql-17-slim.drv5error: build of '/nix/store/bml7nrl87n4z1hcaj897pkcz04bhb34g-run-check-harness-psql-17-slim.drv' on 'ssh-ng://nixbot-remote-build@78.232.36.247' failed: Cannot build '/nix/store/bml7nrl87n4z1hcaj897pkcz04bhb34g-run-check-harness-psql-17-slim.drv'.6 Reason: builder failed with exit code 1.7 Output paths:8 /nix/store/ccgkcvzzdvg5wbs6srlbhglyb7f07cl5-run-check-harness-psql-17-slim9 Last 25 log lines:10 > test roles ... ok 19 ms11 > test security ... ok 14 ms12 > test storage ... ok 27 ms13 > test supautils_reserved_roles ... ok 11 ms14 > test supautils_restrict_versions ... ok 142 ms15 > test vault ... ok 47 ms16 > test wal2json ... ok 162 ms17 > test z_17_ext_interface ... FAILED 156 ms18 > test z_17_intarray_ltree_query ... ok 19 ms19 > test z_17_pg_stat_monitor ... ok 10 ms20 > test z_17_pgvector ... ok 24 ms21 > test z_17_roles ... ok 22 ms22 > test z_17_rum ... ok 27 ms23 >24 > =======================25 > 2 of 68 tests failed.26 > =======================27 >28 > The differences that caused some tests to fail can be viewed in the29 > file "/nix/store/ccgkcvzzdvg5wbs6srlbhglyb7f07cl5-run-check-harness-psql-17-slim/regression_output/regression.diffs". A copy of the test summary that you see30 > above is saved in the file "/nix/store/ccgkcvzzdvg5wbs6srlbhglyb7f07cl5-run-check-harness-psql-17-slim/regression_output/regression.out".31 >32 > 2026-10-07 23:47:30 [ERROR] pg_regress tests failed33 > 2026-10-07 23:47:30 [ERROR] An error occurred. Exit code: 134 > 2026-10-07 23:47:30 [ERROR] Debug logs:35 For full logs, run:36 nix log /nix/store/bml7nrl87n4z1hcaj897pkcz04bhb34g-run-check-harness-psql-17-slim.drv37error: Cannot build '/nix/store/bml7nrl87n4z1hcaj897pkcz04bhb34g-run-check-harness-psql-17-slim.drv'.38 Reason: builder failed with exit code 1.39 Output paths:40 /nix/store/ccgkcvzzdvg5wbs6srlbhglyb7f07cl5-run-check-harness-psql-17-slim