setup
checks.aarch64-linux.psql_17
· build #169
· raw
1these 10 derivations will be built:2 /nix/store/ywx4gd1k5cmx6i30nva3yckq5f9ylvnm-pg_net.drv3 /nix/store/7li0x7yawfpl8qdsp0g4zlhkf1d1l58r-postgresql-and-plugins-17.11.drv4 /nix/store/6rwm0f2xxy1iarazb1vdkq70i9gyqy03-postgresql-and-plugins-17.11.drv5 /nix/store/20pagpfpvp7qnnz7dag2pln8icvh1f5s-postgresql-and-plugins-17_22.drv6 /nix/store/qk79s575w7515g12wjzyaicin81vgmcg-postgresql-and-plugins-17_22.drv7 /nix/store/j2bn3kgljrdwikcvm26ajq37412gj6hd-postgresql-and-plugins-15.19.drv8 /nix/store/y14a3y4c4yn3lzjrn7rp6y2hplld6cmy-postgresql-and-plugins-15.19.drv9 /nix/store/r91m0lh2pzxzaca6a7inzifi619a1q07-start-postgres-server-test.drv10 /nix/store/1i2vblypx3rbjbvrjrkmgjz9rmwmpy76-postgres-17-check-harness.drv11 /nix/store/h2xx4g6md6n2lsydi16ykv38ahv0ghvm-run-check-harness-psql-17.drv12error: build of '/nix/store/h2xx4g6md6n2lsydi16ykv38ahv0ghvm-run-check-harness-psql-17.drv' on 'ssh-ng://nixbot-remote-build@78.232.36.247' failed: Cannot build '/nix/store/h2xx4g6md6n2lsydi16ykv38ahv0ghvm-run-check-harness-psql-17.drv'.13 Reason: builder failed with exit code 1.14 Output paths:15 /nix/store/4ynvg2fi6iiaz4csllbb19vqkvk8w3zs-run-check-harness-psql-1716 Last 25 log lines:17 > test roles ... ok 26 ms18 > test security ... ok 15 ms19 > test storage ... ok 30 ms20 > test supautils_reserved_roles ... ok 11 ms21 > test supautils_restrict_versions ... ok 149 ms22 > test vault ... ok 58 ms23 > test wal2json ... ok 62 ms24 > test z_17_ext_interface ... FAILED 154 ms25 > test z_17_intarray_ltree_query ... ok 19 ms26 > test z_17_pg_stat_monitor ... ok 10 ms27 > test z_17_pgvector ... ok 55 ms28 > test z_17_roles ... ok 22 ms29 > test z_17_rum ... ok 28 ms30 >31 > =======================32 > 2 of 68 tests failed.33 > =======================34 >35 > The differences that caused some tests to fail can be viewed in the36 > file "/nix/store/4ynvg2fi6iiaz4csllbb19vqkvk8w3zs-run-check-harness-psql-17/regression_output/regression.diffs". A copy of the test summary that you see37 > above is saved in the file "/nix/store/4ynvg2fi6iiaz4csllbb19vqkvk8w3zs-run-check-harness-psql-17/regression_output/regression.out".38 >39 > 2026-10-07 23:47:16 [ERROR] pg_regress tests failed40 > 2026-10-07 23:47:16 [ERROR] An error occurred. Exit code: 141 > 2026-10-07 23:47:16 [ERROR] Debug logs:42 For full logs, run:43 nix log /nix/store/h2xx4g6md6n2lsydi16ykv38ahv0ghvm-run-check-harness-psql-17.drv44error: Cannot build '/nix/store/h2xx4g6md6n2lsydi16ykv38ahv0ghvm-run-check-harness-psql-17.drv'.45 Reason: builder failed with exit code 1.46 Output paths:47 /nix/store/4ynvg2fi6iiaz4csllbb19vqkvk8w3zs-run-check-harness-psql-17