nixbot

builds
1these 2 derivations will be built:2 /nix/store/395yj1hpjvkbglcx265fq5p6c8mwjsmq-postgres-15-check-harness.drv3 /nix/store/w78dg82lzijvn0rnffl2skvwg9byb1ss-run-check-harness-psql-15.drv4error: Cannot build '/nix/store/w78dg82lzijvn0rnffl2skvwg9byb1ss-run-check-harness-psql-15.drv'.5 Reason: builder failed with exit code 1.6 Output paths:7 /nix/store/qyayl1m2acmag8jdhprlx8bjxpagxmnr-run-check-harness-psql-158 Last 25 log lines:9 > test supautils_restrict_versions ... ok 82 ms10 > test vault ... ok 28 ms11 > test wal2json ... ok 13 ms12 > test z_15_ext_interface ... FAILED 613 ms13 > test z_15_intarray_ltree_query ... ok 11 ms14 > test z_15_pg_stat_monitor ... ok 10 ms15 > test z_15_pgjwt ... ok 18 ms16 > test z_15_pgvector ... ok 31 ms17 > test z_15_plv8 ... ok 48 ms18 > test z_15_roles ... ok 15 ms19 > test z_15_rum ... ok 19 ms20 > test z_15_timescale ... ok 23 ms21 > test z_15_unhype_timescale_to_partman ... ok 11429 ms22 >23 > =======================24 > 2 of 72 tests failed.25 > =======================26 >27 > The differences that caused some tests to fail can be viewed in the28 > file "/nix/store/qyayl1m2acmag8jdhprlx8bjxpagxmnr-run-check-harness-psql-15/regression_output/regression.diffs". A copy of the test summary that you see29 > above is saved in the file "/nix/store/qyayl1m2acmag8jdhprlx8bjxpagxmnr-run-check-harness-psql-15/regression_output/regression.out".30 >31 > 2026-10-07 22:14:37 [ERROR] pg_regress tests failed32 > 2026-10-07 22:14:37 [ERROR] An error occurred. Exit code: 133 > 2026-10-07 22:14:37 [ERROR] Debug logs:34 For full logs, run:35 nix log /nix/store/w78dg82lzijvn0rnffl2skvwg9byb1ss-run-check-harness-psql-15.drv