nixbot

builds
1this derivation will be built:2 /nix/store/z4229jg4mr9gm27iybkrwbqcv4s7bfxv-run-check-harness-psql-17-slim.drv3these 2 paths will be fetched (23.2 KiB download, 92.4 KiB unpacked):4 /nix/store/qqy7s6j9k818sk17nxj82ihykxyc561f-postgres-17-check-harness5 /nix/store/c9s8ydwqnkn7ldklcx35azkgkf2ny2by-start-postgres-server-test6error: Cannot build '/nix/store/z4229jg4mr9gm27iybkrwbqcv4s7bfxv-run-check-harness-psql-17-slim.drv'.7 Reason: builder failed with exit code 1.8 Output paths:9 /nix/store/5jxzz55wnyxlsrmvad9115ca6dhbwb0m-run-check-harness-psql-17-slim10 Last 25 log lines:11 > test roles ... ok 12 ms12 > test security ... ok 11 ms13 > test storage ... ok 15 ms14 > test supautils_reserved_roles ... ok 9 ms15 > test supautils_restrict_versions ... ok 81 ms16 > test vault ... ok 27 ms17 > test wal2json ... ok 15 ms18 > test z_17_ext_interface ... FAILED 113 ms19 > test z_17_intarray_ltree_query ... ok 14 ms20 > test z_17_pg_stat_monitor ... ok 9 ms21 > test z_17_pgvector ... ok 15 ms22 > test z_17_roles ... ok 15 ms23 > test z_17_rum ... ok 14 ms24 >25 > =======================26 > 2 of 68 tests failed.27 > =======================28 >29 > The differences that caused some tests to fail can be viewed in the30 > file "/nix/store/5jxzz55wnyxlsrmvad9115ca6dhbwb0m-run-check-harness-psql-17-slim/regression_output/regression.diffs". A copy of the test summary that you see31 > above is saved in the file "/nix/store/5jxzz55wnyxlsrmvad9115ca6dhbwb0m-run-check-harness-psql-17-slim/regression_output/regression.out".32 >33 > 2026-10-07 21:55:43 [ERROR] pg_regress tests failed34 > 2026-10-07 21:55:43 [ERROR] An error occurred. Exit code: 135 > 2026-10-07 21:55:43 [ERROR] Debug logs:36 For full logs, run:37 nix log /nix/store/z4229jg4mr9gm27iybkrwbqcv4s7bfxv-run-check-harness-psql-17-slim.drv