setup
checks.aarch64-linux.psql_17_slim
· build #166
· raw
1these 3 derivations will be built:2 /nix/store/apjckglxgp00c2aryklj9s1393v1i42n-start-postgres-server-test.drv3 /nix/store/i4wq4pcrqwzb8y5s06x55hx851ifbgkw-postgres-17-check-harness.drv4 /nix/store/vc7mrz6cpmywnbbps60nc9lsvh172ag9-run-check-harness-psql-17-slim.drv5error: build of '/nix/store/vc7mrz6cpmywnbbps60nc9lsvh172ag9-run-check-harness-psql-17-slim.drv' on 'ssh-ng://nixbot-remote-build@78.232.36.247' failed: Cannot build '/nix/store/vc7mrz6cpmywnbbps60nc9lsvh172ag9-run-check-harness-psql-17-slim.drv'.6 Reason: builder failed with exit code 1.7 Output paths:8 /nix/store/a6gybzy3a4daqlh541cxh7yvbfgrb8af-run-check-harness-psql-17-slim9 Last 25 log lines:10 > test roles ... ok 19 ms11 > test security ... ok 13 ms12 > test storage ... ok 26 ms13 > test supautils_reserved_roles ... ok 11 ms14 > test supautils_restrict_versions ... ok 140 ms15 > test vault ... ok 46 ms16 > test wal2json ... ok 70 ms17 > test z_17_ext_interface ... FAILED 155 ms18 > test z_17_intarray_ltree_query ... ok 19 ms19 > test z_17_pg_stat_monitor ... ok 10 ms20 > test z_17_pgvector ... ok 24 ms21 > test z_17_roles ... ok 20 ms22 > test z_17_rum ... ok 25 ms23 >24 > =======================25 > 2 of 68 tests failed.26 > =======================27 >28 > The differences that caused some tests to fail can be viewed in the29 > file "/nix/store/a6gybzy3a4daqlh541cxh7yvbfgrb8af-run-check-harness-psql-17-slim/regression_output/regression.diffs". A copy of the test summary that you see30 > above is saved in the file "/nix/store/a6gybzy3a4daqlh541cxh7yvbfgrb8af-run-check-harness-psql-17-slim/regression_output/regression.out".31 >32 > 2026-10-07 21:54:35 [ERROR] pg_regress tests failed33 > 2026-10-07 21:54:35 [ERROR] An error occurred. Exit code: 134 > 2026-10-07 21:54:35 [ERROR] Debug logs:35 For full logs, run:36 nix log /nix/store/vc7mrz6cpmywnbbps60nc9lsvh172ag9-run-check-harness-psql-17-slim.drv37error: Cannot build '/nix/store/vc7mrz6cpmywnbbps60nc9lsvh172ag9-run-check-harness-psql-17-slim.drv'.38 Reason: builder failed with exit code 1.39 Output paths:40 /nix/store/a6gybzy3a4daqlh541cxh7yvbfgrb8af-run-check-harness-psql-17-slim