setup
checks.aarch64-linux.psql_15
· build #166
· raw
1these 3 derivations will be built:2 /nix/store/gsm40cv8znhfqrlm2acxg16n02rngkxn-start-postgres-server-test.drv3 /nix/store/c52lzv9y3sq1vg7gv1bsybg2r8p2krnf-postgres-15-check-harness.drv4 /nix/store/35z368af2qbr0jrzwq4khf99dnjd5dlg-run-check-harness-psql-15.drv5error: build of '/nix/store/35z368af2qbr0jrzwq4khf99dnjd5dlg-run-check-harness-psql-15.drv' on 'ssh-ng://nixbot-remote-build@78.232.36.247' failed: Cannot build '/nix/store/35z368af2qbr0jrzwq4khf99dnjd5dlg-run-check-harness-psql-15.drv'.6 Reason: builder failed with exit code 1.7 Output paths:8 /nix/store/qk6mv8q235gz32k59mw530kidwhnlz7j-run-check-harness-psql-159 Last 25 log lines:10 > test supautils_restrict_versions ... ok 159 ms11 > test vault ... ok 59 ms12 > test wal2json ... ok 44 ms13 > test z_15_ext_interface ... FAILED 1382 ms14 > test z_15_intarray_ltree_query ... ok 15 ms15 > test z_15_pg_stat_monitor ... ok 15 ms16 > test z_15_pgjwt ... ok 29 ms17 > test z_15_pgvector ... ok 79 ms18 > test z_15_plv8 ... ok 78 ms19 > test z_15_roles ... ok 24 ms20 > test z_15_rum ... ok 36 ms21 > test z_15_timescale ... ok 46 ms22 > test z_15_unhype_timescale_to_partman ... ok 19003 ms23 >24 > =======================25 > 2 of 72 tests failed.26 > =======================27 >28 > The differences that caused some tests to fail can be viewed in the29 > file "/nix/store/qk6mv8q235gz32k59mw530kidwhnlz7j-run-check-harness-psql-15/regression_output/regression.diffs". A copy of the test summary that you see30 > above is saved in the file "/nix/store/qk6mv8q235gz32k59mw530kidwhnlz7j-run-check-harness-psql-15/regression_output/regression.out".31 >32 > 2026-10-07 21:52:53 [ERROR] pg_regress tests failed33 > 2026-10-07 21:52:53 [ERROR] An error occurred. Exit code: 134 > 2026-10-07 21:52:53 [ERROR] Debug logs:35 For full logs, run:36 nix log /nix/store/35z368af2qbr0jrzwq4khf99dnjd5dlg-run-check-harness-psql-15.drv37error: Cannot build '/nix/store/35z368af2qbr0jrzwq4khf99dnjd5dlg-run-check-harness-psql-15.drv'.38 Reason: builder failed with exit code 1.39 Output paths:40 /nix/store/qk6mv8q235gz32k59mw530kidwhnlz7j-run-check-harness-psql-15