setup
checks.x86_64-linux.ext-vault
· build #165
· raw
1these 2 derivations will be built:2 /nix/store/l8xfyw61dwkb35mdq5i1y9snipv6scnm-nixos-test-driver-supabase_vault.drv3 /nix/store/bqxncnbrv74pj58v5h0mcwmpx8918bfy-vm-test-run-supabase_vault.drv4error: Cannot build '/nix/store/bqxncnbrv74pj58v5h0mcwmpx8918bfy-vm-test-run-supabase_vault.drv'.5 Reason: builder failed with exit code 1.6 Output paths:7 /nix/store/cd6b6z1z2j336ygczvim5prv8k6znp6s-vm-test-run-supabase_vault8 Last 25 log lines:9 > server # [ 9.082570] 9r9bbvwffi4lcql803lybnkwnblkh4j7-supabase-db-init[925]: psql: error: connection to server at "localhost" (::1), port 5432 failed: FATAL: supautils.extensions_parameter_overrides: invalid json10 > server # [ 9.087687] 9r9bbvwffi4lcql803lybnkwnblkh4j7-supabase-db-init[918]: Running init-script: /nix/store/nw0bs8nddlaf6wh127acj2xwsdq5p7qz-migrations-db/init-scripts/00000000000000-initial-schema.sql11 > server # [ 9.103586] postgres[928]: ::1 2026-10-07 20:44:08.206 UTC [928] postgres@postgres FATAL: role "postgres" does not exist12 > server # [ 9.105343] 9r9bbvwffi4lcql803lybnkwnblkh4j7-supabase-db-init[927]: psql: error: connection to server at "localhost" (::1), port 5432 failed: FATAL: role "postgres" does not exist13 > server # [ 9.109253] systemd[1]: supabase-db-init.service: Main process exited, code=exited, status=2/INVALIDARGUMENT14 > server # [ 9.110649] systemd[1]: supabase-db-init.service: Failed with result 'exit-code'.15 > server # [ 9.111988] systemd[1]: Failed to start Supabase Database Initialization.16 > server # [ 9.113140] systemd[1]: supabase-db-init.service: Consumed 27ms CPU time, 2.8M memory peak, 2K incoming IP traffic, 2.1K outgoing IP traffic.17 > server # [ 9.344539] dhcpcd[804]: eth0: soliciting a DHCP lease18 > server # [ 9.497017] NET: Registered PF_PACKET protocol family19 > server # [ 9.387514] dhcpcd[804]: eth0: offered 10.0.2.15 from 10.0.2.220 > server # [ 9.394288] dhcpcd[804]: eth0: probing address 10.0.2.15/2421 > !!! Traceback (most recent call last):22 > !!! File "<string>", line 280, in <module>23 > !!! server.wait_for_unit("supabase-db-init.service")24 > !!! 25 > !!! RequestedAssertionFailed: unit "supabase-db-init.service" reached state "failed"26 > cleanup27 > kill machine (pid 9)28 > qemu-system-x86_64: terminating on signal 15 from pid 6 (/nix/store/qzc04a3npl70cyyy6flnnrb2ig3kayxm-python3-3.13.11/bin/python3.13)29 > vde_switch: EOF data port: Interrupted system call30 > kill vlan (pid 7)31 > vde_switch: EOF on stdin, cleaning up and exiting32 > vde_switch: Caught signal 15, cleaning up and exiting33 > (finished: cleanup, in 0.01 seconds)34 For full logs, run:35 nix log /nix/store/bqxncnbrv74pj58v5h0mcwmpx8918bfy-vm-test-run-supabase_vault.drv