setup
checks.x86_64-linux.ext-timescaledb
· build #165
· raw
1these 12 derivations will be built:2 /nix/store/wdv09inahsdqhiaxa2alwkl7pj81x7ip-processed-postgresql-config-15.drv3 /nix/store/kdsf6pdyxn5vw103nl4y4sgsidg6kkmg-postgresql-init.drv4 /nix/store/3phigywqzxw9fl8v9i8wx3rnn93m81aj-unit-postgresql.service.drv5 /nix/store/8arcsilfsvw1q1nzfykyxsfnbh83q3ss-system-units.drv6 /nix/store/2ha5hsd77di31aa4iyxi9z4g3arkkpvb-etc.drv7 /nix/store/ymydadw392v10zvp5l99d0bgzn0gmjgl-activate.drv8 /nix/store/pxksw4lb3sa64r5iviqnvsz67j6yhx5v-nixos-system-server-test.drv9 /nix/store/kh80rhrzs2vcygmgd6c5y7b4k5dikw78-closure-info.drv10 /nix/store/idg1mgamgax8ydmccvrln0q0w5nckjgp-run-nixos-vm.drv11 /nix/store/mx6alya1xihasraslqfdk9a6fmpbm57d-nixos-vm.drv12 /nix/store/321sl3hiyy59mwjw50kjjj246gbkqkng-nixos-test-driver-timescaledb.drv13 /nix/store/xh5brywdaa9dvp0hh8mmpp1n3q01nw9n-vm-test-run-timescaledb.drv14error: Cannot build '/nix/store/xh5brywdaa9dvp0hh8mmpp1n3q01nw9n-vm-test-run-timescaledb.drv'.15 Reason: builder failed with exit code 1.16 Output paths:17 /nix/store/s1xdlgwhvdyhhb87n7myh78q4blppizz-vm-test-run-timescaledb18 Last 25 log lines:19 > server # [ 8.237770] 9r9bbvwffi4lcql803lybnkwnblkh4j7-supabase-db-init[923]: Creating postgres role...20 > server # [ 8.270069] postgres[928]: ::1 2026-10-07 20:43:24.300 UTC [928] supabase_admin@postgres FATAL: supautils.extensions_parameter_overrides: invalid json21 > server # [ 8.271737] 9r9bbvwffi4lcql803lybnkwnblkh4j7-supabase-db-init[927]: psql: error: connection to server at "localhost" (::1), port 5432 failed: FATAL: supautils.extensions_parameter_overrides: invalid json22 > server # [ 8.299872] postgres[930]: ::1 2026-10-07 20:43:24.330 UTC [930] supabase_admin@postgres FATAL: supautils.extensions_parameter_overrides: invalid json23 > server # [ 8.301069] 9r9bbvwffi4lcql803lybnkwnblkh4j7-supabase-db-init[929]: psql: error: connection to server at "localhost" (::1), port 5432 failed: FATAL: supautils.extensions_parameter_overrides: invalid json24 > server # [ 8.310260] 9r9bbvwffi4lcql803lybnkwnblkh4j7-supabase-db-init[923]: Running init-script: /nix/store/nw0bs8nddlaf6wh127acj2xwsdq5p7qz-migrations-db/init-scripts/00000000000000-initial-schema.sql25 > server # [ 8.329787] postgres[932]: ::1 2026-10-07 20:43:24.360 UTC [932] postgres@postgres FATAL: role "postgres" does not exist26 > server # [ 8.331295] 9r9bbvwffi4lcql803lybnkwnblkh4j7-supabase-db-init[931]: psql: error: connection to server at "localhost" (::1), port 5432 failed: FATAL: role "postgres" does not exist27 > server # [ 8.338577] systemd[1]: supabase-db-init.service: Main process exited, code=exited, status=2/INVALIDARGUMENT28 > server # [ 8.340114] systemd[1]: supabase-db-init.service: Failed with result 'exit-code'.29 > server # [ 8.342316] systemd[1]: Failed to start Supabase Database Initialization.30 > server # [ 8.343375] systemd[1]: supabase-db-init.service: Consumed 37ms CPU time, 2.8M memory peak, 2K incoming IP traffic, 2.2K outgoing IP traffic.31 > !!! Traceback (most recent call last):32 > !!! File "<string>", line 276, in <module>33 > !!! server.wait_for_unit("supabase-db-init.service")34 > !!! 35 > !!! RequestedAssertionFailed: unit "supabase-db-init.service" reached state "failed"36 > cleanup37 > kill machine (pid 9)38 > qemu-system-x86_64: terminating on signal 15 from pid 6 (/nix/store/qzc04a3npl70cyyy6flnnrb2ig3kayxm-python3-3.13.11/bin/python3.13)39 > vde_switch: EOF data port: Interrupted system call40 > kill vlan (pid 7)41 > vde_switch: EOF on stdin, cleaning up and exiting42 > vde_switch: Caught signal 15, cleaning up and exiting43 > (finished: cleanup, in 0.01 seconds)44 For full logs, run:45 nix log /nix/store/xh5brywdaa9dvp0hh8mmpp1n3q01nw9n-vm-test-run-timescaledb.drv