setup
checks.x86_64-linux.ext-pgroonga
· build #165
· raw
1these 20 derivations will be built:2 /nix/store/g3yr7cszllvr6kl5jpa4p9vsm30l5ncq-unit-postgresql.service.drv3 /nix/store/cwlmyjf8kkp1w46qk0lkcql1qxxal3g9-system-units.drv4 /nix/store/h6sl2kvppimf9idcxnps41fpmvvbw4g2-etc.drv5 /nix/store/3krjwran9qjbfsg2i943pxcmy6nagscj-activate.drv6 /nix/store/jhx05p74i72hwyr8g5dp9kzp78495vds-unit-postgresql.service.drv7 /nix/store/wks6qinxzm91slbsg755rzy2hmc92wcy-system-units.drv8 /nix/store/dxwxkxxsbjjbcvf3j9sv35wgi8k2n373-etc.drv9 /nix/store/5msp207cfvjwmcs8svp7zjibslgjcp7i-activate.drv10 /nix/store/9476hbpkf42snpz89k845b5649d2rvpb-nixos-system-server-test.drv11 /nix/store/893j0a0nvl1vr80g01j8gdfvbav8hzi2-unit-postgresql.service.drv12 /nix/store/xfy8jzvrsrykvfdf5q0calhsx4xykabg-system-units.drv13 /nix/store/kwjf7s92k6lrmr1sy0n186irqv22s3g1-etc.drv14 /nix/store/h32f4crvhwdlg4338l6rlg9hh5y9rrq5-activate.drv15 /nix/store/xnrfmhz9s7ffdbsl3sp92lvmxi8q8j84-nixos-system-server-test.drv16 /nix/store/k0cwvq9ggs1yx2dwwijdhd1n4afazpx3-nixos-system-server-test.drv17 /nix/store/dl7bk9w4d0jwwzdgwrpbmgm2j17xh5g7-closure-info.drv18 /nix/store/k36mpsq6w4zzslr2q1mkap2z28z2la0f-run-nixos-vm.drv19 /nix/store/ghh8822m5wmjv3cqrskqzmxlc6z297y2-nixos-vm.drv20 /nix/store/510z4r8ra86dawlc4mr7kccgdvjg0gyg-nixos-test-driver-pgroonga.drv21 /nix/store/5j4i8607svgnw32wkzals5mmmb7qrcma-vm-test-run-pgroonga.drv22error: Cannot build '/nix/store/5j4i8607svgnw32wkzals5mmmb7qrcma-vm-test-run-pgroonga.drv'.23 Reason: builder failed with exit code 1.24 Output paths:25 /nix/store/jfvfr8fm5bsv3zvci5kp00n7j1rzh156-vm-test-run-pgroonga26 Last 25 log lines:27 > server # [ 7.996796] 9r9bbvwffi4lcql803lybnkwnblkh4j7-supabase-db-init[917]: PostgreSQL is ready28 > server # [ 7.998297] 9r9bbvwffi4lcql803lybnkwnblkh4j7-supabase-db-init[917]: Creating postgres role...29 > server # [ 8.019315] postgres[923]: ::1 2026-10-07 20:45:03.044 UTC [923] supabase_admin@postgres FATAL: supautils.extensions_parameter_overrides: invalid json30 > server # [ 8.020932] 9r9bbvwffi4lcql803lybnkwnblkh4j7-supabase-db-init[922]: psql: error: connection to server at "localhost" (::1), port 5432 failed: FATAL: supautils.extensions_parameter_overrides: invalid json31 > server # [ 8.039877] postgres[925]: ::1 2026-10-07 20:45:03.065 UTC [925] supabase_admin@postgres FATAL: supautils.extensions_parameter_overrides: invalid json32 > server # [ 8.041210] 9r9bbvwffi4lcql803lybnkwnblkh4j7-supabase-db-init[924]: psql: error: connection to server at "localhost" (::1), port 5432 failed: FATAL: supautils.extensions_parameter_overrides: invalid json33 > server # [ 8.045791] 9r9bbvwffi4lcql803lybnkwnblkh4j7-supabase-db-init[917]: Running init-script: /nix/store/nw0bs8nddlaf6wh127acj2xwsdq5p7qz-migrations-db/init-scripts/00000000000000-initial-schema.sql34 > server # [ 8.060412] postgres[927]: ::1 2026-10-07 20:45:03.085 UTC [927] postgres@postgres FATAL: role "postgres" does not exist35 > server # [ 8.061686] 9r9bbvwffi4lcql803lybnkwnblkh4j7-supabase-db-init[926]: psql: error: connection to server at "localhost" (::1), port 5432 failed: FATAL: role "postgres" does not exist36 > server # [ 8.066081] systemd[1]: supabase-db-init.service: Main process exited, code=exited, status=2/INVALIDARGUMENT37 > server # [ 8.067390] systemd[1]: supabase-db-init.service: Failed with result 'exit-code'.38 > server # [ 8.068474] systemd[1]: Failed to start Supabase Database Initialization.39 > server # [ 8.069451] systemd[1]: supabase-db-init.service: Consumed 29ms CPU time, 2.8M memory peak, 2K incoming IP traffic, 2.1K outgoing IP traffic.40 > !!! Traceback (most recent call last):41 > !!! File "<string>", line 280, in <module>42 > !!! server.wait_for_unit("supabase-db-init.service")43 > !!! 44 > !!! RequestedAssertionFailed: unit "supabase-db-init.service" reached state "failed"45 > cleanup46 > kill machine (pid 9)47 > qemu-system-x86_64: terminating on signal 15 from pid 6 (/nix/store/qzc04a3npl70cyyy6flnnrb2ig3kayxm-python3-3.13.11/bin/python3.13)48 > vde_switch: EOF data port: Interrupted system call49 > kill vlan (pid 7)50 > (finished: cleanup, in 0.01 seconds)51 > vde_switch: Caught signal 15, cleaning up and exiting52 For full logs, run:53 nix log /nix/store/5j4i8607svgnw32wkzals5mmmb7qrcma-vm-test-run-pgroonga.drv