setup
checks.x86_64-linux.ext-pg_repack
· build #165
· raw
1these 19 derivations will be built:2 /nix/store/5i6v7gb3zqnlyy0bnzcshy15bggd828l-unit-postgresql-migrate.service.drv3 /nix/store/bcs5l2a7pjic1i8ahn0q1cwbg4hikmq0-system-units.drv4 /nix/store/43ak93smcywi75dwpb0q6ad19s7w6576-etc.drv5 /nix/store/k8y74788d8cmm1ffp98finq4kwbzwjp8-activate.drv6 /nix/store/3a1c94mvg19hc43aymxncmdsfb64mwkb-nixos-system-server-test.drv7 /nix/store/kipkmrxg0a5zm7h85iac5nm2vxhs3dfi-processed-postgresql-config-orioledb-17.drv8 /nix/store/diw0h1alax5qfyx3nz8p1kn4fv4smdx9-postgresql-orioledb-init.drv9 /nix/store/ryw90cx20ymb8cy4zfdffqshsc9ksfbf-unit-postgresql.service.drv10 /nix/store/c4zg70givzdhkid79l3ilzwqp2j9zi6h-system-units.drv11 /nix/store/69mscvz64y4af9kkn0zi0m6nbwwapkbi-etc.drv12 /nix/store/910y5k61jwyjzax4sf1j1jy75mdyvlq5-activate.drv13 /nix/store/jr61sbjfjn5k0ch3rqkrh88a792g3d5v-nixos-system-server-test.drv14 /nix/store/ymydadw392v10zvp5l99d0bgzn0gmjgl-activate.drv15 /nix/store/lx7ipx7m8swy4251xglhk45akds1ppxg-nixos-system-server-test.drv16 /nix/store/jj39pjsi451zx31nris29951657l5afn-closure-info.drv17 /nix/store/gc93midqkf8jqkqs6pjb9cn9s2756s4k-run-nixos-vm.drv18 /nix/store/70mxy4gcdknmjvkyv8dzzh1alrpqxsv9-nixos-vm.drv19 /nix/store/b6aw4q4rl0gm82cd752945wx1khm378p-nixos-test-driver-pg_repack.drv20 /nix/store/kyqfaa09adb4d6in2cszl7xgxzh08znk-vm-test-run-pg_repack.drv21error: Cannot build '/nix/store/kyqfaa09adb4d6in2cszl7xgxzh08znk-vm-test-run-pg_repack.drv'.22 Reason: builder failed with exit code 1.23 Output paths:24 /nix/store/vfyqh49zv45yq1cczqrsgmbqi751rf6n-vm-test-run-pg_repack25 Last 25 log lines:26 > server # [ 10.978745] postgres[925]: ::1 2026-10-07 20:43:47.491 UTC [925] root@root FATAL: role "root" does not exist27 > server # [ 10.982748] 9r9bbvwffi4lcql803lybnkwnblkh4j7-supabase-db-init[922]: PostgreSQL is ready28 > server # [ 10.984202] 9r9bbvwffi4lcql803lybnkwnblkh4j7-supabase-db-init[922]: Creating postgres role...29 > server # [ 11.007245] postgres[927]: ::1 2026-10-07 20:43:47.519 UTC [927] supabase_admin@postgres FATAL: supautils.extensions_parameter_overrides: invalid json30 > server # [ 11.009494] 9r9bbvwffi4lcql803lybnkwnblkh4j7-supabase-db-init[926]: psql: error: connection to server at "localhost" (::1), port 5432 failed: FATAL: supautils.extensions_parameter_overrides: invalid json31 > server # [ 11.024852] postgres[929]: ::1 2026-10-07 20:43:47.537 UTC [929] supabase_admin@postgres FATAL: supautils.extensions_parameter_overrides: invalid json32 > server # [ 11.027232] 9r9bbvwffi4lcql803lybnkwnblkh4j7-supabase-db-init[928]: psql: error: connection to server at "localhost" (::1), port 5432 failed: FATAL: supautils.extensions_parameter_overrides: invalid json33 > server # [ 11.030652] 9r9bbvwffi4lcql803lybnkwnblkh4j7-supabase-db-init[922]: Running init-script: /nix/store/nw0bs8nddlaf6wh127acj2xwsdq5p7qz-migrations-db/init-scripts/00000000000000-initial-schema.sql34 > server # [ 11.043092] postgres[931]: ::1 2026-10-07 20:43:47.555 UTC [931] postgres@postgres FATAL: role "postgres" does not exist35 > server # [ 11.044936] 9r9bbvwffi4lcql803lybnkwnblkh4j7-supabase-db-init[930]: psql: error: connection to server at "localhost" (::1), port 5432 failed: FATAL: role "postgres" does not exist36 > server # [ 11.048533] systemd[1]: supabase-db-init.service: Main process exited, code=exited, status=2/INVALIDARGUMENT37 > server # [ 11.050073] systemd[1]: supabase-db-init.service: Failed with result 'exit-code'.38 > server # [ 11.052668] systemd[1]: Failed to start Supabase Database Initialization.39 > server # [ 11.053740] systemd[1]: supabase-db-init.service: Consumed 31ms CPU time, 2.9M memory peak, 1.9K incoming IP traffic, 2.2K outgoing IP traffic.40 > !!! Traceback (most recent call last):41 > !!! File "<string>", line 280, in <module>42 > !!! server.wait_for_unit("supabase-db-init.service")43 > !!! 44 > !!! RequestedAssertionFailed: unit "supabase-db-init.service" reached state "failed"45 > cleanup46 > kill machine (pid 9)47 > qemu-system-x86_64: terminating on signal 15 from pid 6 (/nix/store/qzc04a3npl70cyyy6flnnrb2ig3kayxm-python3-3.13.11/bin/python3.13)48 > kill vlan (pid 7)49 > vde_switch: (finished: cleanup, in 0.01 seconds)50 > Caught signal 15, cleaning up and exiting51 For full logs, run:52 nix log /nix/store/kyqfaa09adb4d6in2cszl7xgxzh08znk-vm-test-run-pg_repack.drv