setup
checks.x86_64-linux.ext-orioledb
· build #165
· raw
1these 14 derivations will be built:2 /nix/store/kipkmrxg0a5zm7h85iac5nm2vxhs3dfi-processed-postgresql-config-orioledb-17.drv3 /nix/store/diw0h1alax5qfyx3nz8p1kn4fv4smdx9-postgresql-orioledb-init.drv4 /nix/store/ryw90cx20ymb8cy4zfdffqshsc9ksfbf-unit-postgresql.service.drv5 /nix/store/c4zg70givzdhkid79l3ilzwqp2j9zi6h-system-units.drv6 /nix/store/69mscvz64y4af9kkn0zi0m6nbwwapkbi-etc.drv7 /nix/store/910y5k61jwyjzax4sf1j1jy75mdyvlq5-activate.drv8 /nix/store/jr61sbjfjn5k0ch3rqkrh88a792g3d5v-nixos-system-server-test.drv9 /nix/store/ymydadw392v10zvp5l99d0bgzn0gmjgl-activate.drv10 /nix/store/9rac5413964y8f02qb5kai15wv5az08n-nixos-system-server-test.drv11 /nix/store/8z5pasligjbg8bkc0lmzqb148d2z88zl-closure-info.drv12 /nix/store/71hyph5npbqzf3vwm0dwgrs8k3920g9z-run-nixos-vm.drv13 /nix/store/awb5jp8x1lda4kcbkml0q875h6xhadcb-nixos-vm.drv14 /nix/store/yrqdbn272za8b152iv7xppkvisa0bf53-nixos-test-driver-orioledb.drv15 /nix/store/jzxs49i57sl3zyf8i64w0g0cmwkkxa92-vm-test-run-orioledb.drv16error: Cannot build '/nix/store/jzxs49i57sl3zyf8i64w0g0cmwkkxa92-vm-test-run-orioledb.drv'.17 Reason: builder failed with exit code 1.18 Output paths:19 /nix/store/f0x7zxz465m2crxh1zmg7kw1832a7k6v-vm-test-run-orioledb20 Last 25 log lines:21 > server # [ 10.746692] 9r9bbvwffi4lcql803lybnkwnblkh4j7-supabase-db-init[917]: PostgreSQL is ready22 > server # [ 10.747477] 9r9bbvwffi4lcql803lybnkwnblkh4j7-supabase-db-init[917]: Creating postgres role...23 > server # [ 10.769438] postgres[923]: ::1 2026-10-07 20:43:48.942 UTC [923] supabase_admin@postgres FATAL: supautils.extensions_parameter_overrides: invalid json24 > server # [ 10.771815] 9r9bbvwffi4lcql803lybnkwnblkh4j7-supabase-db-init[922]: psql: error: connection to server at "localhost" (::1), port 5432 failed: FATAL: supautils.extensions_parameter_overrides: invalid json25 > server # [ 10.789193] postgres[925]: ::1 2026-10-07 20:43:48.962 UTC [925] supabase_admin@postgres FATAL: supautils.extensions_parameter_overrides: invalid json26 > server # [ 10.789910] 9r9bbvwffi4lcql803lybnkwnblkh4j7-supabase-db-init[924]: psql: error: connection to server at "localhost" (::1), port 5432 failed: FATAL: supautils.extensions_parameter_overrides: invalid json27 > server # [ 10.796177] 9r9bbvwffi4lcql803lybnkwnblkh4j7-supabase-db-init[917]: Running init-script: /nix/store/nw0bs8nddlaf6wh127acj2xwsdq5p7qz-migrations-db/init-scripts/00000000000000-initial-schema.sql28 > server # [ 10.808964] postgres[927]: ::1 2026-10-07 20:43:48.982 UTC [927] postgres@postgres FATAL: role "postgres" does not exist29 > server # [ 10.810671] 9r9bbvwffi4lcql803lybnkwnblkh4j7-supabase-db-init[926]: psql: error: connection to server at "localhost" (::1), port 5432 failed: FATAL: role "postgres" does not exist30 > server # [ 10.813651] systemd[1]: supabase-db-init.service: Main process exited, code=exited, status=2/INVALIDARGUMENT31 > server # [ 10.815037] systemd[1]: supabase-db-init.service: Failed with result 'exit-code'.32 > server # [ 10.816330] systemd[1]: Failed to start Supabase Database Initialization.33 > server # [ 10.817414] systemd[1]: supabase-db-init.service: Consumed 31ms CPU time, 3M memory peak, 2K incoming IP traffic, 2.1K outgoing IP traffic.34 > !!! Traceback (most recent call last):35 > !!! File "<string>", line 6, in <module>36 > !!! server.wait_for_unit("supabase-db-init.service")37 > !!! 38 > !!! RequestedAssertionFailed: unit "supabase-db-init.service" reached state "failed"39 > cleanup40 > kill machine (pid 9)41 > qemu-system-x86_64: terminating on signal 15 from pid 6 (/nix/store/qzc04a3npl70cyyy6flnnrb2ig3kayxm-python3-3.13.11/bin/python3.13)42 > vde_switch: EOF data port: Interrupted system call43 > kill vlan (pid 7)44 > (finished: cleanup, in 0.01 seconds)45 > vde_switch: Caught signal 15, cleaning up and exiting46 For full logs, run:47 nix log /nix/store/jzxs49i57sl3zyf8i64w0g0cmwkkxa92-vm-test-run-orioledb.drv