setup
checks.aarch64-linux.psql_17
· build #165
· raw
1these 3 derivations will be built:2 /nix/store/krrrzqs1gg0f6z9xnpvgc4z19iin9ayj-start-postgres-server-test.drv3 /nix/store/kyw53l62zjm79h3n4850wrq5shnfnv9n-postgres-17-check-harness.drv4 /nix/store/rikpfrkxlibfhga1n70z80g3px4h01py-run-check-harness-psql-17.drv5error: build of '/nix/store/rikpfrkxlibfhga1n70z80g3px4h01py-run-check-harness-psql-17.drv' on 'ssh-ng://nixbot-remote-build@78.232.36.247' failed: Cannot build '/nix/store/rikpfrkxlibfhga1n70z80g3px4h01py-run-check-harness-psql-17.drv'.6 Reason: builder failed with exit code 1.7 Output paths:8 /nix/store/nw3mws8acnp9xzi4sapjvndc0ghs7daj-run-check-harness-psql-179 Last 25 log lines:10 > PostgreSQL is running in daemon mode. Please stop it using pg_ctl.11 > Running /nix/store/645zyjykc9v36vi2w9zrw1ah4cnrsnq1-migrations/migrations/20260730000000_revoke_trigger_on_cron_tables_from_postgres.sql12 > psql: error: connection to server at "localhost" (127.0.0.1), port 5535 failed: FATAL: supautils.extensions_parameter_overrides: invalid json13 > PostgreSQL is running in daemon mode. Please stop it using pg_ctl.14 > Running /nix/store/645zyjykc9v36vi2w9zrw1ah4cnrsnq1-migrations/migrations/20260923021047_update_pgrst_watch_triggers.sql15 > psql: error: connection to server at "localhost" (127.0.0.1), port 5535 failed: FATAL: supautils.extensions_parameter_overrides: invalid json16 > PostgreSQL is running in daemon mode. Please stop it using pg_ctl.17 > psql: error: connection to server at "localhost" (127.0.0.1), port 5535 failed: FATAL: supautils.extensions_parameter_overrides: invalid json18 > PostgreSQL is running in daemon mode. Please stop it using pg_ctl.19 > Shutting down PostgreSQL...20 > PostgreSQL is running in daemon mode. Please stop it using pg_ctl.21 > pg_ctl: another server might be running; trying to start server anyway22 > waiting for server to start.... stopped waiting23 > pg_ctl: could not start server24 > Examine the log output.25 > pg_ctl: server is running (PID: 1947)26 > /nix/store/7163dilndmkcwa2acnrg76ds0972zy0b-postgresql-and-plugins-17.11/bin/postgres "-D" "/build/tmp.pGbYdcYM9x" "--config-file=/build/tmp.pGbYdcYM9x/postgresql.conf" "-p" "5535" "-k" "/build/tmp.pGbYdcYM9x/tmp"27 > $ pg_isready -h localhost -p 5535 -U supabase_admin -q28 > 2026-10-07 20:42:42 [INFO] PostgreSQL is ready29 > 2026-10-07 20:42:42 [INFO] Loading prime SQL file (full extension set)30 > $ psql -p 5535 -h localhost --no-password --username=supabase_admin -d postgres -v ON_ERROR_STOP=1 -Xf /nix/store/ij5car617qxa8s7zv27zlhn6gxdnqrlj-prime.sql31 > psql: error: connection to server at "localhost" (127.0.0.1), port 5535 failed: FATAL: supautils.extensions_parameter_overrides: invalid json32 > 2026-10-07 20:42:42 [ERROR] Error executing SQL file33 > 2026-10-07 20:42:42 [ERROR] An error occurred. Exit code: 134 > 2026-10-07 20:42:42 [ERROR] Debug logs:35 For full logs, run:36 nix log /nix/store/rikpfrkxlibfhga1n70z80g3px4h01py-run-check-harness-psql-17.drv37error: Cannot build '/nix/store/rikpfrkxlibfhga1n70z80g3px4h01py-run-check-harness-psql-17.drv'.38 Reason: builder failed with exit code 1.39 Output paths:40 /nix/store/nw3mws8acnp9xzi4sapjvndc0ghs7daj-run-check-harness-psql-17