setup
checks.aarch64-linux.psql_15_slim
· build #165
· raw
1these 3 derivations will be built:2 /nix/store/q39pwyhn34n4rnv7az3mc1by6zjz4jm7-start-postgres-server-test.drv3 /nix/store/vvzmqf2y8dv9qanj2icdray973a678az-postgres-15-check-harness.drv4 /nix/store/hqd576zfvhncp5aki1w0dzsgs3qsqzas-run-check-harness-psql-15-slim.drv5error: build of '/nix/store/hqd576zfvhncp5aki1w0dzsgs3qsqzas-run-check-harness-psql-15-slim.drv' on 'ssh-ng://nixbot-remote-build@78.232.36.247' failed: Cannot build '/nix/store/hqd576zfvhncp5aki1w0dzsgs3qsqzas-run-check-harness-psql-15-slim.drv'.6 Reason: builder failed with exit code 1.7 Output paths:8 /nix/store/vkar7k21md3m807c20gdx418rwjifywj-run-check-harness-psql-15-slim9 Last 25 log lines:10 > PostgreSQL is running in daemon mode. Please stop it using pg_ctl.11 > Running /nix/store/645zyjykc9v36vi2w9zrw1ah4cnrsnq1-migrations/migrations/20260730000000_revoke_trigger_on_cron_tables_from_postgres.sql12 > psql: error: connection to server at "localhost" (127.0.0.1), port 5539 failed: FATAL: supautils.extensions_parameter_overrides: invalid json13 > PostgreSQL is running in daemon mode. Please stop it using pg_ctl.14 > Running /nix/store/645zyjykc9v36vi2w9zrw1ah4cnrsnq1-migrations/migrations/20260923021047_update_pgrst_watch_triggers.sql15 > psql: error: connection to server at "localhost" (127.0.0.1), port 5539 failed: FATAL: supautils.extensions_parameter_overrides: invalid json16 > PostgreSQL is running in daemon mode. Please stop it using pg_ctl.17 > psql: error: connection to server at "localhost" (127.0.0.1), port 5539 failed: FATAL: supautils.extensions_parameter_overrides: invalid json18 > PostgreSQL is running in daemon mode. Please stop it using pg_ctl.19 > Shutting down PostgreSQL...20 > PostgreSQL is running in daemon mode. Please stop it using pg_ctl.21 > pg_ctl: another server might be running; trying to start server anyway22 > waiting for server to start.... stopped waiting23 > pg_ctl: could not start server24 > Examine the log output.25 > pg_ctl: server is running (PID: 2096)26 > /nix/store/2bhdbvpk81xy3mkfgqrpc719ip588cba-postgresql-and-plugins-15.19/bin/postgres "-D" "/build/tmp.oiY9AULCkp" "--config-file=/build/tmp.oiY9AULCkp/postgresql.conf" "-p" "5539" "-k" "/build/tmp.oiY9AULCkp/tmp"27 > $ pg_isready -h localhost -p 5539 -U supabase_admin -q28 > 2026-10-07 20:43:12 [INFO] PostgreSQL is ready29 > 2026-10-07 20:43:12 [INFO] Loading prime SQL file (full extension set)30 > $ psql -p 5539 -h localhost --no-password --username=supabase_admin -d postgres -v ON_ERROR_STOP=1 -Xf /nix/store/ij5car617qxa8s7zv27zlhn6gxdnqrlj-prime.sql31 > psql: error: connection to server at "localhost" (127.0.0.1), port 5539 failed: FATAL: supautils.extensions_parameter_overrides: invalid json32 > 2026-10-07 20:43:12 [ERROR] Error executing SQL file33 > 2026-10-07 20:43:12 [ERROR] An error occurred. Exit code: 134 > 2026-10-07 20:43:12 [ERROR] Debug logs:35 For full logs, run:36 nix log /nix/store/hqd576zfvhncp5aki1w0dzsgs3qsqzas-run-check-harness-psql-15-slim.drv37error: Cannot build '/nix/store/hqd576zfvhncp5aki1w0dzsgs3qsqzas-run-check-harness-psql-15-slim.drv'.38 Reason: builder failed with exit code 1.39 Output paths:40 /nix/store/vkar7k21md3m807c20gdx418rwjifywj-run-check-harness-psql-15-slim