setup
checks.aarch64-linux.ext-plv8
· build #165
· raw
1these 12 derivations will be built:2 /nix/store/yccnpvyvafyd7nfsfalw9d294k45pzgx-processed-postgresql-config-15.drv3 /nix/store/razs1w4qax2i9h75lsrfa1anyxd2y68h-postgresql-init.drv4 /nix/store/7kc2g9a5ffd8j525asbsvnciki65wjwn-unit-postgresql.service.drv5 /nix/store/hnfrrq54c7dqsbav19pjillh5kwpzcif-system-units.drv6 /nix/store/9jj7w77w5jvy2fsqdbm2q2aizi2zd0z4-etc.drv7 /nix/store/zz2sv7wfsy7n7y8as57pa9q2hhx14b60-activate.drv8 /nix/store/fcrblrv007hgb8xwy690fch1y006bfds-nixos-system-server-test.drv9 /nix/store/jxwavcn5lcy3jaql8j254krnna31jd1s-closure-info.drv10 /nix/store/yizbfiy09rlj1l5z4iq6fnizkmjv9kj3-run-nixos-vm.drv11 /nix/store/vlg59dvlhg2zdqr9pvd547hsalqzk0y2-nixos-vm.drv12 /nix/store/bxbrq91fn9w3ggwah712s7bayp8gll1x-nixos-test-driver-plv8.drv13 /nix/store/d50np7q85rmakxg1ada9ybj7hv468w7s-vm-test-run-plv8.drv14error: build of '/nix/store/d50np7q85rmakxg1ada9ybj7hv468w7s-vm-test-run-plv8.drv' on 'ssh-ng://builder@mac-linux-builder' failed: Cannot build '/nix/store/d50np7q85rmakxg1ada9ybj7hv468w7s-vm-test-run-plv8.drv'.15 Reason: builder failed with exit code 1.16 Output paths:17 /nix/store/r1sv5h1xyr8cay2m09hli19jdqczpicy-vm-test-run-plv818 Last 25 log lines:19 > server # [ 122.769357] postgres[1497]: ::1 2026-10-07 20:44:12.347 UTC [1497] supabase_admin@postgres FATAL: supautils.extensions_parameter_overrides: invalid json20 > server # [ 122.784755] z8w0zyjml4ky3aw4mdlmwdwjsyk9dyr0-supabase-db-init[1496]: psql: error: connection to server at "localhost" (::1), port 5432 failed: FATAL: supautils.extensions_parameter_overrides: invalid json21 > server # [ 122.802121] z8w0zyjml4ky3aw4mdlmwdwjsyk9dyr0-supabase-db-init[1464]: Running init-script: /nix/store/nw0bs8nddlaf6wh127acj2xwsdq5p7qz-migrations-db/init-scripts/00000000000000-initial-schema.sql22 > server # [ 122.945453] postgres[1499]: ::1 2026-10-07 20:44:12.523 UTC [1499] postgres@postgres FATAL: role "postgres" does not exist23 > server # [ 122.977330] z8w0zyjml4ky3aw4mdlmwdwjsyk9dyr0-supabase-db-init[1498]: psql: error: connection to server at "localhost" (::1), port 5432 failed: FATAL: role "postgres" does not exist24 > server # [ 122.987289] systemd[1]: supabase-db-init.service: Main process exited, code=exited, status=2/INVALIDARGUMENT25 > server # [ 122.989148] systemd[1]: supabase-db-init.service: Failed with result 'exit-code'.26 > server # [ 123.004492] systemd[1]: Failed to start Supabase Database Initialization.27 > server # [ 123.006000] systemd[1]: supabase-db-init.service: Consumed 666ms CPU time, 2.7M memory peak, 2K incoming IP traffic, 2.1K outgoing IP traffic.28 > server # [ 123.013795] systemd[1]: Reached target Multi-User System.29 > server # [ 123.021802] systemd[1]: Startup finished in 16.830s (kernel) + 1min 46.186s (userspace) = 2min 3.016s.30 > server # [ 123.294348] postgres[1501]: 2026-10-07 20:44:12.866 UTC [1501] FATAL: role "postgres" does not exist31 > server # [ 123.332736] postgres[1417]: 2026-10-07 20:44:12.908 UTC [1417] LOG: background worker "pg_net 0.20.4 worker" (PID 1501) exited with exit code 132 > !!! Traceback (most recent call last):33 > !!! File "<string>", line 276, in <module>34 > !!! server.wait_for_unit("supabase-db-init.service")35 > !!! 36 > !!! RequestedAssertionFailed: unit "supabase-db-init.service" reached state "failed"37 > cleanup38 > kill machine (pid 9)39 > qemu-system-aarch64: terminating on signal 15 from pid 6 (/nix/store/y88crn50yx35fiiwcjx6xqwi6ahk7mlq-python3-3.13.11/bin/python3.13)40 > vde_switch: EOF data port: Interrupted system call41 > kill vlan (pid 7)42 > vde_switch: Caught signal 15, cleaning up and exiting43 > (finished: cleanup, in 0.01 seconds)44 For full logs, run:45 nix-store -l /nix/store/d50np7q85rmakxg1ada9ybj7hv468w7s-vm-test-run-plv8.drv46error: Cannot build '/nix/store/d50np7q85rmakxg1ada9ybj7hv468w7s-vm-test-run-plv8.drv'.47 Reason: builder failed with exit code 1.48 Output paths:49 /nix/store/r1sv5h1xyr8cay2m09hli19jdqczpicy-vm-test-run-plv8