setup
checks.aarch64-linux.ext-pgjwt
· build #165
· raw
1these 11 derivations will be built:2 /nix/store/6wixafmfn4nwc2kfyqqsapf41nlz04a9-system-units.drv3 /nix/store/zq19slnllbwbvzkwpdrlsydl3hg7iw8a-etc.drv4 /nix/store/x8nm4dc1sjpbsri9fr91abp7ppfmkj6k-activate.drv5 /nix/store/jgfkpddr3k33w06hgq5sj869z5a2r70z-nixos-system-server-test.drv6 /nix/store/q4qfq5k4ldx130ybawm2qq16c8jlv05r-nixos-system-server-test.drv7 /nix/store/wrbxv0xzpcgajcq01qmggsl77cx07vwd-nixos-system-server-test.drv8 /nix/store/5sgg6skdqa8sqskdckkb0z6mr3lkqhjb-closure-info.drv9 /nix/store/0kiklz8x5kvgrxfrkbkicrjxhjz4jgyd-run-nixos-vm.drv10 /nix/store/4p0ibn7jp1rcb2jqgq997gpm0gk21bzd-nixos-vm.drv11 /nix/store/9d1nagixfn02k7f5yp1van7rfw9h7fma-nixos-test-driver-pgjwt.drv12 /nix/store/x0g2rb8bxls9b04cfd3m6vn10bs6afxr-vm-test-run-pgjwt.drv13error: build of '/nix/store/x0g2rb8bxls9b04cfd3m6vn10bs6afxr-vm-test-run-pgjwt.drv' on 'ssh-ng://builder@mac-linux-builder' failed: Cannot build '/nix/store/x0g2rb8bxls9b04cfd3m6vn10bs6afxr-vm-test-run-pgjwt.drv'.14 Reason: builder failed with exit code 1.15 Output paths:16 /nix/store/zfj92yvkvf8yzvmhygm9viwiw14w27h1-vm-test-run-pgjwt17 Last 25 log lines:18 > server # [ 122.962897] postgres[1490]: ::1 2026-10-07 20:50:30.352 UTC [1490] supabase_admin@postgres FATAL: supautils.extensions_parameter_overrides: invalid json19 > server # [ 122.978938] z8w0zyjml4ky3aw4mdlmwdwjsyk9dyr0-supabase-db-init[1489]: psql: error: connection to server at "localhost" (::1), port 5432 failed: FATAL: supautils.extensions_parameter_overrides: invalid json20 > server # [ 122.987495] z8w0zyjml4ky3aw4mdlmwdwjsyk9dyr0-supabase-db-init[1480]: Running init-script: /nix/store/nw0bs8nddlaf6wh127acj2xwsdq5p7qz-migrations-db/init-scripts/00000000000000-initial-schema.sql21 > server # [ 123.258236] postgres[1498]: ::1 2026-10-07 20:50:30.673 UTC [1498] postgres@postgres FATAL: role "postgres" does not exist22 > server # [ 123.303095] z8w0zyjml4ky3aw4mdlmwdwjsyk9dyr0-supabase-db-init[1491]: psql: error: connection to server at "localhost" (::1), port 5432 failed: FATAL: role "postgres" does not exist23 > server # [ 123.355756] systemd[1]: supabase-db-init.service: Main process exited, code=exited, status=2/INVALIDARGUMENT24 > server # [ 123.359511] systemd[1]: supabase-db-init.service: Failed with result 'exit-code'.25 > server # [ 123.373655] systemd[1]: Failed to start Supabase Database Initialization.26 > server # [ 123.391426] systemd[1]: supabase-db-init.service: Consumed 584ms CPU time, 2.8M memory peak, 2K incoming IP traffic, 2K outgoing IP traffic.27 > server # [ 123.404102] systemd[1]: Reached target Multi-User System.28 > server # [ 123.408224] systemd[1]: Startup finished in 17.655s (kernel) + 1min 45.747s (userspace) = 2min 3.403s.29 > server # [ 123.746642] postgres[1508]: 2026-10-07 20:50:31.141 UTC [1508] FATAL: role "postgres" does not exist30 > server # [ 123.788521] postgres[1423]: 2026-10-07 20:50:31.195 UTC [1423] LOG: background worker "pg_net 0.20.4 worker" (PID 1508) exited with exit code 131 > !!! Traceback (most recent call last):32 > !!! File "<string>", line 280, in <module>33 > !!! server.wait_for_unit("supabase-db-init.service")34 > !!! 35 > !!! RequestedAssertionFailed: unit "supabase-db-init.service" reached state "failed"36 > cleanup37 > kill machine (pid 9)38 > qemu-system-aarch64: terminating on signal 15 from pid 6 (/nix/store/y88crn50yx35fiiwcjx6xqwi6ahk7mlq-python3-3.13.11/bin/python3.13)39 > vde_switch: EOF data port: Interrupted system call40 > kill vlan (pid 7)41 > (finished: cleanup, in 0.01 seconds)42 > vde_switch: Caught signal 15, cleaning up and exiting43 For full logs, run:44 nix-store -l /nix/store/x0g2rb8bxls9b04cfd3m6vn10bs6afxr-vm-test-run-pgjwt.drv45error: Cannot build '/nix/store/x0g2rb8bxls9b04cfd3m6vn10bs6afxr-vm-test-run-pgjwt.drv'.46 Reason: builder failed with exit code 1.47 Output paths:48 /nix/store/zfj92yvkvf8yzvmhygm9viwiw14w27h1-vm-test-run-pgjwt