setup
checks.aarch64-linux.ext-orioledb
· build #165
· raw
1these 16 derivations will be built:2 /nix/store/hnfrrq54c7dqsbav19pjillh5kwpzcif-system-units.drv3 /nix/store/9jj7w77w5jvy2fsqdbm2q2aizi2zd0z4-etc.drv4 /nix/store/ydrissbm9aq0l41aydvz55p2x5x4q547-processed-postgresql-config-orioledb-17.drv5 /nix/store/dwi8r5k84hy2hx5yflpg5y3sr1jj2gfz-postgresql-orioledb-init.drv6 /nix/store/fkbrjv701smvhb1kln8h0id7vwqyglk1-unit-postgresql.service.drv7 /nix/store/k9jvv9y1p0zrrwdhg0di3r5hiqxh6fam-system-units.drv8 /nix/store/f5camaqr09yww61lwlwaixhicc52l7zj-etc.drv9 /nix/store/k9dv2yfiw90wrm0pb8f9cxmbvk90mm8m-activate.drv10 /nix/store/q4qfq5k4ldx130ybawm2qq16c8jlv05r-nixos-system-server-test.drv11 /nix/store/zz2sv7wfsy7n7y8as57pa9q2hhx14b60-activate.drv12 /nix/store/cqil8ccfaxydhq7hw8yr294kcnh8pn14-nixos-system-server-test.drv13 /nix/store/lc799wwy2m4vhlwxs5wwm70zy6h98q4j-closure-info.drv14 /nix/store/52hh49l85213dmwmslvl3d8qwgcsxxqn-run-nixos-vm.drv15 /nix/store/8c7jabxmgrdqyf8bmp3bj0xl0ixy93g2-nixos-vm.drv16 /nix/store/62z73f39yr60mrm10idmxk2j4gr87cqr-nixos-test-driver-orioledb.drv17 /nix/store/amznq7j38nyx35bkyig9v0j61qvlc5lf-vm-test-run-orioledb.drv18error: build of '/nix/store/amznq7j38nyx35bkyig9v0j61qvlc5lf-vm-test-run-orioledb.drv' on 'ssh-ng://builder@mac-linux-builder' failed: Cannot build '/nix/store/amznq7j38nyx35bkyig9v0j61qvlc5lf-vm-test-run-orioledb.drv'.19 Reason: builder failed with exit code 1.20 Output paths:21 /nix/store/vqrncs9713qw862k751jk54wj94fzzv0-vm-test-run-orioledb22 Last 25 log lines:23 > server # [ 125.477775] postgres[1533]: ::1 2026-10-07 20:46:14.961 UTC [1533] supabase_admin@postgres FATAL: supautils.extensions_parameter_overrides: invalid json24 > server # [ 125.500248] z8w0zyjml4ky3aw4mdlmwdwjsyk9dyr0-supabase-db-init[1526]: psql: error: connection to server at "localhost" (::1), port 5432 failed: FATAL: supautils.extensions_parameter_overrides: invalid json25 > server # [ 125.555262] z8w0zyjml4ky3aw4mdlmwdwjsyk9dyr0-supabase-db-init[1509]: Running init-script: /nix/store/nw0bs8nddlaf6wh127acj2xwsdq5p7qz-migrations-db/init-scripts/00000000000000-initial-schema.sql26 > server # [ 125.742507] postgres[1539]: 2026-10-07 20:46:15.235 UTC [1539] FATAL: role "postgres" does not exist27 > server # [ 125.814440] postgres[1465]: 2026-10-07 20:46:15.317 UTC [1465] LOG: background worker "pg_net 0.20.4 worker" (PID 1539) exited with exit code 128 > server # [ 125.897629] postgres[1542]: ::1 2026-10-07 20:46:15.391 UTC [1542] postgres@postgres FATAL: role "postgres" does not exist29 > server # [ 125.920281] z8w0zyjml4ky3aw4mdlmwdwjsyk9dyr0-supabase-db-init[1535]: psql: error: connection to server at "localhost" (::1), port 5432 failed: FATAL: role "postgres" does not exist30 > server # [ 126.002648] systemd[1]: supabase-db-init.service: Main process exited, code=exited, status=2/INVALIDARGUMENT31 > server # [ 126.036784] systemd[1]: supabase-db-init.service: Failed with result 'exit-code'.32 > server # [ 126.037964] systemd[1]: Failed to start Supabase Database Initialization.33 > server # [ 126.042129] systemd[1]: supabase-db-init.service: Consumed 780ms CPU time, 2.7M memory peak, 2K incoming IP traffic, 2.1K outgoing IP traffic.34 > server # [ 126.046413] systemd[1]: Reached target Multi-User System.35 > server # [ 126.048029] systemd[1]: Startup finished in 18.351s (kernel) + 1min 47.671s (userspace) = 2min 6.022s.36 > !!! Traceback (most recent call last):37 > !!! File "<string>", line 6, in <module>38 > !!! server.wait_for_unit("supabase-db-init.service")39 > !!! 40 > !!! RequestedAssertionFailed: unit "supabase-db-init.service" reached state "failed"41 > cleanup42 > kill machine (pid 9)43 > qemu-system-aarch64: terminating on signal 15 from pid 6 (/nix/store/y88crn50yx35fiiwcjx6xqwi6ahk7mlq-python3-3.13.11/bin/python3.13)44 > vde_switch: EOF data port: Interrupted system call45 > kill vlan (pid 7)46 > (finished: cleanup, in 0.01 seconds)47 > vde_switch: Caught signal 15, cleaning up and exiting48 For full logs, run:49 nix-store -l /nix/store/amznq7j38nyx35bkyig9v0j61qvlc5lf-vm-test-run-orioledb.drv50error: Cannot build '/nix/store/amznq7j38nyx35bkyig9v0j61qvlc5lf-vm-test-run-orioledb.drv'.51 Reason: builder failed with exit code 1.52 Output paths:53 /nix/store/vqrncs9713qw862k751jk54wj94fzzv0-vm-test-run-orioledb