nixbot

builds
1this derivation will be built:2 /nix/store/hjaawsw93wszskpa6j2w73gkb9pv03fq-run-check-harness-psql-17-slim.drv3these 2 paths will be fetched (23.2 KiB download, 91.8 KiB unpacked):4 /nix/store/374p25cbgib1n0y6rcrx30147k73mc4z-postgres-17-check-harness5 /nix/store/605rv2zcpvwypkwqf2qqh08b0amdyj5p-start-postgres-server-test6error: Cannot build '/nix/store/hjaawsw93wszskpa6j2w73gkb9pv03fq-run-check-harness-psql-17-slim.drv'.7 Reason: builder failed with exit code 1.8 Output paths:9 /nix/store/kiqb52klbpd9i10q0nnqvmidbxzc1a1j-run-check-harness-psql-17-slim10 Last 25 log lines:11 > test roles ... ok 15 ms12 > test security ... ok 12 ms13 > test storage ... ok 20 ms14 > test supautils_reserved_roles ... ok 9 ms15 > test supautils_restrict_versions ... ok 94 ms16 > test vault ... ok 28 ms17 > test wal2json ... ok 16 ms18 > test z_17_ext_interface ... FAILED 120 ms19 > test z_17_intarray_ltree_query ... ok 18 ms20 > test z_17_pg_stat_monitor ... ok 9 ms21 > test z_17_pgvector ... ok 13 ms22 > test z_17_roles ... ok 18 ms23 > test z_17_rum ... ok 19 ms24 >25 > =======================26 > 2 of 68 tests failed.27 > =======================28 >29 > The differences that caused some tests to fail can be viewed in the30 > file "/nix/store/kiqb52klbpd9i10q0nnqvmidbxzc1a1j-run-check-harness-psql-17-slim/regression_output/regression.diffs". A copy of the test summary that you see31 > above is saved in the file "/nix/store/kiqb52klbpd9i10q0nnqvmidbxzc1a1j-run-check-harness-psql-17-slim/regression_output/regression.out".32 >33 > 2026-10-07 19:30:53 [ERROR] pg_regress tests failed34 > 2026-10-07 19:30:53 [ERROR] An error occurred. Exit code: 135 > 2026-10-07 19:30:53 [ERROR] Debug logs:36 For full logs, run:37 nix log /nix/store/hjaawsw93wszskpa6j2w73gkb9pv03fq-run-check-harness-psql-17-slim.drv