nixbot

builds
1this derivation will be built:2 /nix/store/nml2254wh234kif0bi0gdbg5j51i1x4s-run-check-harness-psql-15.drv3these 2 paths will be fetched (23.2 KiB download, 92.0 KiB unpacked):4 /nix/store/6s41jl37rs2g2kdw8zsd6jfgkcxkk7km-postgres-15-check-harness5 /nix/store/48w3bahspw7nf2mqka5agzfk1lxn4afc-start-postgres-server-test6error: Cannot build '/nix/store/nml2254wh234kif0bi0gdbg5j51i1x4s-run-check-harness-psql-15.drv'.7 Reason: builder failed with exit code 1.8 Output paths:9 /nix/store/gl4i4yvfawa1ds8wa0cljph7pdfjngwv-run-check-harness-psql-1510 Last 25 log lines:11 > test supautils_restrict_versions ... ok 84 ms12 > test vault ... ok 29 ms13 > test wal2json ... ok 15 ms14 > test z_15_ext_interface ... FAILED 639 ms15 > test z_15_intarray_ltree_query ... ok 11 ms16 > test z_15_pg_stat_monitor ... ok 12 ms17 > test z_15_pgjwt ... ok 19 ms18 > test z_15_pgvector ... ok 31 ms19 > test z_15_plv8 ... ok 53 ms20 > test z_15_roles ... ok 18 ms21 > test z_15_rum ... ok 18 ms22 > test z_15_timescale ... ok 24 ms23 > test z_15_unhype_timescale_to_partman ... ok 11463 ms24 >25 > =======================26 > 2 of 72 tests failed.27 > =======================28 >29 > The differences that caused some tests to fail can be viewed in the30 > file "/nix/store/gl4i4yvfawa1ds8wa0cljph7pdfjngwv-run-check-harness-psql-15/regression_output/regression.diffs". A copy of the test summary that you see31 > above is saved in the file "/nix/store/gl4i4yvfawa1ds8wa0cljph7pdfjngwv-run-check-harness-psql-15/regression_output/regression.out".32 >33 > 2026-10-07 19:31:24 [ERROR] pg_regress tests failed34 > 2026-10-07 19:31:24 [ERROR] An error occurred. Exit code: 135 > 2026-10-07 19:31:24 [ERROR] Debug logs:36 For full logs, run:37 nix log /nix/store/nml2254wh234kif0bi0gdbg5j51i1x4s-run-check-harness-psql-15.drv