nixbot

builds
1this derivation will be built:2 /nix/store/25zjpqd3vdb62l6qraqbfs6vfbs1nwia-run-check-harness-psql-17-slim.drv3error: Cannot build '/nix/store/25zjpqd3vdb62l6qraqbfs6vfbs1nwia-run-check-harness-psql-17-slim.drv'.4 Reason: builder failed with exit code 1.5 Output paths:6 /nix/store/kmnc2m54yjcqhwk0m5h2mbxw76yb9qn7-run-check-harness-psql-17-slim7 Last 25 log lines:8 > test roles ... ok 11 ms9 > test security ... ok 11 ms10 > test storage ... ok 17 ms11 > test supautils_reserved_roles ... ok 7 ms12 > test supautils_restrict_versions ... ok 79 ms13 > test vault ... ok 29 ms14 > test wal2json ... ok 13 ms15 > test z_17_ext_interface ... FAILED 110 ms16 > test z_17_intarray_ltree_query ... ok 14 ms17 > test z_17_pg_stat_monitor ... ok 8 ms18 > test z_17_pgvector ... ok 13 ms19 > test z_17_roles ... ok 15 ms20 > test z_17_rum ... ok 17 ms21 >22 > =======================23 > 2 of 68 tests failed.24 > =======================25 >26 > The differences that caused some tests to fail can be viewed in the27 > file "/nix/store/kmnc2m54yjcqhwk0m5h2mbxw76yb9qn7-run-check-harness-psql-17-slim/regression_output/regression.diffs". A copy of the test summary that you see28 > above is saved in the file "/nix/store/kmnc2m54yjcqhwk0m5h2mbxw76yb9qn7-run-check-harness-psql-17-slim/regression_output/regression.out".29 >30 > 2026-10-07 14:26:32 [ERROR] pg_regress tests failed31 > 2026-10-07 14:26:32 [ERROR] An error occurred. Exit code: 132 > 2026-10-07 14:26:32 [ERROR] Debug logs:33 For full logs, run:34 nix log /nix/store/25zjpqd3vdb62l6qraqbfs6vfbs1nwia-run-check-harness-psql-17-slim.drv