nixbot

builds
1these 3 derivations will be built:2 /nix/store/bk897dshryqrxikxhrz5bk5bjn0n64yq-start-postgres-server-test.drv3 /nix/store/ghjid54m90gsfi6ag69d3lyi2y2j98sl-postgres-orioledb-17-check-harness.drv4 /nix/store/dnqbv3nrd4cnnzjib9vgm0y65i7llf6w-run-check-harness-psql-orioledb-17.drv5error: Cannot build '/nix/store/dnqbv3nrd4cnnzjib9vgm0y65i7llf6w-run-check-harness-psql-orioledb-17.drv'.6 Reason: builder failed with exit code 1.7 Output paths:8 /nix/store/dwj9660f3d4lz8379ddkcdag17zya1ga-run-check-harness-psql-orioledb-179 Last 25 log lines:10 > test wal2json ... ok 19 ms11 > test z_orioledb-17_docs-cascades-deletes ... ok 88 ms12 > test z_orioledb-17_docs-full-text-search ... ok 33 ms13 > test z_orioledb-17_docs-functions ... ok 383 ms14 > test z_orioledb-17_docs-indexes ... ok 35 ms15 > test z_orioledb-17_docs-partitioning ... ok 41 ms16 > test z_orioledb-17_ext_interface ... FAILED 114 ms17 > test z_orioledb-17_extensions_schema ... ok 10 ms18 > test z_orioledb-17_intarray_ltree_query ... ok 9 ms19 > test z_orioledb-17_pg_stat_monitor ... ok 7 ms20 > test z_orioledb-17_pgroonga ... ok 57 ms21 > test z_orioledb-17_pgvector ... ok 19 ms22 > test z_orioledb-17_verify_orioledb ... ok 17 ms23 >24 > =======================25 > 2 of 65 tests failed.26 > =======================27 >28 > The differences that caused some tests to fail can be viewed in the29 > file "/nix/store/dwj9660f3d4lz8379ddkcdag17zya1ga-run-check-harness-psql-orioledb-17/regression_output/regression.diffs". A copy of the test summary that you see30 > above is saved in the file "/nix/store/dwj9660f3d4lz8379ddkcdag17zya1ga-run-check-harness-psql-orioledb-17/regression_output/regression.out".31 >32 > 2026-10-07 13:45:58 [ERROR] pg_regress tests failed33 > 2026-10-07 13:45:58 [ERROR] An error occurred. Exit code: 134 > 2026-10-07 13:45:58 [ERROR] Debug logs:35 For full logs, run:36 nix log /nix/store/dnqbv3nrd4cnnzjib9vgm0y65i7llf6w-run-check-harness-psql-orioledb-17.drv