nixbot

builds
1these 3 derivations will be built:2 /nix/store/gs3gc9cw86xpnb8zhyi4rcp30rkly5py-start-postgres-server-test.drv3 /nix/store/cxb4001nwnvi20whgbwc26qxxygjcfkm-postgres-15-check-harness.drv4 /nix/store/s2nrfkqcd26bi63lqc771swl9rxfszi1-run-check-harness-psql-15-slim.drv5error: Cannot build '/nix/store/s2nrfkqcd26bi63lqc771swl9rxfszi1-run-check-harness-psql-15-slim.drv'.6 Reason: builder failed with exit code 1.7 Output paths:8 /nix/store/hd717f8k2v83jkyjnwxqcdahszx72x3z-run-check-harness-psql-15-slim9 Last 25 log lines:10 > test supautils_restrict_versions ... ok 83 ms11 > test vault ... ok 29 ms12 > test wal2json ... ok 17 ms13 > test z_15_ext_interface ... FAILED 653 ms14 > test z_15_intarray_ltree_query ... ok 12 ms15 > test z_15_pg_stat_monitor ... ok 12 ms16 > test z_15_pgjwt ... ok 18 ms17 > test z_15_pgvector ... ok 38 ms18 > test z_15_plv8 ... ok 49 ms19 > test z_15_roles ... ok 17 ms20 > test z_15_rum ... ok 20 ms21 > test z_15_timescale ... ok 26 ms22 > test z_15_unhype_timescale_to_partman ... ok 11455 ms23 >24 > =======================25 > 2 of 72 tests failed.26 > =======================27 >28 > The differences that caused some tests to fail can be viewed in the29 > file "/nix/store/hd717f8k2v83jkyjnwxqcdahszx72x3z-run-check-harness-psql-15-slim/regression_output/regression.diffs". A copy of the test summary that you see30 > above is saved in the file "/nix/store/hd717f8k2v83jkyjnwxqcdahszx72x3z-run-check-harness-psql-15-slim/regression_output/regression.out".31 >32 > 2026-10-07 13:46:25 [ERROR] pg_regress tests failed33 > 2026-10-07 13:46:25 [ERROR] An error occurred. Exit code: 134 > 2026-10-07 13:46:25 [ERROR] Debug logs:35 For full logs, run:36 nix log /nix/store/s2nrfkqcd26bi63lqc771swl9rxfszi1-run-check-harness-psql-15-slim.drv