setup
checks.x86_64-linux.ext-timescaledb
· build #138
· raw
1these 6 derivations will be built:2 /nix/store/p5j4xqfvc5q6ngxqsxrm4x7dccb69275-nixos-system-server-test.drv3 /nix/store/30s9vmcn3cf5x5byr6sy6dikn1xj3r8h-closure-info.drv4 /nix/store/g99vl2b9xdkbh8sixgqpc1z621c2ib2j-run-nixos-vm.drv5 /nix/store/arhqfgiy97pwdjps44lkdwrhf6bvw5y9-nixos-vm.drv6 /nix/store/1l1gg3q0yrvlbkvb9ls0ypc4h916bsfx-nixos-test-driver-timescaledb.drv7 /nix/store/q7bn102d84zfxn3lkmz1pwc3l3fr718d-vm-test-run-timescaledb.drv8error: Cannot build '/nix/store/q7bn102d84zfxn3lkmz1pwc3l3fr718d-vm-test-run-timescaledb.drv'.9 Reason: builder failed with exit code 1.10 Output paths:11 /nix/store/2gbp2s4k5zpmnmzi40mij51i2xkr93r8-vm-test-run-timescaledb12 Last 25 log lines:13 > server # [ 10.127256] postgres[929]: ::1 2026-10-06 18:39:07.317 UTC [929] supabase_admin@postgres FATAL: could not access file "supautils": No such file or directory14 > server # [ 10.129528] 0dsnn2pgjpwifpwim9gq4qgfwf3cgrgh-supabase-db-init[928]: psql: error: connection to server at "localhost" (::1), port 5432 failed: FATAL: could not access file "supautils": No such file or directory15 > server # [ 10.150874] postgres[931]: ::1 2026-10-06 18:39:07.341 UTC [931] supabase_admin@postgres FATAL: could not access file "supautils": No such file or directory16 > server # [ 10.153151] 0dsnn2pgjpwifpwim9gq4qgfwf3cgrgh-supabase-db-init[930]: psql: error: connection to server at "localhost" (::1), port 5432 failed: FATAL: could not access file "supautils": No such file or directory17 > server # [ 10.159357] 0dsnn2pgjpwifpwim9gq4qgfwf3cgrgh-supabase-db-init[921]: Running init-script: /nix/store/nw0bs8nddlaf6wh127acj2xwsdq5p7qz-migrations-db/init-scripts/00000000000000-initial-schema.sql18 > server # [ 10.173900] postgres[933]: ::1 2026-10-06 18:39:07.364 UTC [933] postgres@postgres FATAL: role "postgres" does not exist19 > server # [ 10.175729] 0dsnn2pgjpwifpwim9gq4qgfwf3cgrgh-supabase-db-init[932]: psql: error: connection to server at "localhost" (::1), port 5432 failed: FATAL: role "postgres" does not exist20 > server # [ 10.183905] systemd[1]: supabase-db-init.service: Main process exited, code=exited, status=2/INVALIDARGUMENT21 > server # [ 10.185701] systemd[1]: supabase-db-init.service: Failed with result 'exit-code'.22 > server # [ 10.187108] systemd[1]: Failed to start Supabase Database Initialization.23 > server # [ 10.188354] systemd[1]: supabase-db-init.service: Consumed 33ms CPU time, 2.9M memory peak, 2.1K incoming IP traffic, 2K outgoing IP traffic.24 > server # [ 11.026299] postgres[936]: 2026-10-06 18:39:08.216 UTC [936] FATAL: role "postgres" does not exist25 > server # [ 11.029380] postgres[902]: 2026-10-06 18:39:08.219 UTC [902] LOG: background worker "pg_net 0.20.4 worker" (PID 936) exited with exit code 126 > !!! Traceback (most recent call last):27 > !!! File "<string>", line 276, in <module>28 > !!! server.wait_for_unit("supabase-db-init.service")29 > !!! 30 > !!! RequestedAssertionFailed: unit "supabase-db-init.service" reached state "failed"31 > cleanup32 > kill machine (pid 9)33 > qemu-system-x86_64: terminating on signal 15 from pid 6 (/nix/store/qzc04a3npl70cyyy6flnnrb2ig3kayxm-python3-3.13.11/bin/python3.13)34 > vde_switch: EOF data port: Interrupted system call35 > kill vlan (pid 7)36 > (finished: cleanup, in 0.01 seconds)37 > vde_switch: Caught signal 15, cleaning up and exiting38 For full logs, run:39 nix log /nix/store/q7bn102d84zfxn3lkmz1pwc3l3fr718d-vm-test-run-timescaledb.drv