nixbot

builds

supabase/postgres build #138 failed

branch develop · PR #2521 · commit c092ba3f84 · · took 23m 12s · eval 13m 28s

48 failed
failed attributes
status attribute duration
failed checks.aarch64-linux.ext-amcheck-upgrade 3m 21s
vm-test-run-amcheck-upgrade: !!! RequestedAssertionFailed: unit "supabase-db-init.service" reached state "failed" cleanup kill machine (pid 9) qemu-system-aarch …
vm-test-run-amcheck-upgrade:
!!! RequestedAssertionFailed: unit "supabase-db-init.service" reached state "failed"
cleanup
kill machine (pid 9)
qemu-system-aarch64: terminating on signal 15 from pid 6 (/nix/store/y88crn50yx35fiiwcjx6xqwi6ahk7mlq-python3-3.13.11/bin/python3.13)
vde_switch: EOF data port: Interrupted system call
kill vlan (pid 7)
vde_switch: (finished: cleanup, in 0.00 seconds)
Caught signal 15, cleaning up and exiting
failed checks.aarch64-linux.ext-http 7m 8s
vm-test-run-http: !!! RequestedAssertionFailed: unit "supabase-db-init.service" reached state "failed" cleanup kill machine (pid 9) qemu-system-aarch64: termina …
vm-test-run-http:
!!! RequestedAssertionFailed: unit "supabase-db-init.service" reached state "failed"
cleanup
kill machine (pid 9)
qemu-system-aarch64: terminating on signal 15 from pid 6 (/nix/store/y88crn50yx35fiiwcjx6xqwi6ahk7mlq-python3-3.13.11/bin/python3.13)
vde_switch: EOF data port: Interrupted system call
kill vlan (pid 7)
vde_switch: EOF on stdin, cleaning up and exiting
(finished: cleanup, in 0.01 seconds)
failed checks.aarch64-linux.ext-index_advisor 9m 10s
vm-test-run-index_advisor: !!! RequestedAssertionFailed: unit "supabase-db-init.service" reached state "failed" cleanup kill machine (pid 9) qemu-system-aarch64 …
vm-test-run-index_advisor:
!!! RequestedAssertionFailed: unit "supabase-db-init.service" reached state "failed"
cleanup
kill machine (pid 9)
qemu-system-aarch64: terminating on signal 15 from pid 6 (/nix/store/y88crn50yx35fiiwcjx6xqwi6ahk7mlq-python3-3.13.11/bin/python3.13)
vde_switch: EOF data port: Interrupted system call
kill vlan (pid 7)
(finished: cleanup, in 0.01 seconds)
vde_switch: Caught signal 15, cleaning up and exiting
failed checks.aarch64-linux.ext-orioledb 9m 3s
vm-test-run-orioledb: !!! RequestedAssertionFailed: unit "supabase-db-init.service" reached state "failed" cleanup kill machine (pid 9) qemu-system-aarch64: ter …
vm-test-run-orioledb:
!!! RequestedAssertionFailed: unit "supabase-db-init.service" reached state "failed"
cleanup
kill machine (pid 9)
qemu-system-aarch64: terminating on signal 15 from pid 6 (/nix/store/y88crn50yx35fiiwcjx6xqwi6ahk7mlq-python3-3.13.11/bin/python3.13)
vde_switch: EOF data port: Interrupted system call
kill vlan (pid 7)
(finished: cleanup, in 0.01 seconds)
vde_switch: Caught signal 15, cleaning up and exiting
failed checks.aarch64-linux.ext-pgjwt 6m 58s
vm-test-run-pgjwt: !!! RequestedAssertionFailed: unit "supabase-db-init.service" reached state "failed" cleanup kill machine (pid 9) qemu-system-aarch64: termin …
vm-test-run-pgjwt:
!!! RequestedAssertionFailed: unit "supabase-db-init.service" reached state "failed"
cleanup
kill machine (pid 9)
qemu-system-aarch64: terminating on signal 15 from pid 6 (/nix/store/y88crn50yx35fiiwcjx6xqwi6ahk7mlq-python3-3.13.11/bin/python3.13)
vde_switch: EOF data port: Interrupted system call
kill vlan (pid 7)
vde_switch: Caught signal 15, cleaning up and exiting
(finished: cleanup, in 0.01 seconds)
failed checks.aarch64-linux.ext-pgmq 9m 59s
vm-test-run-pgmq: !!! RequestedAssertionFailed: unit "supabase-db-init.service" reached state "failed" cleanup kill machine (pid 9) qemu-system-aarch64: termina …
vm-test-run-pgmq:
!!! RequestedAssertionFailed: unit "supabase-db-init.service" reached state "failed"
cleanup
kill machine (pid 9)
qemu-system-aarch64: terminating on signal 15 from pid 6 (/nix/store/y88crn50yx35fiiwcjx6xqwi6ahk7mlq-python3-3.13.11/bin/python3.13)
vde_switch: EOF data port: Interrupted system call
kill vlan (pid 7)
(finished: cleanup, in 0.00 seconds)
vde_switch: Caught signal 15, cleaning up and exiting
failed checks.aarch64-linux.ext-pg_plan_filter 7m 28s
vm-test-run-plan_filter: !!! RequestedAssertionFailed: unit "supabase-db-init.service" reached state "failed" cleanup kill machine (pid 9) qemu-system-aarch64: …
vm-test-run-plan_filter:
!!! RequestedAssertionFailed: unit "supabase-db-init.service" reached state "failed"
cleanup
kill machine (pid 9)
qemu-system-aarch64: terminating on signal 15 from pid 6 (/nix/store/y88crn50yx35fiiwcjx6xqwi6ahk7mlq-python3-3.13.11/bin/python3.13)
vde_switch: EOF data port: Interrupted system call
kill vlan (pid 7)
(finished: cleanup, in 0.01 seconds)
vde_switch: Caught signal 15, cleaning up and exiting
failed checks.aarch64-linux.ext-pg_repack 9m 2s
vm-test-run-pg_repack: !!! RequestedAssertionFailed: unit "supabase-db-init.service" reached state "failed" cleanup kill machine (pid 9) qemu-system-aarch64: te …
vm-test-run-pg_repack:
!!! RequestedAssertionFailed: unit "supabase-db-init.service" reached state "failed"
cleanup
kill machine (pid 9)
qemu-system-aarch64: terminating on signal 15 from pid 6 (/nix/store/y88crn50yx35fiiwcjx6xqwi6ahk7mlq-python3-3.13.11/bin/python3.13)
vde_switch: EOF data port: Interrupted system call
kill vlan (pid 7)
(finished: cleanup, in 0.01 seconds)
vde_switch: Caught signal 15, cleaning up and exiting
failed checks.aarch64-linux.ext-pgroonga 4m 58s
vm-test-run-pgroonga: !!! RequestedAssertionFailed: unit "supabase-db-init.service" reached state "failed" cleanup kill machine (pid 9) qemu-system-aarch64: ter …
vm-test-run-pgroonga:
!!! RequestedAssertionFailed: unit "supabase-db-init.service" reached state "failed"
cleanup
kill machine (pid 9)
qemu-system-aarch64: terminating on signal 15 from pid 6 (/nix/store/y88crn50yx35fiiwcjx6xqwi6ahk7mlq-python3-3.13.11/bin/python3.13)
vde_switch: EOF data port: Interrupted system call
kill vlan (pid 7)
(finished: cleanup, in 0.01 seconds)
vde_switch: Caught signal 15, cleaning up and exiting
failed checks.aarch64-linux.ext-pgrouting 6m 58s
vm-test-run-pgrouting: !!! RequestedAssertionFailed: unit "supabase-db-init.service" reached state "failed" cleanup kill machine (pid 9) qemu-system-aarch64: te …
vm-test-run-pgrouting:
!!! RequestedAssertionFailed: unit "supabase-db-init.service" reached state "failed"
cleanup
kill machine (pid 9)
qemu-system-aarch64: terminating on signal 15 from pid 6 (/nix/store/y88crn50yx35fiiwcjx6xqwi6ahk7mlq-python3-3.13.11/bin/python3.13)
vde_switch: EOF data port: Interrupted system call
kill vlan (pid 7)
(finished: cleanup, in 0.01 seconds)
vde_switch: Caught signal 15, cleaning up and exiting
failed checks.aarch64-linux.ext-pgsodium 9m 22s
vm-test-run-pgsodium: !!! RequestedAssertionFailed: unit "supabase-db-init.service" reached state "failed" cleanup kill machine (pid 9) qemu-system-aarch64: ter …
vm-test-run-pgsodium:
!!! RequestedAssertionFailed: unit "supabase-db-init.service" reached state "failed"
cleanup
kill machine (pid 9)
qemu-system-aarch64: terminating on signal 15 from pid 6 (/nix/store/y88crn50yx35fiiwcjx6xqwi6ahk7mlq-python3-3.13.11/bin/python3.13)
vde_switch: EOF data port: Interrupted system call
kill vlan (pid 7)
vde_switch: (finished: cleanup, in 0.00 seconds)
Caught signal 15, cleaning up and exiting
failed checks.aarch64-linux.ext-plpgsql_check 5m 25s
vm-test-run-plpgsql_check: !!! RequestedAssertionFailed: unit "supabase-db-init.service" reached state "failed" cleanup kill machine (pid 9) qemu-system-aarch64 …
vm-test-run-plpgsql_check:
!!! RequestedAssertionFailed: unit "supabase-db-init.service" reached state "failed"
cleanup
kill machine (pid 9)
qemu-system-aarch64: terminating on signal 15 from pid 6 (/nix/store/y88crn50yx35fiiwcjx6xqwi6ahk7mlq-python3-3.13.11/bin/python3.13)
vde_switch: EOF data port: Interrupted system call
kill vlan (pid 7)
vde_switch: (finished: cleanup, in 0.01 seconds)
Caught signal 15, cleaning up and exiting
failed checks.aarch64-linux.ext-plv8 3m 4s
vm-test-run-plv8: !!! RequestedAssertionFailed: unit "supabase-db-init.service" reached state "failed" cleanup kill machine (pid 9) qemu-system-aarch64: termina …
vm-test-run-plv8:
!!! RequestedAssertionFailed: unit "supabase-db-init.service" reached state "failed"
cleanup
kill machine (pid 9)
qemu-system-aarch64: terminating on signal 15 from pid 6 (/nix/store/y88crn50yx35fiiwcjx6xqwi6ahk7mlq-python3-3.13.11/bin/python3.13)
vde_switch: EOF data port: Interrupted system call
kill vlan (pid 7)
(finished: cleanup, in 0.01 seconds)
vde_switch: Caught signal 15, cleaning up and exiting
failed checks.aarch64-linux.ext-postgis 4m 55s
vm-test-run-postgis: !!! RequestedAssertionFailed: unit "supabase-db-init.service" reached state "failed" cleanup kill machine (pid 9) qemu-system-aarch64: term …
vm-test-run-postgis:
!!! RequestedAssertionFailed: unit "supabase-db-init.service" reached state "failed"
cleanup
kill machine (pid 9)
qemu-system-aarch64: terminating on signal 15 from pid 6 (/nix/store/y88crn50yx35fiiwcjx6xqwi6ahk7mlq-python3-3.13.11/bin/python3.13)
vde_switch: EOF data port: Interrupted system call
kill vlan (pid 7)
(finished: cleanup, in 0.01 seconds)
vde_switch: Caught signal 15, cleaning up and exiting
failed checks.aarch64-linux.ext-timescaledb 3m 5s
vm-test-run-timescaledb: !!! RequestedAssertionFailed: unit "supabase-db-init.service" reached state "failed" cleanup kill machine (pid 9) qemu-system-aarch64: …
vm-test-run-timescaledb:
!!! RequestedAssertionFailed: unit "supabase-db-init.service" reached state "failed"
cleanup
kill machine (pid 9)
qemu-system-aarch64: terminating on signal 15 from pid 6 (/nix/store/y88crn50yx35fiiwcjx6xqwi6ahk7mlq-python3-3.13.11/bin/python3.13)
vde_switch: EOF data port: Interrupted system call
kill vlan (pid 7)
(finished: cleanup, in 0.01 seconds)
vde_switch: Caught signal 15, cleaning up and exiting
failed checks.aarch64-linux.ext-vault 4m 54s
vm-test-run-supabase_vault: cleanup kill machine (pid 9) qemu-system-aarch64: terminating on signal 15 from pid 6 (/nix/store/y88crn50yx35fiiwcjx6xqwi6ahk7mlq-p …
vm-test-run-supabase_vault:
cleanup
kill machine (pid 9)
qemu-system-aarch64: terminating on signal 15 from pid 6 (/nix/store/y88crn50yx35fiiwcjx6xqwi6ahk7mlq-python3-3.13.11/bin/python3.13)
vde_switch: EOF data port: Interrupted system call
kill vlan (pid 7)
vde_switch: EOF on stdin, cleaning up and exiting
vde_switch: Caught signal 15, cleaning up and exiting
(finished: cleanup, in 0.01 seconds)
failed checks.aarch64-linux.ext-wrappers-regression-PSQL-1387 3m 5s
vm-test-run-wrappers-regression-PSQL-1387: !!! RequestedAssertionFailed: unit "supabase-db-init.service" reached state "failed" cleanup kill machine (pid 9) qem …
vm-test-run-wrappers-regression-PSQL-1387:
!!! RequestedAssertionFailed: unit "supabase-db-init.service" reached state "failed"
cleanup
kill machine (pid 9)
qemu-system-aarch64: terminating on signal 15 from pid 6 (/nix/store/y88crn50yx35fiiwcjx6xqwi6ahk7mlq-python3-3.13.11/bin/python3.13)
vde_switch: EOF data port: Interrupted system call
kill vlan (pid 7)
vde_switch: Caught signal 15, cleaning up and exiting
(finished: cleanup, in 0.01 seconds)
failed checks.aarch64-linux.psql_15 1m 21s
run-check-harness-psql-15: $ pg_isready -h localhost -p 5536 -U supabase_admin -q 2026-10-06 18:30:08 [INFO] PostgreSQL is ready 2026-10-06 18:30:08 [INFO] Load …
run-check-harness-psql-15:
$ pg_isready -h localhost -p 5536 -U supabase_admin -q
2026-10-06 18:30:08 [INFO] PostgreSQL is ready
2026-10-06 18:30:08 [INFO] Loading prime SQL file (full extension set)
$ psql -p 5536 -h localhost --no-password --username=supabase_admin -d postgres -v ON_ERROR_STOP=1 -Xf /nix/store/ij5car617qxa8s7zv27zlhn6gxdnqrlj-prime.sql
psql: error: connection to server at "localhost" (127.0.0.1), port 5536 failed: FATAL:  could not access file "supautils": No such file or directory
2026-10-06 18:30:08 [ERROR] Error executing SQL file
2026-10-06 18:30:08 [ERROR] An error occurred. Exit code: 1
2026-10-06 18:30:08 [ERROR] Debug logs:
failed checks.aarch64-linux.psql_15_slim 1m 8s
run-check-harness-psql-15-slim: $ pg_isready -h localhost -p 5539 -U supabase_admin -q 2026-10-06 18:35:29 [INFO] PostgreSQL is ready 2026-10-06 18:35:29 [INFO] …
run-check-harness-psql-15-slim:
$ pg_isready -h localhost -p 5539 -U supabase_admin -q
2026-10-06 18:35:29 [INFO] PostgreSQL is ready
2026-10-06 18:35:29 [INFO] Loading prime SQL file (full extension set)
$ psql -p 5539 -h localhost --no-password --username=supabase_admin -d postgres -v ON_ERROR_STOP=1 -Xf /nix/store/ij5car617qxa8s7zv27zlhn6gxdnqrlj-prime.sql
psql: error: connection to server at "localhost" (127.0.0.1), port 5539 failed: FATAL:  could not access file "supautils": No such file or directory
2026-10-06 18:35:29 [ERROR] Error executing SQL file
2026-10-06 18:35:29 [ERROR] An error occurred. Exit code: 1
2026-10-06 18:35:29 [ERROR] Debug logs:
failed checks.aarch64-linux.psql_17 1m 1s
run-check-harness-psql-17: $ pg_isready -h localhost -p 5535 -U supabase_admin -q 2026-10-06 18:29:48 [INFO] PostgreSQL is ready 2026-10-06 18:29:48 [INFO] Load …
run-check-harness-psql-17:
$ pg_isready -h localhost -p 5535 -U supabase_admin -q
2026-10-06 18:29:48 [INFO] PostgreSQL is ready
2026-10-06 18:29:48 [INFO] Loading prime SQL file (full extension set)
$ psql -p 5535 -h localhost --no-password --username=supabase_admin -d postgres -v ON_ERROR_STOP=1 -Xf /nix/store/ij5car617qxa8s7zv27zlhn6gxdnqrlj-prime.sql
psql: error: connection to server at "localhost" (127.0.0.1), port 5535 failed: FATAL:  could not access file "supautils": No such file or directory
2026-10-06 18:29:48 [ERROR] Error executing SQL file
2026-10-06 18:29:48 [ERROR] An error occurred. Exit code: 1
2026-10-06 18:29:48 [ERROR] Debug logs:
failed checks.aarch64-linux.psql_17_cli 30s
run-check-harness-psql-17-cli: $ pg_isready -h localhost -p 5541 -U supabase_admin -q 2026-10-06 18:34:52 [INFO] PostgreSQL is ready 2026-10-06 18:34:52 [INFO] …
run-check-harness-psql-17-cli:
$ pg_isready -h localhost -p 5541 -U supabase_admin -q
2026-10-06 18:34:52 [INFO] PostgreSQL is ready
2026-10-06 18:34:52 [INFO] CLI variant detected - loading CLI prime SQL file
$ psql -p 5541 -h localhost --no-password --username=supabase_admin -d postgres -v ON_ERROR_STOP=1 -Xf /nix/store/ib75j74vyc0w374jcz7mqcg6njf21yx3-prime-cli.sql
psql: error: connection to server at "localhost" (127.0.0.1), port 5541 failed: FATAL:  could not access file "supautils": No such file or directory
2026-10-06 18:34:52 [ERROR] Error executing CLI prime SQL file
2026-10-06 18:34:52 [ERROR] An error occurred. Exit code: 1
2026-10-06 18:34:52 [ERROR] Debug logs:
failed checks.aarch64-linux.psql_17_slim 41s
run-check-harness-psql-17-slim: $ pg_isready -h localhost -p 5538 -U supabase_admin -q 2026-10-06 18:37:35 [INFO] PostgreSQL is ready 2026-10-06 18:37:35 [INFO] …
run-check-harness-psql-17-slim:
$ pg_isready -h localhost -p 5538 -U supabase_admin -q
2026-10-06 18:37:35 [INFO] PostgreSQL is ready
2026-10-06 18:37:35 [INFO] Loading prime SQL file (full extension set)
$ psql -p 5538 -h localhost --no-password --username=supabase_admin -d postgres -v ON_ERROR_STOP=1 -Xf /nix/store/ij5car617qxa8s7zv27zlhn6gxdnqrlj-prime.sql
psql: error: connection to server at "localhost" (127.0.0.1), port 5538 failed: FATAL:  could not access file "supautils": No such file or directory
2026-10-06 18:37:35 [ERROR] Error executing SQL file
2026-10-06 18:37:35 [ERROR] An error occurred. Exit code: 1
2026-10-06 18:37:35 [ERROR] Debug logs:
failed checks.aarch64-linux.psql_orioledb-17 1m 7s
run-check-harness-psql-orioledb-17: $ psql -p 5537 -h localhost --no-password --username=supabase_admin -d postgres -c CREATE EXTENSION IF NOT EXISTS orioledb; …
run-check-harness-psql-orioledb-17:
$ psql -p 5537 -h localhost --no-password --username=supabase_admin -d postgres -c CREATE EXTENSION IF NOT EXISTS orioledb;
psql: error: connection to server at "localhost" (127.0.0.1), port 5537 failed: FATAL:  could not access file "supautils": No such file or directory
2026-10-06 18:29:54 [INFO] Loading prime SQL file (full extension set)
$ psql -p 5537 -h localhost --no-password --username=supabase_admin -d postgres -v ON_ERROR_STOP=1 -Xf /nix/store/ij5car617qxa8s7zv27zlhn6gxdnqrlj-prime.sql
psql: error: connection to server at "localhost" (127.0.0.1), port 5537 failed: FATAL:  could not access file "supautils": No such file or directory
2026-10-06 18:29:54 [ERROR] Error executing SQL file
2026-10-06 18:29:54 [ERROR] An error occurred. Exit code: 1
2026-10-06 18:29:54 [ERROR] Debug logs:
failed checks.aarch64-linux.psql_orioledb-17_slim 57s
run-check-harness-psql-orioledb-17-slim: $ psql -p 5540 -h localhost --no-password --username=supabase_admin -d postgres -c CREATE EXTENSION IF NOT EXISTS oriol …
run-check-harness-psql-orioledb-17-slim:
$ psql -p 5540 -h localhost --no-password --username=supabase_admin -d postgres -c CREATE EXTENSION IF NOT EXISTS orioledb;
psql: error: connection to server at "localhost" (127.0.0.1), port 5540 failed: FATAL:  could not access file "supautils": No such file or directory
2026-10-06 18:29:44 [INFO] Loading prime SQL file (full extension set)
$ psql -p 5540 -h localhost --no-password --username=supabase_admin -d postgres -v ON_ERROR_STOP=1 -Xf /nix/store/ij5car617qxa8s7zv27zlhn6gxdnqrlj-prime.sql
psql: error: connection to server at "localhost" (127.0.0.1), port 5540 failed: FATAL:  could not access file "supautils": No such file or directory
2026-10-06 18:29:44 [ERROR] Error executing SQL file
2026-10-06 18:29:44 [ERROR] An error occurred. Exit code: 1
2026-10-06 18:29:44 [ERROR] Debug logs:
failed checks.x86_64-linux.ext-amcheck-upgrade 1m 34s
vm-test-run-amcheck-upgrade: !!! RequestedAssertionFailed: unit "supabase-db-init.service" reached state "failed" cleanup kill machine (pid 9) qemu-system-x86_6 …
vm-test-run-amcheck-upgrade:
!!! RequestedAssertionFailed: unit "supabase-db-init.service" reached state "failed"
cleanup
kill machine (pid 9)
qemu-system-x86_64: terminating on signal 15 from pid 6 (/nix/store/qzc04a3npl70cyyy6flnnrb2ig3kayxm-python3-3.13.11/bin/python3.13)
vde_switch: EOF data port: Interrupted system call
kill vlan (pid 7)
(finished: cleanup, in 0.00 seconds)
vde_switch: Caught signal 15, cleaning up and exiting
failed checks.x86_64-linux.ext-http 1m 14s
vm-test-run-http: !!! RequestedAssertionFailed: unit "supabase-db-init.service" reached state "failed" cleanup kill machine (pid 9) qemu-system-x86_64: terminat …
vm-test-run-http:
!!! RequestedAssertionFailed: unit "supabase-db-init.service" reached state "failed"
cleanup
kill machine (pid 9)
qemu-system-x86_64: terminating on signal 15 from pid 6 (/nix/store/qzc04a3npl70cyyy6flnnrb2ig3kayxm-python3-3.13.11/bin/python3.13)
vde_switch: EOF data port: Interrupted system call
kill vlan (pid 7)
(finished: cleanup, in 0.01 seconds)
vde_switch: Caught signal 15, cleaning up and exiting
failed checks.x86_64-linux.ext-index_advisor 1m 29s
vm-test-run-index_advisor: !!! RequestedAssertionFailed: unit "supabase-db-init.service" reached state "failed" cleanup kill machine (pid 9) qemu-system-x86_64: …
vm-test-run-index_advisor:
!!! RequestedAssertionFailed: unit "supabase-db-init.service" reached state "failed"
cleanup
kill machine (pid 9)
qemu-system-x86_64: terminating on signal 15 from pid 6 (/nix/store/qzc04a3npl70cyyy6flnnrb2ig3kayxm-python3-3.13.11/bin/python3.13)
vde_switch: EOF data port: Interrupted system call
kill vlan (pid 7)
(finished: cleanup, in 0.01 seconds)
vde_switch: Caught signal 15, cleaning up and exiting
failed checks.x86_64-linux.ext-orioledb 1m 33s
vm-test-run-orioledb: cleanup kill machine (pid 9) qemu-system-x86_64: terminating on signal 15 from pid 6 (/nix/store/qzc04a3npl70cyyy6flnnrb2ig3kayxm-python3- …
vm-test-run-orioledb:
cleanup
kill machine (pid 9)
qemu-system-x86_64: terminating on signal 15 from pid 6 (/nix/store/qzc04a3npl70cyyy6flnnrb2ig3kayxm-python3-3.13.11/bin/python3.13)
vde_switch: EOF data port: Interrupted system call
kill vlan (pid 7)
vde_switch: EOF on stdin, cleaning up and exiting
vde_switch: Caught signal 15, cleaning up and exiting
(finished: cleanup, in 0.01 seconds)
failed checks.x86_64-linux.ext-pgjwt 1m 11s
vm-test-run-pgjwt: !!! RequestedAssertionFailed: unit "supabase-db-init.service" reached state "failed" cleanup kill machine (pid 9) qemu-system-x86_64: termina …
vm-test-run-pgjwt:
!!! RequestedAssertionFailed: unit "supabase-db-init.service" reached state "failed"
cleanup
kill machine (pid 9)
qemu-system-x86_64: terminating on signal 15 from pid 6 (/nix/store/qzc04a3npl70cyyy6flnnrb2ig3kayxm-python3-3.13.11/bin/python3.13)
vde_switch: EOF data port: Interrupted system call
kill vlan (pid 7)
(finished: cleanup, in 0.01 seconds)
vde_switch: Caught signal 15, cleaning up and exiting
failed checks.x86_64-linux.ext-pgmq 1m 11s
vm-test-run-pgmq: cleanup kill machine (pid 9) qemu-system-x86_64: terminating on signal 15 from pid 6 (/nix/store/qzc04a3npl70cyyy6flnnrb2ig3kayxm-python3-3.13 …
vm-test-run-pgmq:
cleanup
kill machine (pid 9)
qemu-system-x86_64: terminating on signal 15 from pid 6 (/nix/store/qzc04a3npl70cyyy6flnnrb2ig3kayxm-python3-3.13.11/bin/python3.13)
vde_switch: EOF data port: Interrupted system call
kill vlan (pid 7)
vde_switch: EOF on stdin, cleaning up and exiting
vde_switch: Caught signal 15, cleaning up and exiting
(finished: cleanup, in 0.01 seconds)
failed checks.x86_64-linux.ext-pg_plan_filter 1m 30s
vm-test-run-plan_filter: cleanup kill machine (pid 9) qemu-system-x86_64: terminating on signal 15 from pid 6 (/nix/store/qzc04a3npl70cyyy6flnnrb2ig3kayxm-pytho …
vm-test-run-plan_filter:
cleanup
kill machine (pid 9)
qemu-system-x86_64: terminating on signal 15 from pid 6 (/nix/store/qzc04a3npl70cyyy6flnnrb2ig3kayxm-python3-3.13.11/bin/python3.13)
vde_switch: EOF data port: Interrupted system call
kill vlan (pid 7)
vde_switch: EOF on stdin, cleaning up and exiting
vde_switch: Caught signal 15, cleaning up and exiting
(finished: cleanup, in 0.01 seconds)
failed checks.x86_64-linux.ext-pg_repack 1m 27s
vm-test-run-pg_repack: !!! RequestedAssertionFailed: unit "supabase-db-init.service" reached state "failed" cleanup kill machine (pid 9) qemu-system-x86_64: ter …
vm-test-run-pg_repack:
!!! RequestedAssertionFailed: unit "supabase-db-init.service" reached state "failed"
cleanup
kill machine (pid 9)
qemu-system-x86_64: terminating on signal 15 from pid 6 (/nix/store/qzc04a3npl70cyyy6flnnrb2ig3kayxm-python3-3.13.11/bin/python3.13)
vde_switch: EOF data port: Interrupted system call
kill vlan (pid 7)
vde_switch: vde_switch: Caught signal 15, cleaning up and exiting
(finished: cleanup, in 0.01 seconds)
failed checks.x86_64-linux.ext-pgroonga 1m 17s
vm-test-run-pgroonga: !!! RequestedAssertionFailed: unit "supabase-db-init.service" reached state "failed" cleanup kill machine (pid 9) qemu-system-x86_64: term …
vm-test-run-pgroonga:
!!! RequestedAssertionFailed: unit "supabase-db-init.service" reached state "failed"
cleanup
kill machine (pid 9)
qemu-system-x86_64: terminating on signal 15 from pid 6 (/nix/store/qzc04a3npl70cyyy6flnnrb2ig3kayxm-python3-3.13.11/bin/python3.13)
vde_switch: EOF data port: Interrupted system call
kill vlan (pid 7)
vde_switch: Caught signal 15, cleaning up and exiting
(finished: cleanup, in 0.00 seconds)
failed checks.x86_64-linux.ext-pgrouting 42s
vm-test-run-pgrouting: !!! RequestedAssertionFailed: unit "supabase-db-init.service" reached state "failed" cleanup kill machine (pid 9) qemu-system-x86_64: ter …
vm-test-run-pgrouting:
!!! RequestedAssertionFailed: unit "supabase-db-init.service" reached state "failed"
cleanup
kill machine (pid 9)
qemu-system-x86_64: terminating on signal 15 from pid 6 (/nix/store/qzc04a3npl70cyyy6flnnrb2ig3kayxm-python3-3.13.11/bin/python3.13)
vde_switch: EOF data port: Interrupted system call
kill vlan (pid 7)
(finished: cleanup, in 0.02 seconds)
vde_switch: Caught signal 15, cleaning up and exiting
failed checks.x86_64-linux.ext-pgsodium 44s
vm-test-run-pgsodium: cleanup kill machine (pid 9) qemu-system-x86_64: terminating on signal 15 from pid 6 (/nix/store/qzc04a3npl70cyyy6flnnrb2ig3kayxm-python3- …
vm-test-run-pgsodium:
cleanup
kill machine (pid 9)
qemu-system-x86_64: terminating on signal 15 from pid 6 (/nix/store/qzc04a3npl70cyyy6flnnrb2ig3kayxm-python3-3.13.11/bin/python3.13)
vde_switch: EOF data port: Interrupted system call
kill vlan (pid 7)
vde_switch: EOF on stdin, cleaning up and exiting
vde_switch: Caught signal 15, cleaning up and exiting
(finished: cleanup, in 0.01 seconds)
failed checks.x86_64-linux.ext-plpgsql_check 38s
vm-test-run-plpgsql_check: cleanup kill machine (pid 9) qemu-system-x86_64: terminating on signal 15 from pid 6 (/nix/store/qzc04a3npl70cyyy6flnnrb2ig3kayxm-pyt …
vm-test-run-plpgsql_check:
cleanup
kill machine (pid 9)
qemu-system-x86_64: terminating on signal 15 from pid 6 (/nix/store/qzc04a3npl70cyyy6flnnrb2ig3kayxm-python3-3.13.11/bin/python3.13)
vde_switch: EOF data port: Interrupted system call
kill vlan (pid 7)
vde_switch: EOF on stdin, cleaning up and exiting
vde_switch: Caught signal 15, cleaning up and exiting
(finished: cleanup, in 0.00 seconds)
failed checks.x86_64-linux.ext-plv8 39s
vm-test-run-plv8: !!! RequestedAssertionFailed: unit "supabase-db-init.service" reached state "failed" cleanup kill machine (pid 9) qemu-system-x86_64: terminat …
vm-test-run-plv8:
!!! RequestedAssertionFailed: unit "supabase-db-init.service" reached state "failed"
cleanup
kill machine (pid 9)
qemu-system-x86_64: terminating on signal 15 from pid 6 (/nix/store/qzc04a3npl70cyyy6flnnrb2ig3kayxm-python3-3.13.11/bin/python3.13)
vde_switch: EOF data port: Interrupted system call
kill vlan (pid 7)
(finished: cleanup, in 0.01 seconds)
vde_switch: Caught signal 15, cleaning up and exiting
failed checks.x86_64-linux.ext-postgis 22s
vm-test-run-postgis: !!! RequestedAssertionFailed: unit "supabase-db-init.service" reached state "failed" cleanup kill machine (pid 9) qemu-system-x86_64: termi …
vm-test-run-postgis:
!!! RequestedAssertionFailed: unit "supabase-db-init.service" reached state "failed"
cleanup
kill machine (pid 9)
qemu-system-x86_64: terminating on signal 15 from pid 6 (/nix/store/qzc04a3npl70cyyy6flnnrb2ig3kayxm-python3-3.13.11/bin/python3.13)
vde_switch: EOF data port: Interrupted system call
kill vlan (pid 7)
vde_switch: EOF on stdin, cleaning up and exitingvde_switch: (finished: cleanup, in 0.01 seconds)
Caught signal 15, cleaning up and exiting
failed checks.x86_64-linux.ext-timescaledb 33s
vm-test-run-timescaledb: !!! RequestedAssertionFailed: unit "supabase-db-init.service" reached state "failed" cleanup kill machine (pid 9) qemu-system-x86_64: t …
vm-test-run-timescaledb:
!!! RequestedAssertionFailed: unit "supabase-db-init.service" reached state "failed"
cleanup
kill machine (pid 9)
qemu-system-x86_64: terminating on signal 15 from pid 6 (/nix/store/qzc04a3npl70cyyy6flnnrb2ig3kayxm-python3-3.13.11/bin/python3.13)
vde_switch: EOF data port: Interrupted system call
kill vlan (pid 7)
(finished: cleanup, in 0.01 seconds)
vde_switch: Caught signal 15, cleaning up and exiting
failed checks.x86_64-linux.ext-vault 26s
vm-test-run-supabase_vault: cleanup kill machine (pid 9) qemu-system-x86_64: terminating on signal 15 from pid 6 (/nix/store/qzc04a3npl70cyyy6flnnrb2ig3kayxm-py …
vm-test-run-supabase_vault:
cleanup
kill machine (pid 9)
qemu-system-x86_64: terminating on signal 15 from pid 6 (/nix/store/qzc04a3npl70cyyy6flnnrb2ig3kayxm-python3-3.13.11/bin/python3.13)
vde_switch: EOF data port: Interrupted system call
kill vlan (pid 7)
vde_switch: EOF on stdin, cleaning up and exiting
vde_switch: Caught signal 15, cleaning up and exiting
(finished: cleanup, in 0.00 seconds)
failed checks.x86_64-linux.ext-wrappers-regression-PSQL-1387 38s
vm-test-run-wrappers-regression-PSQL-1387: cleanup kill machine (pid 9) qemu-system-x86_64: terminating on signal 15 from pid 6 (/nix/store/qzc04a3npl70cyyy6fln …
vm-test-run-wrappers-regression-PSQL-1387:
cleanup
kill machine (pid 9)
qemu-system-x86_64: terminating on signal 15 from pid 6 (/nix/store/qzc04a3npl70cyyy6flnnrb2ig3kayxm-python3-3.13.11/bin/python3.13)
vde_switch: EOF data port: Interrupted system call
kill vlan (pid 7)
vde_switch: EOF on stdin, cleaning up and exiting
vde_switch: Caught signal 15, cleaning up and exiting
(finished: cleanup, in 0.01 seconds)
failed checks.x86_64-linux.psql_15 1m 27s
run-check-harness-psql-15: $ pg_isready -h localhost -p 5536 -U supabase_admin -q 2026-10-06 18:38:48 [INFO] PostgreSQL is ready 2026-10-06 18:38:48 [INFO] Load …
run-check-harness-psql-15:
$ pg_isready -h localhost -p 5536 -U supabase_admin -q
2026-10-06 18:38:48 [INFO] PostgreSQL is ready
2026-10-06 18:38:48 [INFO] Loading prime SQL file (full extension set)
$ psql -p 5536 -h localhost --no-password --username=supabase_admin -d postgres -v ON_ERROR_STOP=1 -Xf /nix/store/ij5car617qxa8s7zv27zlhn6gxdnqrlj-prime.sql
psql: error: connection to server at "localhost" (127.0.0.1), port 5536 failed: FATAL:  could not access file "supautils": No such file or directory
2026-10-06 18:38:48 [ERROR] Error executing SQL file
2026-10-06 18:38:48 [ERROR] An error occurred. Exit code: 1
2026-10-06 18:38:48 [ERROR] Debug logs:
failed checks.x86_64-linux.psql_15_slim 1m 31s
run-check-harness-psql-15-slim: $ pg_isready -h localhost -p 5539 -U supabase_admin -q 2026-10-06 18:38:52 [INFO] PostgreSQL is ready 2026-10-06 18:38:52 [INFO] …
run-check-harness-psql-15-slim:
$ pg_isready -h localhost -p 5539 -U supabase_admin -q
2026-10-06 18:38:52 [INFO] PostgreSQL is ready
2026-10-06 18:38:52 [INFO] Loading prime SQL file (full extension set)
$ psql -p 5539 -h localhost --no-password --username=supabase_admin -d postgres -v ON_ERROR_STOP=1 -Xf /nix/store/ij5car617qxa8s7zv27zlhn6gxdnqrlj-prime.sql
psql: error: connection to server at "localhost" (127.0.0.1), port 5539 failed: FATAL:  could not access file "supautils": No such file or directory
2026-10-06 18:38:52 [ERROR] Error executing SQL file
2026-10-06 18:38:52 [ERROR] An error occurred. Exit code: 1
2026-10-06 18:38:52 [ERROR] Debug logs:
failed checks.x86_64-linux.psql_17 1m 13s
run-check-harness-psql-17: $ pg_isready -h localhost -p 5535 -U supabase_admin -q 2026-10-06 18:38:35 [INFO] PostgreSQL is ready 2026-10-06 18:38:35 [INFO] Load …
run-check-harness-psql-17:
$ pg_isready -h localhost -p 5535 -U supabase_admin -q
2026-10-06 18:38:35 [INFO] PostgreSQL is ready
2026-10-06 18:38:35 [INFO] Loading prime SQL file (full extension set)
$ psql -p 5535 -h localhost --no-password --username=supabase_admin -d postgres -v ON_ERROR_STOP=1 -Xf /nix/store/ij5car617qxa8s7zv27zlhn6gxdnqrlj-prime.sql
psql: error: connection to server at "localhost" (127.0.0.1), port 5535 failed: FATAL:  could not access file "supautils": No such file or directory
2026-10-06 18:38:35 [ERROR] Error executing SQL file
2026-10-06 18:38:35 [ERROR] An error occurred. Exit code: 1
2026-10-06 18:38:35 [ERROR] Debug logs:
failed checks.x86_64-linux.psql_17_cli 38s
run-check-harness-psql-17-cli: $ pg_isready -h localhost -p 5541 -U supabase_admin -q 2026-10-06 18:38:17 [INFO] PostgreSQL is ready 2026-10-06 18:38:17 [INFO] …
run-check-harness-psql-17-cli:
$ pg_isready -h localhost -p 5541 -U supabase_admin -q
2026-10-06 18:38:17 [INFO] PostgreSQL is ready
2026-10-06 18:38:17 [INFO] CLI variant detected - loading CLI prime SQL file
$ psql -p 5541 -h localhost --no-password --username=supabase_admin -d postgres -v ON_ERROR_STOP=1 -Xf /nix/store/ib75j74vyc0w374jcz7mqcg6njf21yx3-prime-cli.sql
psql: error: connection to server at "localhost" (127.0.0.1), port 5541 failed: FATAL:  could not access file "supautils": No such file or directory
2026-10-06 18:38:17 [ERROR] Error executing CLI prime SQL file
2026-10-06 18:38:17 [ERROR] An error occurred. Exit code: 1
2026-10-06 18:38:17 [ERROR] Debug logs:
failed checks.x86_64-linux.psql_17_slim 1m 16s
run-check-harness-psql-17-slim: $ pg_isready -h localhost -p 5538 -U supabase_admin -q 2026-10-06 18:38:37 [INFO] PostgreSQL is ready 2026-10-06 18:38:37 [INFO] …
run-check-harness-psql-17-slim:
$ pg_isready -h localhost -p 5538 -U supabase_admin -q
2026-10-06 18:38:37 [INFO] PostgreSQL is ready
2026-10-06 18:38:37 [INFO] Loading prime SQL file (full extension set)
$ psql -p 5538 -h localhost --no-password --username=supabase_admin -d postgres -v ON_ERROR_STOP=1 -Xf /nix/store/ij5car617qxa8s7zv27zlhn6gxdnqrlj-prime.sql
psql: error: connection to server at "localhost" (127.0.0.1), port 5538 failed: FATAL:  could not access file "supautils": No such file or directory
2026-10-06 18:38:37 [ERROR] Error executing SQL file
2026-10-06 18:38:37 [ERROR] An error occurred. Exit code: 1
2026-10-06 18:38:37 [ERROR] Debug logs:
failed checks.x86_64-linux.psql_orioledb-17 1m 13s
run-check-harness-psql-orioledb-17: $ psql -p 5537 -h localhost --no-password --username=supabase_admin -d postgres -c CREATE EXTENSION IF NOT EXISTS orioledb; …
run-check-harness-psql-orioledb-17:
$ psql -p 5537 -h localhost --no-password --username=supabase_admin -d postgres -c CREATE EXTENSION IF NOT EXISTS orioledb;
psql: error: connection to server at "localhost" (127.0.0.1), port 5537 failed: FATAL:  could not access file "supautils": No such file or directory
2026-10-06 18:38:33 [INFO] Loading prime SQL file (full extension set)
$ psql -p 5537 -h localhost --no-password --username=supabase_admin -d postgres -v ON_ERROR_STOP=1 -Xf /nix/store/ij5car617qxa8s7zv27zlhn6gxdnqrlj-prime.sql
psql: error: connection to server at "localhost" (127.0.0.1), port 5537 failed: FATAL:  could not access file "supautils": No such file or directory
2026-10-06 18:38:34 [ERROR] Error executing SQL file
2026-10-06 18:38:34 [ERROR] An error occurred. Exit code: 1
2026-10-06 18:38:34 [ERROR] Debug logs:
failed checks.x86_64-linux.psql_orioledb-17_slim 1m 12s
run-check-harness-psql-orioledb-17-slim: $ psql -p 5540 -h localhost --no-password --username=supabase_admin -d postgres -c CREATE EXTENSION IF NOT EXISTS oriol …
run-check-harness-psql-orioledb-17-slim:
$ psql -p 5540 -h localhost --no-password --username=supabase_admin -d postgres -c CREATE EXTENSION IF NOT EXISTS orioledb;
psql: error: connection to server at "localhost" (127.0.0.1), port 5540 failed: FATAL:  could not access file "supautils": No such file or directory
2026-10-06 18:38:33 [INFO] Loading prime SQL file (full extension set)
$ psql -p 5540 -h localhost --no-password --username=supabase_admin -d postgres -v ON_ERROR_STOP=1 -Xf /nix/store/ij5car617qxa8s7zv27zlhn6gxdnqrlj-prime.sql
psql: error: connection to server at "localhost" (127.0.0.1), port 5540 failed: FATAL:  could not access file "supautils": No such file or directory
2026-10-06 18:38:33 [ERROR] Error executing SQL file
2026-10-06 18:38:33 [ERROR] An error occurred. Exit code: 1
2026-10-06 18:38:33 [ERROR] Debug logs:
10 succeeded
succeeded attributes
status attribute duration
loading…
64 already built
skipped attributes
status attribute duration
loading…