setup
checks.x86_64-linux.ext-orioledb
· build #138
· raw
1these 36 derivations will be built:2 /nix/store/52iplgwjby71d80pnvmxrygc049hbaxl-postgresql-and-plugins-17_22.drv3 /nix/store/asw01k1bjx57in36n9knzkzj626mvhkp-postgresql-and-plugins-15.19.drv4 /nix/store/n88d0k2lgb0lkz8qz53nk22nzdy507cz-postgresql-and-plugins-15.19.drv5 /nix/store/415j0197f67rfc03ycimq3d22cr3dc5p-system-path.drv6 /nix/store/f186kirywhr5gd3jsnzfx2v38phmx855-dbus-1.drv7 /nix/store/r2cal0a4xc32mvcdzr5ikkh472pfpaj3-X-Restart-Triggers-dbus.drv8 /nix/store/6l1dc3ib8733dc4yymxm2yakip29li5z-unit-dbus.service.drv9 /nix/store/na7dp8clfsdsidciz8n7x4l82ksxcxsx-supabase-orioledb-db-init.drv10 /nix/store/g1sdgi8k1xkb29svlahnjcr9kmicvh2v-unit-supabase-db-init.service.drv11 /nix/store/rys9w7ny450inpw6x5k74bg50nl0zsvq-postgresql-orioledb-init.drv12 /nix/store/lfx555mbnbd854rhp8zm9kr0kypvkwmy-unit-postgresql.service.drv13 /nix/store/bc813xngfa4ca888fhl3nh95vdp6ayql-system-units.drv14 /nix/store/n31466s5xw38b5wflqmgyaq49izlmxwq-unit-dbus.service.drv15 /nix/store/bj57cl7d8snjjl8w40qzdpc02iwdm0iy-user-units.drv16 /nix/store/0cz3rldsr11a6n494zf6bl26qg3f33np-etc.drv17 /nix/store/gi8pzyiayscrnm7pqara8jfv7fpnnl1y-system-path.drv18 /nix/store/4nnv7n403zsiy36bxh7am430h4kkhmpn-dbus-1.drv19 /nix/store/dgxfhlva6zxaxdjzf2xjj9p4jx4j6n43-X-Restart-Triggers-dbus.drv20 /nix/store/6qbw1qxswqnarmfb74plaim1adnmivv8-unit-dbus.service.drv21 /nix/store/352482wmxwmf97nzn8dnl3wh4bal8d0b-user-units.drv22 /nix/store/7scvfczm3gx08j459zfabihvxvxhr8vw-supabase-db-init.drv23 /nix/store/6ps4p08mhchabzb5cwrq260janm4yqyp-unit-supabase-db-init.service.drv24 /nix/store/6vl0gc2ywv0k5b0v9lq8qdsw3hz3s4s3-unit-dbus.service.drv25 /nix/store/sdi6i8kv47ckqmjxb7j1wj3ijwyxlx41-postgresql-init.drv26 /nix/store/pkml2h891cby54fhfxxsrncqbgzwgp42-unit-postgresql.service.drv27 /nix/store/bxgx4vir4cc5570pk0i7wgj8s4zfzksd-system-units.drv28 /nix/store/39qwz47niqzavi037qzqm82gav3kq41b-etc.drv29 /nix/store/hc8rpasih8whhf9kbqi8g2hysv1086d8-activate.drv30 /nix/store/bhmq3gbmhcxq4qs37kppfv11mj5smx24-nixos-system-server-test.drv31 /nix/store/j58hxs8dbif92n3698hsrc0rj70bhxhf-activate.drv32 /nix/store/wb0flgs4lyb8fbgqnpcr3m92mg402nb2-nixos-system-server-test.drv33 /nix/store/lhlhkf1vgssb34lw87ll3bd84d5arn5d-closure-info.drv34 /nix/store/zc994zqhl6irn8bm2nnkzgd8wg1d933s-run-nixos-vm.drv35 /nix/store/c4lgkzsk295fbsr41xrwvzr4p9m7gsjb-nixos-vm.drv36 /nix/store/0zd72jcip9ri4ajrxnh9k9xn2344r99s-nixos-test-driver-orioledb.drv37 /nix/store/zbjbcxan7sb6viylsjg2x5mwjjf4npyl-vm-test-run-orioledb.drv38error: Cannot build '/nix/store/zbjbcxan7sb6viylsjg2x5mwjjf4npyl-vm-test-run-orioledb.drv'.39 Reason: builder failed with exit code 1.40 Output paths:41 /nix/store/rfx2aqvkkqhzqxy2nr0ghcx9gc83zkfd-vm-test-run-orioledb42 Last 25 log lines:43 > server # [ 10.223967] 0dsnn2pgjpwifpwim9gq4qgfwf3cgrgh-supabase-db-init[917]: Creating postgres role...44 > server # [ 10.243666] postgres[922]: ::1 2026-10-06 18:39:23.687 UTC [922] supabase_admin@postgres FATAL: could not access file "supautils": No such file or directory45 > server # [ 10.244442] 0dsnn2pgjpwifpwim9gq4qgfwf3cgrgh-supabase-db-init[921]: psql: error: connection to server at "localhost" (::1), port 5432 failed: FATAL: could not access file "supautils": No such file or directory46 > server # [ 10.264057] postgres[924]: ::1 2026-10-06 18:39:23.707 UTC [924] supabase_admin@postgres FATAL: could not access file "supautils": No such file or directory47 > server # [ 10.264838] 0dsnn2pgjpwifpwim9gq4qgfwf3cgrgh-supabase-db-init[923]: psql: error: connection to server at "localhost" (::1), port 5432 failed: FATAL: could not access file "supautils": No such file or directory48 > server # [ 10.270955] 0dsnn2pgjpwifpwim9gq4qgfwf3cgrgh-supabase-db-init[917]: Running init-script: /nix/store/nw0bs8nddlaf6wh127acj2xwsdq5p7qz-migrations-db/init-scripts/00000000000000-initial-schema.sql49 > server # [ 10.284874] postgres[926]: ::1 2026-10-06 18:39:23.728 UTC [926] postgres@postgres FATAL: role "postgres" does not exist50 > server # [ 10.286630] 0dsnn2pgjpwifpwim9gq4qgfwf3cgrgh-supabase-db-init[925]: psql: error: connection to server at "localhost" (::1), port 5432 failed: FATAL: role "postgres" does not exist51 > server # [ 10.290446] systemd[1]: supabase-db-init.service: Main process exited, code=exited, status=2/INVALIDARGUMENT52 > server # [ 10.291789] systemd[1]: supabase-db-init.service: Failed with result 'exit-code'.53 > server # [ 10.293420] systemd[1]: Failed to start Supabase Database Initialization.54 > server # [ 10.294501] systemd[1]: supabase-db-init.service: Consumed 28ms CPU time, 2.8M memory peak, 1.9K incoming IP traffic, 2.2K outgoing IP traffic.55 > !!! Traceback (most recent call last):56 > !!! File "<string>", line 6, in <module>57 > !!! server.wait_for_unit("supabase-db-init.service")58 > !!! 59 > !!! RequestedAssertionFailed: unit "supabase-db-init.service" reached state "failed"60 > cleanup61 > kill machine (pid 9)62 > qemu-system-x86_64: terminating on signal 15 from pid 6 (/nix/store/qzc04a3npl70cyyy6flnnrb2ig3kayxm-python3-3.13.11/bin/python3.13)63 > vde_switch: EOF data port: Interrupted system call64 > kill vlan (pid 7)65 > vde_switch: EOF on stdin, cleaning up and exiting66 > vde_switch: Caught signal 15, cleaning up and exiting67 > (finished: cleanup, in 0.01 seconds)68 For full logs, run:69 nix log /nix/store/zbjbcxan7sb6viylsjg2x5mwjjf4npyl-vm-test-run-orioledb.drv