setup
checks.aarch64-linux.psql_17_slim
· build #138
· raw
1these 3 derivations will be built:2 /nix/store/28s5kjn6aadpy89bdrsh9rajjcf1r5g1-start-postgres-server-test.drv3 /nix/store/pb626rkl9f5fj4rmpdabhf6nskfciyn7-postgres-17-check-harness.drv4 /nix/store/hv4k3dmmpb4nhms68cy4s2vqwsn8b3gh-run-check-harness-psql-17-slim.drv5error: build of '/nix/store/hv4k3dmmpb4nhms68cy4s2vqwsn8b3gh-run-check-harness-psql-17-slim.drv' on 'ssh-ng://nixbot-remote-build@78.232.36.247' failed: Cannot build '/nix/store/hv4k3dmmpb4nhms68cy4s2vqwsn8b3gh-run-check-harness-psql-17-slim.drv'.6 Reason: builder failed with exit code 1.7 Output paths:8 /nix/store/290pca61f67rajw71733h9pyirh8lypr-run-check-harness-psql-17-slim9 Last 25 log lines:10 > PostgreSQL is running in daemon mode. Please stop it using pg_ctl.11 > Running /nix/store/645zyjykc9v36vi2w9zrw1ah4cnrsnq1-migrations/migrations/20260730000000_revoke_trigger_on_cron_tables_from_postgres.sql12 > psql: error: connection to server at "localhost" (127.0.0.1), port 5538 failed: FATAL: could not access file "supautils": No such file or directory13 > PostgreSQL is running in daemon mode. Please stop it using pg_ctl.14 > Running /nix/store/645zyjykc9v36vi2w9zrw1ah4cnrsnq1-migrations/migrations/20260923021047_update_pgrst_watch_triggers.sql15 > psql: error: connection to server at "localhost" (127.0.0.1), port 5538 failed: FATAL: could not access file "supautils": No such file or directory16 > PostgreSQL is running in daemon mode. Please stop it using pg_ctl.17 > psql: error: connection to server at "localhost" (127.0.0.1), port 5538 failed: FATAL: could not access file "supautils": No such file or directory18 > PostgreSQL is running in daemon mode. Please stop it using pg_ctl.19 > Shutting down PostgreSQL...20 > PostgreSQL is running in daemon mode. Please stop it using pg_ctl.21 > pg_ctl: another server might be running; trying to start server anyway22 > waiting for server to start.... stopped waiting23 > pg_ctl: could not start server24 > Examine the log output.25 > pg_ctl: server is running (PID: 1946)26 > /nix/store/g4n567a8ckvf960v2f2qck92pnp5yp4d-postgresql-and-plugins-17.11/bin/postgres "-D" "/build/tmp.vK6OQAZpUb" "--config-file=/build/tmp.vK6OQAZpUb/postgresql.conf" "-p" "5538" "-k" "/build/tmp.vK6OQAZpUb/tmp"27 > $ pg_isready -h localhost -p 5538 -U supabase_admin -q28 > 2026-10-06 18:37:35 [INFO] PostgreSQL is ready29 > 2026-10-06 18:37:35 [INFO] Loading prime SQL file (full extension set)30 > $ psql -p 5538 -h localhost --no-password --username=supabase_admin -d postgres -v ON_ERROR_STOP=1 -Xf /nix/store/ij5car617qxa8s7zv27zlhn6gxdnqrlj-prime.sql31 > psql: error: connection to server at "localhost" (127.0.0.1), port 5538 failed: FATAL: could not access file "supautils": No such file or directory32 > 2026-10-06 18:37:35 [ERROR] Error executing SQL file33 > 2026-10-06 18:37:35 [ERROR] An error occurred. Exit code: 134 > 2026-10-06 18:37:35 [ERROR] Debug logs:35 For full logs, run:36 nix log /nix/store/hv4k3dmmpb4nhms68cy4s2vqwsn8b3gh-run-check-harness-psql-17-slim.drv37error: Cannot build '/nix/store/hv4k3dmmpb4nhms68cy4s2vqwsn8b3gh-run-check-harness-psql-17-slim.drv'.38 Reason: builder failed with exit code 1.39 Output paths:40 /nix/store/290pca61f67rajw71733h9pyirh8lypr-run-check-harness-psql-17-slim