setup
checks.aarch64-linux.psql_17_cli
· build #138
· raw
1these 5 derivations will be built:2 /nix/store/h40cpbm9n2hif33sdxamyffhni104b1p-start-postgres-server-test.drv3 /nix/store/wijl2qfl7lrv6s6d37jyx6425jvx9q3p-postgresql-and-plugins-17.11.drv4 /nix/store/kzzxsb7gxrngqwni45x6j0mlqx6hwnp4-postgresql-and-plugins-17.11.drv5 /nix/store/h3as6aavf3ma6h7x9h0g5bc9x8zf9szj-postgres-17-check-harness.drv6 /nix/store/fyd46c9py3rnwllsnbvs64b4dl50kdd4-run-check-harness-psql-17-cli.drv7error: build of '/nix/store/fyd46c9py3rnwllsnbvs64b4dl50kdd4-run-check-harness-psql-17-cli.drv' on 'ssh-ng://nixbot-remote-build@78.232.36.247' failed: Cannot build '/nix/store/fyd46c9py3rnwllsnbvs64b4dl50kdd4-run-check-harness-psql-17-cli.drv'.8 Reason: builder failed with exit code 1.9 Output paths:10 /nix/store/88b4jx6gndda95i5yx91zgwgdzpz9hkr-run-check-harness-psql-17-cli11 Last 25 log lines:12 > PostgreSQL is running in daemon mode. Please stop it using pg_ctl.13 > Running /nix/store/645zyjykc9v36vi2w9zrw1ah4cnrsnq1-migrations/migrations/20260730000000_revoke_trigger_on_cron_tables_from_postgres.sql14 > psql: error: connection to server at "localhost" (127.0.0.1), port 5541 failed: FATAL: could not access file "supautils": No such file or directory15 > PostgreSQL is running in daemon mode. Please stop it using pg_ctl.16 > Running /nix/store/645zyjykc9v36vi2w9zrw1ah4cnrsnq1-migrations/migrations/20260923021047_update_pgrst_watch_triggers.sql17 > psql: error: connection to server at "localhost" (127.0.0.1), port 5541 failed: FATAL: could not access file "supautils": No such file or directory18 > PostgreSQL is running in daemon mode. Please stop it using pg_ctl.19 > psql: error: connection to server at "localhost" (127.0.0.1), port 5541 failed: FATAL: could not access file "supautils": No such file or directory20 > PostgreSQL is running in daemon mode. Please stop it using pg_ctl.21 > Shutting down PostgreSQL...22 > PostgreSQL is running in daemon mode. Please stop it using pg_ctl.23 > pg_ctl: another server might be running; trying to start server anyway24 > waiting for server to start.... stopped waiting25 > pg_ctl: could not start server26 > Examine the log output.27 > pg_ctl: server is running (PID: 1143)28 > /nix/store/g4n567a8ckvf960v2f2qck92pnp5yp4d-postgresql-and-plugins-17.11/bin/postgres "-D" "/build/tmp.3E25as9E3T" "--config-file=/build/tmp.3E25as9E3T/postgresql.conf" "-p" "5541" "-k" "/build/tmp.3E25as9E3T/tmp"29 > $ pg_isready -h localhost -p 5541 -U supabase_admin -q30 > 2026-10-06 18:34:52 [INFO] PostgreSQL is ready31 > 2026-10-06 18:34:52 [INFO] CLI variant detected - loading CLI prime SQL file32 > $ psql -p 5541 -h localhost --no-password --username=supabase_admin -d postgres -v ON_ERROR_STOP=1 -Xf /nix/store/ib75j74vyc0w374jcz7mqcg6njf21yx3-prime-cli.sql33 > psql: error: connection to server at "localhost" (127.0.0.1), port 5541 failed: FATAL: could not access file "supautils": No such file or directory34 > 2026-10-06 18:34:52 [ERROR] Error executing CLI prime SQL file35 > 2026-10-06 18:34:52 [ERROR] An error occurred. Exit code: 136 > 2026-10-06 18:34:52 [ERROR] Debug logs:37 For full logs, run:38 nix log /nix/store/fyd46c9py3rnwllsnbvs64b4dl50kdd4-run-check-harness-psql-17-cli.drv39error: Cannot build '/nix/store/fyd46c9py3rnwllsnbvs64b4dl50kdd4-run-check-harness-psql-17-cli.drv'.40 Reason: builder failed with exit code 1.41 Output paths:42 /nix/store/88b4jx6gndda95i5yx91zgwgdzpz9hkr-run-check-harness-psql-17-cli