setup
checks.aarch64-linux.ext-plv8
· build #138
· raw
1these 19 derivations will be built:2 /nix/store/4avjxsflklcc5v9xnv86bv9k43145hwb-supabase-db-init.drv3 /nix/store/jjnai3ffblml7lap3bkyblgnp0adm3cq-unit-supabase-db-init.service.drv4 /nix/store/r3cssi964w7fpqzxik3bmckh92x0jhr2-system-path.drv5 /nix/store/9qk45ggm73j3rf0fakkq4cln81kdircs-dbus-1.drv6 /nix/store/4bj4xdjvhbg4h10azfazg21nygc2zd2r-X-Restart-Triggers-dbus.drv7 /nix/store/laa5rfxnjwl6z5bmf03jrzb25cqmzab3-unit-dbus.service.drv8 /nix/store/ww2a5iijizplvzjag0knc5r4fclxjlr2-postgresql-init.drv9 /nix/store/wpkc8a2pn68031l6pba5wjdrqkby36dc-unit-postgresql.service.drv10 /nix/store/9la208qkhmpqc5ykpw5snkxhhlr8b3ww-system-units.drv11 /nix/store/ymwrgzx2f940lf0gxai09y0w3nrinazk-unit-dbus.service.drv12 /nix/store/qgsjnvm3kx3hn3sfnr00ajp005vhsmym-user-units.drv13 /nix/store/zjk89k4lp5v7z489gkzy37zbh3bsnlgs-etc.drv14 /nix/store/2kakacs26cfhxp5vxjfigxiv7776ylvy-activate.drv15 /nix/store/j3srw7izs1wk266a27378ia3xky6h7sn-nixos-system-server-test.drv16 /nix/store/vfgpcnx3s54nlzfzy1rfgn9x614aajhc-closure-info.drv17 /nix/store/8fnnblfig05d97asasvnzn7j8s1bin22-run-nixos-vm.drv18 /nix/store/hk7a1shglp1q0azdsxjr6s23w6vyam8q-nixos-vm.drv19 /nix/store/r822yraclg0pcixqha7ipna3llfl7z05-nixos-test-driver-plv8.drv20 /nix/store/w96zqvdajggd8361paivzkc3hx6633xl-vm-test-run-plv8.drv21error: build of '/nix/store/w96zqvdajggd8361paivzkc3hx6633xl-vm-test-run-plv8.drv' on 'ssh-ng://builder@mac-linux-builder' failed: Cannot build '/nix/store/w96zqvdajggd8361paivzkc3hx6633xl-vm-test-run-plv8.drv'.22 Reason: builder failed with exit code 1.23 Output paths:24 /nix/store/9k2x9315lc8f1fcpyl67g8iy0zsyhgz5-vm-test-run-plv825 Last 25 log lines:26 > server # [ 108.502826] postgres[1453]: ::1 2026-10-06 18:40:26.189 UTC [1453] supabase_admin@postgres FATAL: could not access file "supautils": No such file or directory27 > server # [ 108.550216] z6cixly7zq6r994cf2zxkj5lm2n9x47z-supabase-db-init[1445]: psql: error: connection to server at "localhost" (::1), port 5432 failed: FATAL: could not access file "supautils": No such file or directory28 > server # [ 108.577038] z6cixly7zq6r994cf2zxkj5lm2n9x47z-supabase-db-init[1426]: Running init-script: /nix/store/nw0bs8nddlaf6wh127acj2xwsdq5p7qz-migrations-db/init-scripts/00000000000000-initial-schema.sql29 > server # [ 108.702546] postgres[1458]: 2026-10-06 18:40:26.384 UTC [1458] FATAL: role "postgres" does not exist30 > server # [ 108.829862] postgres[1380]: 2026-10-06 18:40:26.520 UTC [1380] LOG: background worker "pg_net 0.20.4 worker" (PID 1458) exited with exit code 131 > server # [ 108.979731] postgres[1461]: ::1 2026-10-06 18:40:26.679 UTC [1461] postgres@postgres FATAL: role "postgres" does not exist32 > server # [ 109.010745] z6cixly7zq6r994cf2zxkj5lm2n9x47z-supabase-db-init[1457]: psql: error: connection to server at "localhost" (::1), port 5432 failed: FATAL: role "postgres" does not exist33 > server # [ 109.059694] systemd[1]: supabase-db-init.service: Main process exited, code=exited, status=2/INVALIDARGUMENT34 > server # [ 109.086813] systemd[1]: supabase-db-init.service: Failed with result 'exit-code'.35 > server # [ 109.107466] systemd[1]: Failed to start Supabase Database Initialization.36 > server # [ 109.119101] systemd[1]: supabase-db-init.service: Consumed 797ms CPU time, 2.8M memory peak, 2.1K incoming IP traffic, 2.1K outgoing IP traffic.37 > server # [ 109.139304] systemd[1]: Reached target Multi-User System.38 > server # [ 109.150643] systemd[1]: Startup finished in 12.911s (kernel) + 1min 36.195s (userspace) = 1min 49.106s.39 > !!! Traceback (most recent call last):40 > !!! File "<string>", line 276, in <module>41 > !!! server.wait_for_unit("supabase-db-init.service")42 > !!! 43 > !!! RequestedAssertionFailed: unit "supabase-db-init.service" reached state "failed"44 > cleanup45 > kill machine (pid 9)46 > qemu-system-aarch64: terminating on signal 15 from pid 6 (/nix/store/y88crn50yx35fiiwcjx6xqwi6ahk7mlq-python3-3.13.11/bin/python3.13)47 > vde_switch: EOF data port: Interrupted system call48 > kill vlan (pid 7)49 > (finished: cleanup, in 0.01 seconds)50 > vde_switch: Caught signal 15, cleaning up and exiting51 For full logs, run:52 nix-store -l /nix/store/w96zqvdajggd8361paivzkc3hx6633xl-vm-test-run-plv8.drv53error: Cannot build '/nix/store/w96zqvdajggd8361paivzkc3hx6633xl-vm-test-run-plv8.drv'.54 Reason: builder failed with exit code 1.55 Output paths:56 /nix/store/9k2x9315lc8f1fcpyl67g8iy0zsyhgz5-vm-test-run-plv8