setup
checks.aarch64-linux.ext-http
· build #138
· raw
1these 40 derivations will be built:2 /nix/store/nx43wi4shqd7brzvanhkfffvpi1alml3-postgresql-orioledb-init.drv3 /nix/store/05jkj24k602hfcjkd0n06gls52i9qw5b-unit-postgresql.service.drv4 /nix/store/aaf3z2d6ynvqws0qr4lj4cnw5jfcbypa-system-path.drv5 /nix/store/cdmvyv1ys5ca72qhzh2sli5x02vq405l-dbus-1.drv6 /nix/store/kbnysrl2d5qzzkqv6fiy95qdvz413191-X-Restart-Triggers-dbus.drv7 /nix/store/2hn1caybc55gxfvfb8rhi82scwl391h1-unit-dbus.service.drv8 /nix/store/l7h8rcz0lzac9hls7cv96297792r2ymg-postgresql-migrate.drv9 /nix/store/7gc5nidr0wvb2rmks9lzfi0vnvh7c2vr-unit-postgresql-migrate.service.drv10 /nix/store/ii3rb9isnkwpyc204aqfdq58y79zqrid-unit-postgresql.service.drv11 /nix/store/07q8vn1imidqqdn4jjkfpw7bzyj2yni5-system-units.drv12 /nix/store/zgd586vlkmjs0f8sad11jn9jd5bk2db0-unit-dbus.service.drv13 /nix/store/hz0zdgh5jb5msapwfwbgj3zmv7nf07ql-user-units.drv14 /nix/store/lmfsvz2pclf7gkan15i7gi8cy0vfwmii-etc.drv15 /nix/store/cm26gnrcm8wxyhxp8r8n8dwgp22w6wpq-activate.drv16 /nix/store/1dvsn7x6pv6b99sz5gx5a6sr3frmw4bd-nixos-system-server-test.drv17 /nix/store/ymwrgzx2f940lf0gxai09y0w3nrinazk-unit-dbus.service.drv18 /nix/store/qgsjnvm3kx3hn3sfnr00ajp005vhsmym-user-units.drv19 /nix/store/7gs4xgyj8s0ppzr629m8fq71f6mzqqmz-unit-postgresql.service.drv20 /nix/store/laa5rfxnjwl6z5bmf03jrzb25cqmzab3-unit-dbus.service.drv21 /nix/store/scbdp5in0b2fh5nqrb4r3i5p2fv5g1h0-system-units.drv22 /nix/store/dr0h2kh4vmds7md42czag1cv4w9avq39-etc.drv23 /nix/store/g2r6aiy9zf6gg899jbr7vifigqh3ddzi-activate.drv24 /nix/store/bchbm5k2dp2nd2djr8fgg8nkmddj871q-supabase-orioledb-db-init.drv25 /nix/store/hn97iwnp51r80mx85salm3mkfx3ikxsq-unit-supabase-db-init.service.drv26 /nix/store/yh7by2iqf61hy0dsfmnpcikxgxbkygdj-system-path.drv27 /nix/store/c6m05k1f57988j7sls8p9cawzidrw4dz-dbus-1.drv28 /nix/store/mdjgfsbpn70b3pswr4yp5l1m7knyhpd1-X-Restart-Triggers-dbus.drv29 /nix/store/k47sm05fmi2brlypzqcz1yp00mhkcsvy-unit-dbus.service.drv30 /nix/store/4pa7ih47s4raww0vxrll34zkk5ql7vn6-system-units.drv31 /nix/store/p839jzl96hr6bh7dwl3zv2279qdfbk60-unit-dbus.service.drv32 /nix/store/mm3cs01mrwyhw25hdxba0jb7k5nv057p-user-units.drv33 /nix/store/53glvgjy33bhl376bfnsk5bvr261kwqv-etc.drv34 /nix/store/crpzkxn2rq540ljdp6a2npxx32abxg9g-activate.drv35 /nix/store/sv33vd204kh3bllwhf3a7x20ls1hhlhr-nixos-system-server-test.drv36 /nix/store/d176gf6ini1n5mr6r10da4l0k04c5jv6-nixos-system-server-test.drv37 /nix/store/mmap3yxhwbqv02spc9hcd0yiymss0v7y-closure-info.drv38 /nix/store/4569f2i5ma4ffnb2biizhbhhb1dlcgbr-run-nixos-vm.drv39 /nix/store/rnxbm6ybghsfxv4lspgpfd3y76dwz633-nixos-vm.drv40 /nix/store/i139fk48papakr30nyiz1ljg9qswsq45-nixos-test-driver-http.drv41 /nix/store/byzr0930wvd2m8axdzywhwchvyphrda1-vm-test-run-http.drv42error: build of '/nix/store/byzr0930wvd2m8axdzywhwchvyphrda1-vm-test-run-http.drv' on 'ssh-ng://builder@mac-linux-builder' failed: Cannot build '/nix/store/byzr0930wvd2m8axdzywhwchvyphrda1-vm-test-run-http.drv'.43 Reason: builder failed with exit code 1.44 Output paths:45 /nix/store/ycp6j3jyd9xflja1z29qayg6i0qm7wv8-vm-test-run-http46 Last 25 log lines:47 > server # [ 123.381280] postgres[1505]: ::1 2026-10-06 18:44:45.698 UTC [1505] supabase_admin@postgres FATAL: could not access file "supautils": No such file or directory48 > server # [ 123.397577] z6cixly7zq6r994cf2zxkj5lm2n9x47z-supabase-db-init[1502]: psql: error: connection to server at "localhost" (::1), port 5432 failed: FATAL: could not access file "supautils": No such file or directory49 > server # [ 123.444796] z6cixly7zq6r994cf2zxkj5lm2n9x47z-supabase-db-init[1472]: Running init-script: /nix/store/nw0bs8nddlaf6wh127acj2xwsdq5p7qz-migrations-db/init-scripts/00000000000000-initial-schema.sql50 > server # [ 123.536260] postgres[1507]: 2026-10-06 18:44:45.834 UTC [1507] FATAL: role "postgres" does not exist51 > server # [ 123.583259] postgres[1446]: 2026-10-06 18:44:45.893 UTC [1446] LOG: background worker "pg_net 0.20.4 worker" (PID 1507) exited with exit code 152 > server # [ 123.707501] postgres[1508]: ::1 2026-10-06 18:44:46.019 UTC [1508] postgres@postgres FATAL: role "postgres" does not exist53 > server # [ 123.729408] z6cixly7zq6r994cf2zxkj5lm2n9x47z-supabase-db-init[1506]: psql: error: connection to server at "localhost" (::1), port 5432 failed: FATAL: role "postgres" does not exist54 > server # [ 123.779968] systemd[1]: supabase-db-init.service: Main process exited, code=exited, status=2/INVALIDARGUMENT55 > server # [ 123.784048] systemd[1]: supabase-db-init.service: Failed with result 'exit-code'.56 > server # [ 123.792882] systemd[1]: Failed to start Supabase Database Initialization.57 > server # [ 123.803527] systemd[1]: supabase-db-init.service: Consumed 807ms CPU time, 2.7M memory peak, 2K incoming IP traffic, 2K outgoing IP traffic.58 > server # [ 123.824275] systemd[1]: Reached target Multi-User System.59 > server # [ 123.829584] systemd[1]: Startup finished in 19.870s (kernel) + 1min 43.952s (userspace) = 2min 3.822s.60 > !!! Traceback (most recent call last):61 > !!! File "<string>", line 280, in <module>62 > !!! server.wait_for_unit("supabase-db-init.service")63 > !!! 64 > !!! RequestedAssertionFailed: unit "supabase-db-init.service" reached state "failed"65 > cleanup66 > kill machine (pid 9)67 > qemu-system-aarch64: terminating on signal 15 from pid 6 (/nix/store/y88crn50yx35fiiwcjx6xqwi6ahk7mlq-python3-3.13.11/bin/python3.13)68 > vde_switch: EOF data port: Interrupted system call69 > kill vlan (pid 7)70 > vde_switch: EOF on stdin, cleaning up and exiting71 > (finished: cleanup, in 0.01 seconds)72 For full logs, run:73 nix-store -l /nix/store/byzr0930wvd2m8axdzywhwchvyphrda1-vm-test-run-http.drv74error: Cannot build '/nix/store/byzr0930wvd2m8axdzywhwchvyphrda1-vm-test-run-http.drv'.75 Reason: builder failed with exit code 1.76 Output paths:77 /nix/store/ycp6j3jyd9xflja1z29qayg6i0qm7wv8-vm-test-run-http