setup
checks.x86_64-linux.psql_17_cli
· build #133
· raw
1these 27 derivations will be built:2 /nix/store/5v6a4ssacxc4snck5dzagkmqhcsh2swz-pg_net-0.19.5.drv3 /nix/store/7b5ar71808xp6cc9vi64vcr3gxhaq9w2-pg_net-0.14.0.drv4 /nix/store/ggfg6al5fkdp0r1jsc3iabgz0p7g6l1m-pg_net-0.7.drv5 /nix/store/hfwkzpr1kplwaywhvayqm6j4gsva8n5n-pg_net-0.20.0.drv6 /nix/store/ymx9gp4jhvd7qpjvk95vw2m6ycb0jal7-pg_net-0.13.0.drv7 /nix/store/94hi7qqfg86lfxqnyqizx334my0yjbh3-pg_net.drv8 /nix/store/a5gfyj0k47cxv70v4a1zhhk1998vd290-postgresql-and-plugins-15.19.drv9 /nix/store/69zc44dp9979jf4p9hcpgfdf1wgpw40l-postgresql-and-plugins-15.19.drv10 /nix/store/h3jfznl8xhwm8wvvxg23yj74srzz3vii-pg_net-0.19.5.drv11 /nix/store/jdx62c5jlcjxsbqjaqi25zwfy2ys9jp5-pg_net-0.13.0.drv12 /nix/store/ky294hja2giinx8655lj1d83j4jq5gjj-pg_net-0.14.0.drv13 /nix/store/ky7414m088qm5h8xn9z7xzw0k08wgcrh-pg_net-0.20.0.drv14 /nix/store/cqdc5q7n6g9pkxy0cjcvkq185rps4bfd-pg_net.drv15 /nix/store/indj4nm2a8g5g662hyqq8132ckwfni3z-postgresql-and-plugins-17.11.drv16 /nix/store/7m2w2f1wdvyk1m13sihdz2pk989awrx2-postgresql-and-plugins-17.11.drv17 /nix/store/d5s4s970iizz6a8w5ndnpzyw63w1m1qv-postgresql-and-plugins-17.11.drv18 /nix/store/7hla3p20yajypj5w3hnrx38bc3kq14vq-postgresql-and-plugins-17.11.drv19 /nix/store/bv2b3hyfiwg59frhybs6cmf9l26byfrs-pg_net-0.13.0.drv20 /nix/store/dxjxg15c0m6vdgy5yswqbm50g4fww2p1-pg_net-0.14.0.drv21 /nix/store/jvalwdcdi2ci9kcx1q2zx6hyla1sa738-pg_net-0.20.0.drv22 /nix/store/v7i610b6q10zpsd2536yvba9pd2xqrr6-pg_net-0.19.5.drv23 /nix/store/zd0hg58y5nwnnwfzy7sd19l7dzx4zvv5-pg_net.drv24 /nix/store/m7073j3kxn6vxs53jdm448q51cxiimys-postgresql-and-plugins-17_22.drv25 /nix/store/q8qv7gf9izi4my9mjapggg0fx2dhzlwc-postgresql-and-plugins-17_22.drv26 /nix/store/y8b3ly63y3ghcvlfblm537wxpvbf3c4q-start-postgres-server-test.drv27 /nix/store/jdcayg9r83y4vzdg9ayqw4ki6glb3spx-postgres-17-check-harness.drv28 /nix/store/76nh7fljpj83m7a0qmvx0a20mbdvknln-run-check-harness-psql-17-cli.drv29error: Cannot build '/nix/store/ky7414m088qm5h8xn9z7xzw0k08wgcrh-pg_net-0.20.0.drv'.30 Reason: builder failed with exit code 2.31 Output paths:32 /nix/store/div76hg9lzzwipcrl72qfbl1vaps6bqr-pg_net-0.20.033 Last 22 log lines:34 > Running phase: unpackPhase35 > unpacking source archive /nix/store/3783i7yhcfqnyv5ndli22gcr11ap151m-source36 > source root is source37 > Running phase: patchPhase38 > Running phase: updateAutotoolsGnuConfigScriptsPhase39 > Running phase: configurePhase40 > no configure script, doing nothing41 > Running phase: buildPhase42 > gcc -Wall -Wmissing-prototypes -Wpointer-arith -Wdeclaration-after-statement -Werror=vla -Wendif-labels -Wmissing-format-attribute -Wimplicit-fallthrough=3 -Wcast-function-type -Wshadow=compatible-local -Wformat-security -fno-strict-aliasing -fwrapv -fexcess-precision=standard -Wno-format-truncation -Wno-stringop-truncation -g -O2 -std=c11 -Wextra -Wall -Werror -Wno-declaration-after-statement -Wno-vla -Wno-long-long -Wmissing-variable-declarations -fPIC -fvisibility=hidden -DEXTVERSION=\"0.20.0\" -I. -I./ -I/nix/store/dj25xabr71j1mmxf628lqsn61qd5qcyk-postgresql-17.11/include/server -I/nix/store/dj25xabr71j1mmxf628lqsn61qd5qcyk-postgresql-17.11/include/internal -D_GNU_SOURCE -I/nix/store/5nl2zr46dic7mxcw6cvbq85wa8c2gngh-libxml2-2.15.1-dev/include/libxml2 -I/nix/store/sl10j863s32x7dv5vw6wfx1nh22f3xh2-lz4-1.10.0-dev/include -I/nix/store/di94mxmhhk390zzzv2gvavfwkgww7q6h-zstd-1.5.7-dev/include -I/nix/store/h5hfqhzcqszmsacj26hh3fngwcal04zs-icu4c-75.1-dev/include -c -o src/core.o src/core.c43 > gcc -Wall -Wmissing-prototypes -Wpointer-arith -Wdeclaration-after-statement -Werror=vla -Wendif-labels -Wmissing-format-attribute -Wimplicit-fallthrough=3 -Wcast-function-type -Wshadow=compatible-local -Wformat-security -fno-strict-aliasing -fwrapv -fexcess-precision=standard -Wno-format-truncation -Wno-stringop-truncation -g -O2 -std=c11 -Wextra -Wall -Werror -Wno-declaration-after-statement -Wno-vla -Wno-long-long -Wmissing-variable-declarations -fPIC -fvisibility=hidden -DEXTVERSION=\"0.20.0\" -I. -I./ -I/nix/store/dj25xabr71j1mmxf628lqsn61qd5qcyk-postgresql-17.11/include/server -I/nix/store/dj25xabr71j1mmxf628lqsn61qd5qcyk-postgresql-17.11/include/internal -D_GNU_SOURCE -I/nix/store/5nl2zr46dic7mxcw6cvbq85wa8c2gngh-libxml2-2.15.1-dev/include/libxml2 -I/nix/store/sl10j863s32x7dv5vw6wfx1nh22f3xh2-lz4-1.10.0-dev/include -I/nix/store/di94mxmhhk390zzzv2gvavfwkgww7q6h-zstd-1.5.7-dev/include -I/nix/store/h5hfqhzcqszmsacj26hh3fngwcal04zs-icu4c-75.1-dev/include -c -o src/errors.o src/errors.c44 > gcc -Wall -Wmissing-prototypes -Wpointer-arith -Wdeclaration-after-statement -Werror=vla -Wendif-labels -Wmissing-format-attribute -Wimplicit-fallthrough=3 -Wcast-function-type -Wshadow=compatible-local -Wformat-security -fno-strict-aliasing -fwrapv -fexcess-precision=standard -Wno-format-truncation -Wno-stringop-truncation -g -O2 -std=c11 -Wextra -Wall -Werror -Wno-declaration-after-statement -Wno-vla -Wno-long-long -Wmissing-variable-declarations -fPIC -fvisibility=hidden -DEXTVERSION=\"0.20.0\" -I. -I./ -I/nix/store/dj25xabr71j1mmxf628lqsn61qd5qcyk-postgresql-17.11/include/server -I/nix/store/dj25xabr71j1mmxf628lqsn61qd5qcyk-postgresql-17.11/include/internal -D_GNU_SOURCE -I/nix/store/5nl2zr46dic7mxcw6cvbq85wa8c2gngh-libxml2-2.15.1-dev/include/libxml2 -I/nix/store/sl10j863s32x7dv5vw6wfx1nh22f3xh2-lz4-1.10.0-dev/include -I/nix/store/di94mxmhhk390zzzv2gvavfwkgww7q6h-zstd-1.5.7-dev/include -I/nix/store/h5hfqhzcqszmsacj26hh3fngwcal04zs-icu4c-75.1-dev/include -c -o src/event.o src/event.c45 > In file included from /nix/store/wflnb8fxmq4lqx3ca91hlpv95vrqkv51-curl-8.17.0-dev/include/curl/curl.h:3333,46 > from /nix/store/wflnb8fxmq4lqx3ca91hlpv95vrqkv51-curl-8.17.0-dev/include/curl/multi.h:51,47 > from src/event.h:4,48 > from src/event.c:6:49 > /nix/store/wflnb8fxmq4lqx3ca91hlpv95vrqkv51-curl-8.17.0-dev/include/curl/multi.h:429:23: error: expected identifier or '(' before '__extension__'50 > 429 | CURL_EXTERN CURLMcode curl_multi_setopt(CURLM *multi_handle,51 > | ^~~~~~~~~~~~~~~~~52 > /nix/store/wflnb8fxmq4lqx3ca91hlpv95vrqkv51-curl-8.17.0-dev/include/curl/multi.h:429:23: error: expected identifier or '(' before ')' token53 > 429 | CURL_EXTERN CURLMcode curl_multi_setopt(CURLM *multi_handle,54 > | ^~~~~~~~~~~~~~~~~55 > make: *** [<builtin>: src/event.o] Error 156 For full logs, run:57 nix log /nix/store/ky7414m088qm5h8xn9z7xzw0k08wgcrh-pg_net-0.20.0.drv58error: Cannot build '/nix/store/dxjxg15c0m6vdgy5yswqbm50g4fww2p1-pg_net-0.14.0.drv'.59 Reason: builder failed with exit code 2.60 Output paths:61 /nix/store/xqh65xhxx9wcmpgwvzh7kkpf9zs0y72x-pg_net-0.14.062 Last 25 log lines:63 > src/errors.h:6:11: warning: call to 'Wcurl_easy_setopt_err_long' declared with attribute warning: curl_easy_setopt expects a long argument [-Wattribute-warning]64 > 6 | if (curl_easy_setopt(hdl, opt, prm) != CURLE_OK) \65 > | ^~~~~~~~~~~~~~~~66 > src/core.c:134:3: note: in expansion of macro 'EREPORT_CURL_SETOPT'67 > 134 | EREPORT_CURL_SETOPT(curl_ez_handle, CURLOPT_TIMEOUT_MS, cdata->timeout_milliseconds);68 > | ^~~~~~~~~~~~~~~~~~~69 > src/errors.h:6:11: warning: call to 'Wcurl_easy_setopt_err_long' declared with attribute warning: curl_easy_setopt expects a long argument [-Wattribute-warning]70 > 6 | if (curl_easy_setopt(hdl, opt, prm) != CURLE_OK) \71 > | ^~~~~~~~~~~~~~~~72 > src/core.c:136:3: note: in expansion of macro 'EREPORT_CURL_SETOPT'73 > 136 | EREPORT_CURL_SETOPT(curl_ez_handle, CURLOPT_FOLLOWLOCATION, true);74 > | ^~~~~~~~~~~~~~~~~~~75 > gcc -Wall -Wmissing-prototypes -Wpointer-arith -Wdeclaration-after-statement -Werror=vla -Wendif-labels -Wmissing-format-attribute -Wimplicit-fallthrough=3 -Wcast-function-type -Wshadow=compatible-local -Wformat-security -fno-strict-aliasing -fwrapv -fexcess-precision=standard -Wno-format-truncation -Wno-stringop-truncation -g -O2 -std=c11 -Werror -Wno-declaration-after-statement -fPIC -fvisibility=hidden -DEXTVERSION=\"0.14.0\" -I. -I./ -I/nix/store/qmc7y6nc0qxg50ywm46x4iaqq5knz702-postgresql-17_22/include/server -I/nix/store/qmc7y6nc0qxg50ywm46x4iaqq5knz702-postgresql-17_22/include/internal -D_GNU_SOURCE -I/nix/store/5nl2zr46dic7mxcw6cvbq85wa8c2gngh-libxml2-2.15.1-dev/include/libxml2 -I/nix/store/sl10j863s32x7dv5vw6wfx1nh22f3xh2-lz4-1.10.0-dev/include -I/nix/store/di94mxmhhk390zzzv2gvavfwkgww7q6h-zstd-1.5.7-dev/include -I/nix/store/h5hfqhzcqszmsacj26hh3fngwcal04zs-icu4c-75.1-dev/include -c -o src/errors.o src/errors.c76 > gcc -Wall -Wmissing-prototypes -Wpointer-arith -Wdeclaration-after-statement -Werror=vla -Wendif-labels -Wmissing-format-attribute -Wimplicit-fallthrough=3 -Wcast-function-type -Wshadow=compatible-local -Wformat-security -fno-strict-aliasing -fwrapv -fexcess-precision=standard -Wno-format-truncation -Wno-stringop-truncation -g -O2 -std=c11 -Werror -Wno-declaration-after-statement -fPIC -fvisibility=hidden -DEXTVERSION=\"0.14.0\" -I. -I./ -I/nix/store/qmc7y6nc0qxg50ywm46x4iaqq5knz702-postgresql-17_22/include/server -I/nix/store/qmc7y6nc0qxg50ywm46x4iaqq5knz702-postgresql-17_22/include/internal -D_GNU_SOURCE -I/nix/store/5nl2zr46dic7mxcw6cvbq85wa8c2gngh-libxml2-2.15.1-dev/include/libxml2 -I/nix/store/sl10j863s32x7dv5vw6wfx1nh22f3xh2-lz4-1.10.0-dev/include -I/nix/store/di94mxmhhk390zzzv2gvavfwkgww7q6h-zstd-1.5.7-dev/include -I/nix/store/h5hfqhzcqszmsacj26hh3fngwcal04zs-icu4c-75.1-dev/include -c -o src/event.o src/event.c77 > In file included from /nix/store/wflnb8fxmq4lqx3ca91hlpv95vrqkv51-curl-8.17.0-dev/include/curl/curl.h:3333,78 > from /nix/store/wflnb8fxmq4lqx3ca91hlpv95vrqkv51-curl-8.17.0-dev/include/curl/multi.h:51,79 > from src/event.h:4,80 > from src/event.c:6:81 > /nix/store/wflnb8fxmq4lqx3ca91hlpv95vrqkv51-curl-8.17.0-dev/include/curl/multi.h:429:23: error: expected identifier or '(' before '__extension__'82 > 429 | CURL_EXTERN CURLMcode curl_multi_setopt(CURLM *multi_handle,83 > | ^~~~~~~~~~~~~~~~~84 > /nix/store/wflnb8fxmq4lqx3ca91hlpv95vrqkv51-curl-8.17.0-dev/include/curl/multi.h:429:23: error: expected identifier or '(' before ')' token85 > 429 | CURL_EXTERN CURLMcode curl_multi_setopt(CURLM *multi_handle,86 > | ^~~~~~~~~~~~~~~~~87 > make: *** [<builtin>: src/event.o] Error 188 For full logs, run:89 nix log /nix/store/dxjxg15c0m6vdgy5yswqbm50g4fww2p1-pg_net-0.14.0.drv90error: Cannot build '/nix/store/ky294hja2giinx8655lj1d83j4jq5gjj-pg_net-0.14.0.drv'.91 Reason: builder failed with exit code 2.92 Output paths:93 /nix/store/da6kcjzl896sjpnd8rrkfzykfm8chlaz-pg_net-0.14.094 Last 25 log lines:95 > src/errors.h:6:11: warning: call to 'Wcurl_easy_setopt_err_long' declared with attribute warning: curl_easy_setopt expects a long argument [-Wattribute-warning]96 > 6 | if (curl_easy_setopt(hdl, opt, prm) != CURLE_OK) \97 > | ^~~~~~~~~~~~~~~~98 > src/core.c:134:3: note: in expansion of macro 'EREPORT_CURL_SETOPT'99 > 134 | EREPORT_CURL_SETOPT(curl_ez_handle, CURLOPT_TIMEOUT_MS, cdata->timeout_milliseconds);100 > | ^~~~~~~~~~~~~~~~~~~101 > src/errors.h:6:11: warning: call to 'Wcurl_easy_setopt_err_long' declared with attribute warning: curl_easy_setopt expects a long argument [-Wattribute-warning]102 > 6 | if (curl_easy_setopt(hdl, opt, prm) != CURLE_OK) \103 > | ^~~~~~~~~~~~~~~~104 > src/core.c:136:3: note: in expansion of macro 'EREPORT_CURL_SETOPT'105 > 136 | EREPORT_CURL_SETOPT(curl_ez_handle, CURLOPT_FOLLOWLOCATION, true);106 > | ^~~~~~~~~~~~~~~~~~~107 > gcc -Wall -Wmissing-prototypes -Wpointer-arith -Wdeclaration-after-statement -Werror=vla -Wendif-labels -Wmissing-format-attribute -Wimplicit-fallthrough=3 -Wcast-function-type -Wshadow=compatible-local -Wformat-security -fno-strict-aliasing -fwrapv -fexcess-precision=standard -Wno-format-truncation -Wno-stringop-truncation -g -O2 -std=c11 -Werror -Wno-declaration-after-statement -fPIC -fvisibility=hidden -DEXTVERSION=\"0.14.0\" -I. -I./ -I/nix/store/dj25xabr71j1mmxf628lqsn61qd5qcyk-postgresql-17.11/include/server -I/nix/store/dj25xabr71j1mmxf628lqsn61qd5qcyk-postgresql-17.11/include/internal -D_GNU_SOURCE -I/nix/store/5nl2zr46dic7mxcw6cvbq85wa8c2gngh-libxml2-2.15.1-dev/include/libxml2 -I/nix/store/sl10j863s32x7dv5vw6wfx1nh22f3xh2-lz4-1.10.0-dev/include -I/nix/store/di94mxmhhk390zzzv2gvavfwkgww7q6h-zstd-1.5.7-dev/include -I/nix/store/h5hfqhzcqszmsacj26hh3fngwcal04zs-icu4c-75.1-dev/include -c -o src/errors.o src/errors.c108 > gcc -Wall -Wmissing-prototypes -Wpointer-arith -Wdeclaration-after-statement -Werror=vla -Wendif-labels -Wmissing-format-attribute -Wimplicit-fallthrough=3 -Wcast-function-type -Wshadow=compatible-local -Wformat-security -fno-strict-aliasing -fwrapv -fexcess-precision=standard -Wno-format-truncation -Wno-stringop-truncation -g -O2 -std=c11 -Werror -Wno-declaration-after-statement -fPIC -fvisibility=hidden -DEXTVERSION=\"0.14.0\" -I. -I./ -I/nix/store/dj25xabr71j1mmxf628lqsn61qd5qcyk-postgresql-17.11/include/server -I/nix/store/dj25xabr71j1mmxf628lqsn61qd5qcyk-postgresql-17.11/include/internal -D_GNU_SOURCE -I/nix/store/5nl2zr46dic7mxcw6cvbq85wa8c2gngh-libxml2-2.15.1-dev/include/libxml2 -I/nix/store/sl10j863s32x7dv5vw6wfx1nh22f3xh2-lz4-1.10.0-dev/include -I/nix/store/di94mxmhhk390zzzv2gvavfwkgww7q6h-zstd-1.5.7-dev/include -I/nix/store/h5hfqhzcqszmsacj26hh3fngwcal04zs-icu4c-75.1-dev/include -c -o src/event.o src/event.c109 > In file included from /nix/store/wflnb8fxmq4lqx3ca91hlpv95vrqkv51-curl-8.17.0-dev/include/curl/curl.h:3333,110 > from /nix/store/wflnb8fxmq4lqx3ca91hlpv95vrqkv51-curl-8.17.0-dev/include/curl/multi.h:51,111 > from src/event.h:4,112 > from src/event.c:6:113 > /nix/store/wflnb8fxmq4lqx3ca91hlpv95vrqkv51-curl-8.17.0-dev/include/curl/multi.h:429:23: error: expected identifier or '(' before '__extension__'114 > 429 | CURL_EXTERN CURLMcode curl_multi_setopt(CURLM *multi_handle,115 > | ^~~~~~~~~~~~~~~~~116 > /nix/store/wflnb8fxmq4lqx3ca91hlpv95vrqkv51-curl-8.17.0-dev/include/curl/multi.h:429:23: error: expected identifier or '(' before ')' token117 > 429 | CURL_EXTERN CURLMcode curl_multi_setopt(CURLM *multi_handle,118 > | ^~~~~~~~~~~~~~~~~119 > make: *** [<builtin>: src/event.o] Error 1120 For full logs, run:121 nix log /nix/store/ky294hja2giinx8655lj1d83j4jq5gjj-pg_net-0.14.0.drv122error: Cannot build '/nix/store/bv2b3hyfiwg59frhybs6cmf9l26byfrs-pg_net-0.13.0.drv'.123 Reason: builder failed with exit code 2.124 Output paths:125 /nix/store/78qw5358gp449syn03ah921j442fw14j-pg_net-0.13.0126 Last 25 log lines:127 > | ^~~~~~~~~~~~~~128 > src/util.h:6:11: warning: call to 'Wcurl_easy_setopt_err_long' declared with attribute warning: curl_easy_setopt expects a long argument [-Wattribute-warning]129 > 6 | if (curl_easy_setopt(hdl, opt, prm) != CURLE_OK) \130 > | ^~~~~~~~~~~~~~~~131 > src/core.c:108:3: note: in expansion of macro 'CURL_EZ_SETOPT'132 > 108 | CURL_EZ_SETOPT(curl_ez_handle, CURLOPT_TIMEOUT_MS, timeout_milliseconds);133 > | ^~~~~~~~~~~~~~134 > src/util.h:6:11: warning: call to 'Wcurl_easy_setopt_err_long' declared with attribute warning: curl_easy_setopt expects a long argument [-Wattribute-warning]135 > 6 | if (curl_easy_setopt(hdl, opt, prm) != CURLE_OK) \136 > | ^~~~~~~~~~~~~~~~137 > src/core.c:110:3: note: in expansion of macro 'CURL_EZ_SETOPT'138 > 110 | CURL_EZ_SETOPT(curl_ez_handle, CURLOPT_FOLLOWLOCATION, true);139 > | ^~~~~~~~~~~~~~140 > gcc -Wall -Wmissing-prototypes -Wpointer-arith -Wdeclaration-after-statement -Werror=vla -Wendif-labels -Wmissing-format-attribute -Wimplicit-fallthrough=3 -Wcast-function-type -Wshadow=compatible-local -Wformat-security -fno-strict-aliasing -fwrapv -fexcess-precision=standard -Wno-format-truncation -Wno-stringop-truncation -g -O2 -std=c11 -Werror -Wno-declaration-after-statement -fPIC -fvisibility=hidden -DEXTVERSION=\"0.13.0\" -I. -I./ -I/nix/store/qmc7y6nc0qxg50ywm46x4iaqq5knz702-postgresql-17_22/include/server -I/nix/store/qmc7y6nc0qxg50ywm46x4iaqq5knz702-postgresql-17_22/include/internal -D_GNU_SOURCE -I/nix/store/5nl2zr46dic7mxcw6cvbq85wa8c2gngh-libxml2-2.15.1-dev/include/libxml2 -I/nix/store/sl10j863s32x7dv5vw6wfx1nh22f3xh2-lz4-1.10.0-dev/include -I/nix/store/di94mxmhhk390zzzv2gvavfwkgww7q6h-zstd-1.5.7-dev/include -I/nix/store/h5hfqhzcqszmsacj26hh3fngwcal04zs-icu4c-75.1-dev/include -c -o src/event.o src/event.c141 > In file included from /nix/store/wflnb8fxmq4lqx3ca91hlpv95vrqkv51-curl-8.17.0-dev/include/curl/curl.h:3333,142 > from /nix/store/wflnb8fxmq4lqx3ca91hlpv95vrqkv51-curl-8.17.0-dev/include/curl/multi.h:51,143 > from src/event.h:4,144 > from src/event.c:6:145 > /nix/store/wflnb8fxmq4lqx3ca91hlpv95vrqkv51-curl-8.17.0-dev/include/curl/multi.h:429:23: error: expected identifier or '(' before '__extension__'146 > 429 | CURL_EXTERN CURLMcode curl_multi_setopt(CURLM *multi_handle,147 > | ^~~~~~~~~~~~~~~~~148 > /nix/store/wflnb8fxmq4lqx3ca91hlpv95vrqkv51-curl-8.17.0-dev/include/curl/multi.h:429:23: error: expected identifier or '(' before ')' token149 > 429 | CURL_EXTERN CURLMcode curl_multi_setopt(CURLM *multi_handle,150 > | ^~~~~~~~~~~~~~~~~151 > make: *** [<builtin>: src/event.o] Error 1152 For full logs, run:153 nix log /nix/store/bv2b3hyfiwg59frhybs6cmf9l26byfrs-pg_net-0.13.0.drv154error: Cannot build '/nix/store/jdx62c5jlcjxsbqjaqi25zwfy2ys9jp5-pg_net-0.13.0.drv'.155 Reason: builder failed with exit code 2.156 Output paths:157 /nix/store/z8m2csva6bci9vlabgjm2wqd19ww393d-pg_net-0.13.0158 Last 25 log lines:159 > | ^~~~~~~~~~~~~~160 > src/util.h:6:11: warning: call to 'Wcurl_easy_setopt_err_long' declared with attribute warning: curl_easy_setopt expects a long argument [-Wattribute-warning]161 > 6 | if (curl_easy_setopt(hdl, opt, prm) != CURLE_OK) \162 > | ^~~~~~~~~~~~~~~~163 > src/core.c:108:3: note: in expansion of macro 'CURL_EZ_SETOPT'164 > 108 | CURL_EZ_SETOPT(curl_ez_handle, CURLOPT_TIMEOUT_MS, timeout_milliseconds);165 > | ^~~~~~~~~~~~~~166 > src/util.h:6:11: warning: call to 'Wcurl_easy_setopt_err_long' declared with attribute warning: curl_easy_setopt expects a long argument [-Wattribute-warning]167 > 6 | if (curl_easy_setopt(hdl, opt, prm) != CURLE_OK) \168 > | ^~~~~~~~~~~~~~~~169 > src/core.c:110:3: note: in expansion of macro 'CURL_EZ_SETOPT'170 > 110 | CURL_EZ_SETOPT(curl_ez_handle, CURLOPT_FOLLOWLOCATION, true);171 > | ^~~~~~~~~~~~~~172 > gcc -Wall -Wmissing-prototypes -Wpointer-arith -Wdeclaration-after-statement -Werror=vla -Wendif-labels -Wmissing-format-attribute -Wimplicit-fallthrough=3 -Wcast-function-type -Wshadow=compatible-local -Wformat-security -fno-strict-aliasing -fwrapv -fexcess-precision=standard -Wno-format-truncation -Wno-stringop-truncation -g -O2 -std=c11 -Werror -Wno-declaration-after-statement -fPIC -fvisibility=hidden -DEXTVERSION=\"0.13.0\" -I. -I./ -I/nix/store/dj25xabr71j1mmxf628lqsn61qd5qcyk-postgresql-17.11/include/server -I/nix/store/dj25xabr71j1mmxf628lqsn61qd5qcyk-postgresql-17.11/include/internal -D_GNU_SOURCE -I/nix/store/5nl2zr46dic7mxcw6cvbq85wa8c2gngh-libxml2-2.15.1-dev/include/libxml2 -I/nix/store/sl10j863s32x7dv5vw6wfx1nh22f3xh2-lz4-1.10.0-dev/include -I/nix/store/di94mxmhhk390zzzv2gvavfwkgww7q6h-zstd-1.5.7-dev/include -I/nix/store/h5hfqhzcqszmsacj26hh3fngwcal04zs-icu4c-75.1-dev/include -c -o src/event.o src/event.c173 > In file included from /nix/store/wflnb8fxmq4lqx3ca91hlpv95vrqkv51-curl-8.17.0-dev/include/curl/curl.h:3333,174 > from /nix/store/wflnb8fxmq4lqx3ca91hlpv95vrqkv51-curl-8.17.0-dev/include/curl/multi.h:51,175 > from src/event.h:4,176 > from src/event.c:6:177 > /nix/store/wflnb8fxmq4lqx3ca91hlpv95vrqkv51-curl-8.17.0-dev/include/curl/multi.h:429:23: error: expected identifier or '(' before '__extension__'178 > 429 | CURL_EXTERN CURLMcode curl_multi_setopt(CURLM *multi_handle,179 > | ^~~~~~~~~~~~~~~~~180 > /nix/store/wflnb8fxmq4lqx3ca91hlpv95vrqkv51-curl-8.17.0-dev/include/curl/multi.h:429:23: error: expected identifier or '(' before ')' token181 > 429 | CURL_EXTERN CURLMcode curl_multi_setopt(CURLM *multi_handle,182 > | ^~~~~~~~~~~~~~~~~183 > make: *** [<builtin>: src/event.o] Error 1184 For full logs, run:185 nix log /nix/store/jdx62c5jlcjxsbqjaqi25zwfy2ys9jp5-pg_net-0.13.0.drv186error: Cannot build '/nix/store/h3jfznl8xhwm8wvvxg23yj74srzz3vii-pg_net-0.19.5.drv'.187 Reason: builder failed with exit code 2.188 Output paths:189 /nix/store/yc457kag2jhvws0021nbq7nsws86glnl-pg_net-0.19.5190 Last 22 log lines:191 > Running phase: unpackPhase192 > unpacking source archive /nix/store/5zgdqy3bz93jyn79pizxc1hks0cdcadw-source193 > source root is source194 > Running phase: patchPhase195 > Running phase: updateAutotoolsGnuConfigScriptsPhase196 > Running phase: configurePhase197 > no configure script, doing nothing198 > Running phase: buildPhase199 > gcc -Wall -Wmissing-prototypes -Wpointer-arith -Wdeclaration-after-statement -Werror=vla -Wendif-labels -Wmissing-format-attribute -Wimplicit-fallthrough=3 -Wcast-function-type -Wshadow=compatible-local -Wformat-security -fno-strict-aliasing -fwrapv -fexcess-precision=standard -Wno-format-truncation -Wno-stringop-truncation -g -O2 -std=c11 -Wextra -Wall -Werror -Wno-declaration-after-statement -Wno-vla -Wno-long-long -Wmissing-variable-declarations -fPIC -fvisibility=hidden -DEXTVERSION=\"0.19.5\" -I. -I./ -I/nix/store/dj25xabr71j1mmxf628lqsn61qd5qcyk-postgresql-17.11/include/server -I/nix/store/dj25xabr71j1mmxf628lqsn61qd5qcyk-postgresql-17.11/include/internal -D_GNU_SOURCE -I/nix/store/5nl2zr46dic7mxcw6cvbq85wa8c2gngh-libxml2-2.15.1-dev/include/libxml2 -I/nix/store/sl10j863s32x7dv5vw6wfx1nh22f3xh2-lz4-1.10.0-dev/include -I/nix/store/di94mxmhhk390zzzv2gvavfwkgww7q6h-zstd-1.5.7-dev/include -I/nix/store/h5hfqhzcqszmsacj26hh3fngwcal04zs-icu4c-75.1-dev/include -c -o src/core.o src/core.c200 > gcc -Wall -Wmissing-prototypes -Wpointer-arith -Wdeclaration-after-statement -Werror=vla -Wendif-labels -Wmissing-format-attribute -Wimplicit-fallthrough=3 -Wcast-function-type -Wshadow=compatible-local -Wformat-security -fno-strict-aliasing -fwrapv -fexcess-precision=standard -Wno-format-truncation -Wno-stringop-truncation -g -O2 -std=c11 -Wextra -Wall -Werror -Wno-declaration-after-statement -Wno-vla -Wno-long-long -Wmissing-variable-declarations -fPIC -fvisibility=hidden -DEXTVERSION=\"0.19.5\" -I. -I./ -I/nix/store/dj25xabr71j1mmxf628lqsn61qd5qcyk-postgresql-17.11/include/server -I/nix/store/dj25xabr71j1mmxf628lqsn61qd5qcyk-postgresql-17.11/include/internal -D_GNU_SOURCE -I/nix/store/5nl2zr46dic7mxcw6cvbq85wa8c2gngh-libxml2-2.15.1-dev/include/libxml2 -I/nix/store/sl10j863s32x7dv5vw6wfx1nh22f3xh2-lz4-1.10.0-dev/include -I/nix/store/di94mxmhhk390zzzv2gvavfwkgww7q6h-zstd-1.5.7-dev/include -I/nix/store/h5hfqhzcqszmsacj26hh3fngwcal04zs-icu4c-75.1-dev/include -c -o src/errors.o src/errors.c201 > gcc -Wall -Wmissing-prototypes -Wpointer-arith -Wdeclaration-after-statement -Werror=vla -Wendif-labels -Wmissing-format-attribute -Wimplicit-fallthrough=3 -Wcast-function-type -Wshadow=compatible-local -Wformat-security -fno-strict-aliasing -fwrapv -fexcess-precision=standard -Wno-format-truncation -Wno-stringop-truncation -g -O2 -std=c11 -Wextra -Wall -Werror -Wno-declaration-after-statement -Wno-vla -Wno-long-long -Wmissing-variable-declarations -fPIC -fvisibility=hidden -DEXTVERSION=\"0.19.5\" -I. -I./ -I/nix/store/dj25xabr71j1mmxf628lqsn61qd5qcyk-postgresql-17.11/include/server -I/nix/store/dj25xabr71j1mmxf628lqsn61qd5qcyk-postgresql-17.11/include/internal -D_GNU_SOURCE -I/nix/store/5nl2zr46dic7mxcw6cvbq85wa8c2gngh-libxml2-2.15.1-dev/include/libxml2 -I/nix/store/sl10j863s32x7dv5vw6wfx1nh22f3xh2-lz4-1.10.0-dev/include -I/nix/store/di94mxmhhk390zzzv2gvavfwkgww7q6h-zstd-1.5.7-dev/include -I/nix/store/h5hfqhzcqszmsacj26hh3fngwcal04zs-icu4c-75.1-dev/include -c -o src/event.o src/event.c202 > In file included from /nix/store/wflnb8fxmq4lqx3ca91hlpv95vrqkv51-curl-8.17.0-dev/include/curl/curl.h:3333,203 > from /nix/store/wflnb8fxmq4lqx3ca91hlpv95vrqkv51-curl-8.17.0-dev/include/curl/multi.h:51,204 > from src/event.h:4,205 > from src/event.c:6:206 > /nix/store/wflnb8fxmq4lqx3ca91hlpv95vrqkv51-curl-8.17.0-dev/include/curl/multi.h:429:23: error: expected identifier or '(' before '__extension__'207 > 429 | CURL_EXTERN CURLMcode curl_multi_setopt(CURLM *multi_handle,208 > | ^~~~~~~~~~~~~~~~~209 > /nix/store/wflnb8fxmq4lqx3ca91hlpv95vrqkv51-curl-8.17.0-dev/include/curl/multi.h:429:23: error: expected identifier or '(' before ')' token210 > 429 | CURL_EXTERN CURLMcode curl_multi_setopt(CURLM *multi_handle,211 > | ^~~~~~~~~~~~~~~~~212 > make: *** [<builtin>: src/event.o] Error 1213 For full logs, run:214 nix log /nix/store/h3jfznl8xhwm8wvvxg23yj74srzz3vii-pg_net-0.19.5.drv215error: Cannot build '/nix/store/cqdc5q7n6g9pkxy0cjcvkq185rps4bfd-pg_net.drv'.216 Reason: 4 dependencies failed.217 Output paths:218 /nix/store/4sc9iw7bqgw1y6834l2h4w200hvc8b79-pg_net219error: Cannot build '/nix/store/d5s4s970iizz6a8w5ndnpzyw63w1m1qv-postgresql-and-plugins-17.11.drv'.220 Reason: 1 dependency failed.221 Output paths:222 /nix/store/dlsqc392rqmvj64617g73zcbvclgch0b-postgresql-and-plugins-17.11223error: Cannot build '/nix/store/indj4nm2a8g5g662hyqq8132ckwfni3z-postgresql-and-plugins-17.11.drv'.224 Reason: 1 dependency failed.225 Output paths:226 /nix/store/3sqy1r56z71hq8mjfnvvdcffs9lyqv40-postgresql-and-plugins-17.11227error: Cannot build '/nix/store/7hla3p20yajypj5w3hnrx38bc3kq14vq-postgresql-and-plugins-17.11.drv'.228 Reason: 1 dependency failed.229 Output paths:230 /nix/store/j9fc5s30v77k7ycb6icimvdhkb7ss17i-postgresql-and-plugins-17.11231error: Cannot build '/nix/store/7m2w2f1wdvyk1m13sihdz2pk989awrx2-postgresql-and-plugins-17.11.drv'.232 Reason: 1 dependency failed.233 Output paths:234 /nix/store/w8333znmm6av2wlw8m9f6g6clqfi50ql-postgresql-and-plugins-17.11235error: Cannot build '/nix/store/v7i610b6q10zpsd2536yvba9pd2xqrr6-pg_net-0.19.5.drv'.236 Reason: builder failed with exit code 2.237 Output paths:238 /nix/store/pzmf3gl6j9iwmkqjfvwvsb11fh4i1rz2-pg_net-0.19.5239 Last 22 log lines:240 > Running phase: unpackPhase241 > unpacking source archive /nix/store/5zgdqy3bz93jyn79pizxc1hks0cdcadw-source242 > source root is source243 > Running phase: patchPhase244 > Running phase: updateAutotoolsGnuConfigScriptsPhase245 > Running phase: configurePhase246 > no configure script, doing nothing247 > Running phase: buildPhase248 > gcc -Wall -Wmissing-prototypes -Wpointer-arith -Wdeclaration-after-statement -Werror=vla -Wendif-labels -Wmissing-format-attribute -Wimplicit-fallthrough=3 -Wcast-function-type -Wshadow=compatible-local -Wformat-security -fno-strict-aliasing -fwrapv -fexcess-precision=standard -Wno-format-truncation -Wno-stringop-truncation -g -O2 -std=c11 -Wextra -Wall -Werror -Wno-declaration-after-statement -Wno-vla -Wno-long-long -Wmissing-variable-declarations -fPIC -fvisibility=hidden -DEXTVERSION=\"0.19.5\" -I. -I./ -I/nix/store/qmc7y6nc0qxg50ywm46x4iaqq5knz702-postgresql-17_22/include/server -I/nix/store/qmc7y6nc0qxg50ywm46x4iaqq5knz702-postgresql-17_22/include/internal -D_GNU_SOURCE -I/nix/store/5nl2zr46dic7mxcw6cvbq85wa8c2gngh-libxml2-2.15.1-dev/include/libxml2 -I/nix/store/sl10j863s32x7dv5vw6wfx1nh22f3xh2-lz4-1.10.0-dev/include -I/nix/store/di94mxmhhk390zzzv2gvavfwkgww7q6h-zstd-1.5.7-dev/include -I/nix/store/h5hfqhzcqszmsacj26hh3fngwcal04zs-icu4c-75.1-dev/include -c -o src/core.o src/core.c249 > gcc -Wall -Wmissing-prototypes -Wpointer-arith -Wdeclaration-after-statement -Werror=vla -Wendif-labels -Wmissing-format-attribute -Wimplicit-fallthrough=3 -Wcast-function-type -Wshadow=compatible-local -Wformat-security -fno-strict-aliasing -fwrapv -fexcess-precision=standard -Wno-format-truncation -Wno-stringop-truncation -g -O2 -std=c11 -Wextra -Wall -Werror -Wno-declaration-after-statement -Wno-vla -Wno-long-long -Wmissing-variable-declarations -fPIC -fvisibility=hidden -DEXTVERSION=\"0.19.5\" -I. -I./ -I/nix/store/qmc7y6nc0qxg50ywm46x4iaqq5knz702-postgresql-17_22/include/server -I/nix/store/qmc7y6nc0qxg50ywm46x4iaqq5knz702-postgresql-17_22/include/internal -D_GNU_SOURCE -I/nix/store/5nl2zr46dic7mxcw6cvbq85wa8c2gngh-libxml2-2.15.1-dev/include/libxml2 -I/nix/store/sl10j863s32x7dv5vw6wfx1nh22f3xh2-lz4-1.10.0-dev/include -I/nix/store/di94mxmhhk390zzzv2gvavfwkgww7q6h-zstd-1.5.7-dev/include -I/nix/store/h5hfqhzcqszmsacj26hh3fngwcal04zs-icu4c-75.1-dev/include -c -o src/errors.o src/errors.c250 > gcc -Wall -Wmissing-prototypes -Wpointer-arith -Wdeclaration-after-statement -Werror=vla -Wendif-labels -Wmissing-format-attribute -Wimplicit-fallthrough=3 -Wcast-function-type -Wshadow=compatible-local -Wformat-security -fno-strict-aliasing -fwrapv -fexcess-precision=standard -Wno-format-truncation -Wno-stringop-truncation -g -O2 -std=c11 -Wextra -Wall -Werror -Wno-declaration-after-statement -Wno-vla -Wno-long-long -Wmissing-variable-declarations -fPIC -fvisibility=hidden -DEXTVERSION=\"0.19.5\" -I. -I./ -I/nix/store/qmc7y6nc0qxg50ywm46x4iaqq5knz702-postgresql-17_22/include/server -I/nix/store/qmc7y6nc0qxg50ywm46x4iaqq5knz702-postgresql-17_22/include/internal -D_GNU_SOURCE -I/nix/store/5nl2zr46dic7mxcw6cvbq85wa8c2gngh-libxml2-2.15.1-dev/include/libxml2 -I/nix/store/sl10j863s32x7dv5vw6wfx1nh22f3xh2-lz4-1.10.0-dev/include -I/nix/store/di94mxmhhk390zzzv2gvavfwkgww7q6h-zstd-1.5.7-dev/include -I/nix/store/h5hfqhzcqszmsacj26hh3fngwcal04zs-icu4c-75.1-dev/include -c -o src/event.o src/event.c251 > In file included from /nix/store/wflnb8fxmq4lqx3ca91hlpv95vrqkv51-curl-8.17.0-dev/include/curl/curl.h:3333,252 > from /nix/store/wflnb8fxmq4lqx3ca91hlpv95vrqkv51-curl-8.17.0-dev/include/curl/multi.h:51,253 > from src/event.h:4,254 > from src/event.c:6:255 > /nix/store/wflnb8fxmq4lqx3ca91hlpv95vrqkv51-curl-8.17.0-dev/include/curl/multi.h:429:23: error: expected identifier or '(' before '__extension__'256 > 429 | CURL_EXTERN CURLMcode curl_multi_setopt(CURLM *multi_handle,257 > | ^~~~~~~~~~~~~~~~~258 > /nix/store/wflnb8fxmq4lqx3ca91hlpv95vrqkv51-curl-8.17.0-dev/include/curl/multi.h:429:23: error: expected identifier or '(' before ')' token259 > 429 | CURL_EXTERN CURLMcode curl_multi_setopt(CURLM *multi_handle,260 > | ^~~~~~~~~~~~~~~~~261 > make: *** [<builtin>: src/event.o] Error 1262 For full logs, run:263 nix log /nix/store/v7i610b6q10zpsd2536yvba9pd2xqrr6-pg_net-0.19.5.drv264error: Cannot build '/nix/store/hfwkzpr1kplwaywhvayqm6j4gsva8n5n-pg_net-0.20.0.drv'.265 Reason: builder failed with exit code 2.266 Output paths:267 /nix/store/scsfkgabhfzpzf64a6cgvkx2zglb6vji-pg_net-0.20.0268 Last 22 log lines:269 > Running phase: unpackPhase270 > unpacking source archive /nix/store/3783i7yhcfqnyv5ndli22gcr11ap151m-source271 > source root is source272 > Running phase: patchPhase273 > Running phase: updateAutotoolsGnuConfigScriptsPhase274 > Running phase: configurePhase275 > no configure script, doing nothing276 > Running phase: buildPhase277 > gcc -Wall -Wmissing-prototypes -Wpointer-arith -Wdeclaration-after-statement -Werror=vla -Wendif-labels -Wmissing-format-attribute -Wimplicit-fallthrough=3 -Wcast-function-type -Wformat-security -fno-strict-aliasing -fwrapv -fexcess-precision=standard -Wno-deprecated-non-prototype -Wno-format-truncation -Wno-stringop-truncation -g -O2 -std=gnu17 -std=c11 -Wextra -Wall -Werror -Wno-declaration-after-statement -Wno-vla -Wno-long-long -Wmissing-variable-declarations -fPIC -DEXTVERSION=\"0.20.0\" -I. -I./ -I/nix/store/804f042cyc4dca4vwl2fmh1rhfy0sij9-postgresql-15.19/include/server -I/nix/store/804f042cyc4dca4vwl2fmh1rhfy0sij9-postgresql-15.19/include/internal -D_GNU_SOURCE -I/nix/store/5nl2zr46dic7mxcw6cvbq85wa8c2gngh-libxml2-2.15.1-dev/include/libxml2 -I/nix/store/sl10j863s32x7dv5vw6wfx1nh22f3xh2-lz4-1.10.0-dev/include -I/nix/store/di94mxmhhk390zzzv2gvavfwkgww7q6h-zstd-1.5.7-dev/include -I/nix/store/h5hfqhzcqszmsacj26hh3fngwcal04zs-icu4c-75.1-dev/include -c -o src/core.o src/core.c278 > gcc -Wall -Wmissing-prototypes -Wpointer-arith -Wdeclaration-after-statement -Werror=vla -Wendif-labels -Wmissing-format-attribute -Wimplicit-fallthrough=3 -Wcast-function-type -Wformat-security -fno-strict-aliasing -fwrapv -fexcess-precision=standard -Wno-deprecated-non-prototype -Wno-format-truncation -Wno-stringop-truncation -g -O2 -std=gnu17 -std=c11 -Wextra -Wall -Werror -Wno-declaration-after-statement -Wno-vla -Wno-long-long -Wmissing-variable-declarations -fPIC -DEXTVERSION=\"0.20.0\" -I. -I./ -I/nix/store/804f042cyc4dca4vwl2fmh1rhfy0sij9-postgresql-15.19/include/server -I/nix/store/804f042cyc4dca4vwl2fmh1rhfy0sij9-postgresql-15.19/include/internal -D_GNU_SOURCE -I/nix/store/5nl2zr46dic7mxcw6cvbq85wa8c2gngh-libxml2-2.15.1-dev/include/libxml2 -I/nix/store/sl10j863s32x7dv5vw6wfx1nh22f3xh2-lz4-1.10.0-dev/include -I/nix/store/di94mxmhhk390zzzv2gvavfwkgww7q6h-zstd-1.5.7-dev/include -I/nix/store/h5hfqhzcqszmsacj26hh3fngwcal04zs-icu4c-75.1-dev/include -c -o src/errors.o src/errors.c279 > gcc -Wall -Wmissing-prototypes -Wpointer-arith -Wdeclaration-after-statement -Werror=vla -Wendif-labels -Wmissing-format-attribute -Wimplicit-fallthrough=3 -Wcast-function-type -Wformat-security -fno-strict-aliasing -fwrapv -fexcess-precision=standard -Wno-deprecated-non-prototype -Wno-format-truncation -Wno-stringop-truncation -g -O2 -std=gnu17 -std=c11 -Wextra -Wall -Werror -Wno-declaration-after-statement -Wno-vla -Wno-long-long -Wmissing-variable-declarations -fPIC -DEXTVERSION=\"0.20.0\" -I. -I./ -I/nix/store/804f042cyc4dca4vwl2fmh1rhfy0sij9-postgresql-15.19/include/server -I/nix/store/804f042cyc4dca4vwl2fmh1rhfy0sij9-postgresql-15.19/include/internal -D_GNU_SOURCE -I/nix/store/5nl2zr46dic7mxcw6cvbq85wa8c2gngh-libxml2-2.15.1-dev/include/libxml2 -I/nix/store/sl10j863s32x7dv5vw6wfx1nh22f3xh2-lz4-1.10.0-dev/include -I/nix/store/di94mxmhhk390zzzv2gvavfwkgww7q6h-zstd-1.5.7-dev/include -I/nix/store/h5hfqhzcqszmsacj26hh3fngwcal04zs-icu4c-75.1-dev/include -c -o src/event.o src/event.c280 > In file included from /nix/store/wflnb8fxmq4lqx3ca91hlpv95vrqkv51-curl-8.17.0-dev/include/curl/curl.h:3333,281 > from /nix/store/wflnb8fxmq4lqx3ca91hlpv95vrqkv51-curl-8.17.0-dev/include/curl/multi.h:51,282 > from src/event.h:4,283 > from src/event.c:6:284 > /nix/store/wflnb8fxmq4lqx3ca91hlpv95vrqkv51-curl-8.17.0-dev/include/curl/multi.h:429:23: error: expected identifier or '(' before '__extension__'285 > 429 | CURL_EXTERN CURLMcode curl_multi_setopt(CURLM *multi_handle,286 > | ^~~~~~~~~~~~~~~~~287 > /nix/store/wflnb8fxmq4lqx3ca91hlpv95vrqkv51-curl-8.17.0-dev/include/curl/multi.h:429:23: error: expected identifier or '(' before ')' token288 > 429 | CURL_EXTERN CURLMcode curl_multi_setopt(CURLM *multi_handle,289 > | ^~~~~~~~~~~~~~~~~290 > make: *** [<builtin>: src/event.o] Error 1291 For full logs, run:292 nix log /nix/store/hfwkzpr1kplwaywhvayqm6j4gsva8n5n-pg_net-0.20.0.drv293error: Cannot build '/nix/store/jvalwdcdi2ci9kcx1q2zx6hyla1sa738-pg_net-0.20.0.drv'.294 Reason: builder failed with exit code 2.295 Output paths:296 /nix/store/rqjwkm6vikims9d8b7f0a6x4n2qbkq4s-pg_net-0.20.0297 Last 22 log lines:298 > Running phase: unpackPhase299 > unpacking source archive /nix/store/3783i7yhcfqnyv5ndli22gcr11ap151m-source300 > source root is source301 > Running phase: patchPhase302 > Running phase: updateAutotoolsGnuConfigScriptsPhase303 > Running phase: configurePhase304 > no configure script, doing nothing305 > Running phase: buildPhase306 > gcc -Wall -Wmissing-prototypes -Wpointer-arith -Wdeclaration-after-statement -Werror=vla -Wendif-labels -Wmissing-format-attribute -Wimplicit-fallthrough=3 -Wcast-function-type -Wshadow=compatible-local -Wformat-security -fno-strict-aliasing -fwrapv -fexcess-precision=standard -Wno-format-truncation -Wno-stringop-truncation -g -O2 -std=c11 -Wextra -Wall -Werror -Wno-declaration-after-statement -Wno-vla -Wno-long-long -Wmissing-variable-declarations -fPIC -fvisibility=hidden -DEXTVERSION=\"0.20.0\" -I. -I./ -I/nix/store/qmc7y6nc0qxg50ywm46x4iaqq5knz702-postgresql-17_22/include/server -I/nix/store/qmc7y6nc0qxg50ywm46x4iaqq5knz702-postgresql-17_22/include/internal -D_GNU_SOURCE -I/nix/store/5nl2zr46dic7mxcw6cvbq85wa8c2gngh-libxml2-2.15.1-dev/include/libxml2 -I/nix/store/sl10j863s32x7dv5vw6wfx1nh22f3xh2-lz4-1.10.0-dev/include -I/nix/store/di94mxmhhk390zzzv2gvavfwkgww7q6h-zstd-1.5.7-dev/include -I/nix/store/h5hfqhzcqszmsacj26hh3fngwcal04zs-icu4c-75.1-dev/include -c -o src/core.o src/core.c307 > gcc -Wall -Wmissing-prototypes -Wpointer-arith -Wdeclaration-after-statement -Werror=vla -Wendif-labels -Wmissing-format-attribute -Wimplicit-fallthrough=3 -Wcast-function-type -Wshadow=compatible-local -Wformat-security -fno-strict-aliasing -fwrapv -fexcess-precision=standard -Wno-format-truncation -Wno-stringop-truncation -g -O2 -std=c11 -Wextra -Wall -Werror -Wno-declaration-after-statement -Wno-vla -Wno-long-long -Wmissing-variable-declarations -fPIC -fvisibility=hidden -DEXTVERSION=\"0.20.0\" -I. -I./ -I/nix/store/qmc7y6nc0qxg50ywm46x4iaqq5knz702-postgresql-17_22/include/server -I/nix/store/qmc7y6nc0qxg50ywm46x4iaqq5knz702-postgresql-17_22/include/internal -D_GNU_SOURCE -I/nix/store/5nl2zr46dic7mxcw6cvbq85wa8c2gngh-libxml2-2.15.1-dev/include/libxml2 -I/nix/store/sl10j863s32x7dv5vw6wfx1nh22f3xh2-lz4-1.10.0-dev/include -I/nix/store/di94mxmhhk390zzzv2gvavfwkgww7q6h-zstd-1.5.7-dev/include -I/nix/store/h5hfqhzcqszmsacj26hh3fngwcal04zs-icu4c-75.1-dev/include -c -o src/errors.o src/errors.c308 > gcc -Wall -Wmissing-prototypes -Wpointer-arith -Wdeclaration-after-statement -Werror=vla -Wendif-labels -Wmissing-format-attribute -Wimplicit-fallthrough=3 -Wcast-function-type -Wshadow=compatible-local -Wformat-security -fno-strict-aliasing -fwrapv -fexcess-precision=standard -Wno-format-truncation -Wno-stringop-truncation -g -O2 -std=c11 -Wextra -Wall -Werror -Wno-declaration-after-statement -Wno-vla -Wno-long-long -Wmissing-variable-declarations -fPIC -fvisibility=hidden -DEXTVERSION=\"0.20.0\" -I. -I./ -I/nix/store/qmc7y6nc0qxg50ywm46x4iaqq5knz702-postgresql-17_22/include/server -I/nix/store/qmc7y6nc0qxg50ywm46x4iaqq5knz702-postgresql-17_22/include/internal -D_GNU_SOURCE -I/nix/store/5nl2zr46dic7mxcw6cvbq85wa8c2gngh-libxml2-2.15.1-dev/include/libxml2 -I/nix/store/sl10j863s32x7dv5vw6wfx1nh22f3xh2-lz4-1.10.0-dev/include -I/nix/store/di94mxmhhk390zzzv2gvavfwkgww7q6h-zstd-1.5.7-dev/include -I/nix/store/h5hfqhzcqszmsacj26hh3fngwcal04zs-icu4c-75.1-dev/include -c -o src/event.o src/event.c309 > In file included from /nix/store/wflnb8fxmq4lqx3ca91hlpv95vrqkv51-curl-8.17.0-dev/include/curl/curl.h:3333,310 > from /nix/store/wflnb8fxmq4lqx3ca91hlpv95vrqkv51-curl-8.17.0-dev/include/curl/multi.h:51,311 > from src/event.h:4,312 > from src/event.c:6:313 > /nix/store/wflnb8fxmq4lqx3ca91hlpv95vrqkv51-curl-8.17.0-dev/include/curl/multi.h:429:23: error: expected identifier or '(' before '__extension__'314 > 429 | CURL_EXTERN CURLMcode curl_multi_setopt(CURLM *multi_handle,315 > | ^~~~~~~~~~~~~~~~~316 > /nix/store/wflnb8fxmq4lqx3ca91hlpv95vrqkv51-curl-8.17.0-dev/include/curl/multi.h:429:23: error: expected identifier or '(' before ')' token317 > 429 | CURL_EXTERN CURLMcode curl_multi_setopt(CURLM *multi_handle,318 > | ^~~~~~~~~~~~~~~~~319 > make: *** [<builtin>: src/event.o] Error 1320 For full logs, run:321 nix log /nix/store/jvalwdcdi2ci9kcx1q2zx6hyla1sa738-pg_net-0.20.0.drv322error: Cannot build '/nix/store/zd0hg58y5nwnnwfzy7sd19l7dzx4zvv5-pg_net.drv'.323 Reason: 4 dependencies failed.324 Output paths:325 /nix/store/5j8is0c6fp325l5akxcq6digg430r2fy-pg_net326error: Cannot build '/nix/store/m7073j3kxn6vxs53jdm448q51cxiimys-postgresql-and-plugins-17_22.drv'.327 Reason: 1 dependency failed.328 Output paths:329 /nix/store/z04smpdjsr0zxxl7phxyvwwh4ycfq6c5-postgresql-and-plugins-17_22330error: Cannot build '/nix/store/q8qv7gf9izi4my9mjapggg0fx2dhzlwc-postgresql-and-plugins-17_22.drv'.331 Reason: 1 dependency failed.332 Output paths:333 /nix/store/y845ymwkrl6d1g0swpxgxwk72nyclj1s-postgresql-and-plugins-17_22334error: Cannot build '/nix/store/7b5ar71808xp6cc9vi64vcr3gxhaq9w2-pg_net-0.14.0.drv'.335 Reason: builder failed with exit code 2.336 Output paths:337 /nix/store/2vyqm50vp9dxrrm1lidjzvr6difmnnqc-pg_net-0.14.0338 Last 25 log lines:339 > src/errors.h:6:11: warning: call to 'Wcurl_easy_setopt_err_long' declared with attribute warning: curl_easy_setopt expects a long argument [-Wattribute-warning]340 > 6 | if (curl_easy_setopt(hdl, opt, prm) != CURLE_OK) \341 > | ^~~~~~~~~~~~~~~~342 > src/core.c:134:3: note: in expansion of macro 'EREPORT_CURL_SETOPT'343 > 134 | EREPORT_CURL_SETOPT(curl_ez_handle, CURLOPT_TIMEOUT_MS, cdata->timeout_milliseconds);344 > | ^~~~~~~~~~~~~~~~~~~345 > src/errors.h:6:11: warning: call to 'Wcurl_easy_setopt_err_long' declared with attribute warning: curl_easy_setopt expects a long argument [-Wattribute-warning]346 > 6 | if (curl_easy_setopt(hdl, opt, prm) != CURLE_OK) \347 > | ^~~~~~~~~~~~~~~~348 > src/core.c:136:3: note: in expansion of macro 'EREPORT_CURL_SETOPT'349 > 136 | EREPORT_CURL_SETOPT(curl_ez_handle, CURLOPT_FOLLOWLOCATION, true);350 > | ^~~~~~~~~~~~~~~~~~~351 > gcc -Wall -Wmissing-prototypes -Wpointer-arith -Wdeclaration-after-statement -Werror=vla -Wendif-labels -Wmissing-format-attribute -Wimplicit-fallthrough=3 -Wcast-function-type -Wformat-security -fno-strict-aliasing -fwrapv -fexcess-precision=standard -Wno-deprecated-non-prototype -Wno-format-truncation -Wno-stringop-truncation -g -O2 -std=gnu17 -std=c11 -Werror -Wno-declaration-after-statement -fPIC -DEXTVERSION=\"0.14.0\" -I. -I./ -I/nix/store/804f042cyc4dca4vwl2fmh1rhfy0sij9-postgresql-15.19/include/server -I/nix/store/804f042cyc4dca4vwl2fmh1rhfy0sij9-postgresql-15.19/include/internal -D_GNU_SOURCE -I/nix/store/5nl2zr46dic7mxcw6cvbq85wa8c2gngh-libxml2-2.15.1-dev/include/libxml2 -I/nix/store/sl10j863s32x7dv5vw6wfx1nh22f3xh2-lz4-1.10.0-dev/include -I/nix/store/di94mxmhhk390zzzv2gvavfwkgww7q6h-zstd-1.5.7-dev/include -I/nix/store/h5hfqhzcqszmsacj26hh3fngwcal04zs-icu4c-75.1-dev/include -c -o src/errors.o src/errors.c352 > gcc -Wall -Wmissing-prototypes -Wpointer-arith -Wdeclaration-after-statement -Werror=vla -Wendif-labels -Wmissing-format-attribute -Wimplicit-fallthrough=3 -Wcast-function-type -Wformat-security -fno-strict-aliasing -fwrapv -fexcess-precision=standard -Wno-deprecated-non-prototype -Wno-format-truncation -Wno-stringop-truncation -g -O2 -std=gnu17 -std=c11 -Werror -Wno-declaration-after-statement -fPIC -DEXTVERSION=\"0.14.0\" -I. -I./ -I/nix/store/804f042cyc4dca4vwl2fmh1rhfy0sij9-postgresql-15.19/include/server -I/nix/store/804f042cyc4dca4vwl2fmh1rhfy0sij9-postgresql-15.19/include/internal -D_GNU_SOURCE -I/nix/store/5nl2zr46dic7mxcw6cvbq85wa8c2gngh-libxml2-2.15.1-dev/include/libxml2 -I/nix/store/sl10j863s32x7dv5vw6wfx1nh22f3xh2-lz4-1.10.0-dev/include -I/nix/store/di94mxmhhk390zzzv2gvavfwkgww7q6h-zstd-1.5.7-dev/include -I/nix/store/h5hfqhzcqszmsacj26hh3fngwcal04zs-icu4c-75.1-dev/include -c -o src/event.o src/event.c353 > In file included from /nix/store/wflnb8fxmq4lqx3ca91hlpv95vrqkv51-curl-8.17.0-dev/include/curl/curl.h:3333,354 > from /nix/store/wflnb8fxmq4lqx3ca91hlpv95vrqkv51-curl-8.17.0-dev/include/curl/multi.h:51,355 > from src/event.h:4,356 > from src/event.c:6:357 > /nix/store/wflnb8fxmq4lqx3ca91hlpv95vrqkv51-curl-8.17.0-dev/include/curl/multi.h:429:23: error: expected identifier or '(' before '__extension__'358 > 429 | CURL_EXTERN CURLMcode curl_multi_setopt(CURLM *multi_handle,359 > | ^~~~~~~~~~~~~~~~~360 > /nix/store/wflnb8fxmq4lqx3ca91hlpv95vrqkv51-curl-8.17.0-dev/include/curl/multi.h:429:23: error: expected identifier or '(' before ')' token361 > 429 | CURL_EXTERN CURLMcode curl_multi_setopt(CURLM *multi_handle,362 > | ^~~~~~~~~~~~~~~~~363 > make: *** [<builtin>: src/event.o] Error 1364 For full logs, run:365 nix log /nix/store/7b5ar71808xp6cc9vi64vcr3gxhaq9w2-pg_net-0.14.0.drv366error: Cannot build '/nix/store/ymx9gp4jhvd7qpjvk95vw2m6ycb0jal7-pg_net-0.13.0.drv'.367 Reason: builder failed with exit code 2.368 Output paths:369 /nix/store/pxjg6rykpbbhl7xmwasvyb94bc1v5w3r-pg_net-0.13.0370 Last 25 log lines:371 > | ^~~~~~~~~~~~~~372 > src/util.h:6:11: warning: call to 'Wcurl_easy_setopt_err_long' declared with attribute warning: curl_easy_setopt expects a long argument [-Wattribute-warning]373 > 6 | if (curl_easy_setopt(hdl, opt, prm) != CURLE_OK) \374 > | ^~~~~~~~~~~~~~~~375 > src/core.c:108:3: note: in expansion of macro 'CURL_EZ_SETOPT'376 > 108 | CURL_EZ_SETOPT(curl_ez_handle, CURLOPT_TIMEOUT_MS, timeout_milliseconds);377 > | ^~~~~~~~~~~~~~378 > src/util.h:6:11: warning: call to 'Wcurl_easy_setopt_err_long' declared with attribute warning: curl_easy_setopt expects a long argument [-Wattribute-warning]379 > 6 | if (curl_easy_setopt(hdl, opt, prm) != CURLE_OK) \380 > | ^~~~~~~~~~~~~~~~381 > src/core.c:110:3: note: in expansion of macro 'CURL_EZ_SETOPT'382 > 110 | CURL_EZ_SETOPT(curl_ez_handle, CURLOPT_FOLLOWLOCATION, true);383 > | ^~~~~~~~~~~~~~384 > gcc -Wall -Wmissing-prototypes -Wpointer-arith -Wdeclaration-after-statement -Werror=vla -Wendif-labels -Wmissing-format-attribute -Wimplicit-fallthrough=3 -Wcast-function-type -Wformat-security -fno-strict-aliasing -fwrapv -fexcess-precision=standard -Wno-deprecated-non-prototype -Wno-format-truncation -Wno-stringop-truncation -g -O2 -std=gnu17 -std=c11 -Werror -Wno-declaration-after-statement -fPIC -DEXTVERSION=\"0.13.0\" -I. -I./ -I/nix/store/804f042cyc4dca4vwl2fmh1rhfy0sij9-postgresql-15.19/include/server -I/nix/store/804f042cyc4dca4vwl2fmh1rhfy0sij9-postgresql-15.19/include/internal -D_GNU_SOURCE -I/nix/store/5nl2zr46dic7mxcw6cvbq85wa8c2gngh-libxml2-2.15.1-dev/include/libxml2 -I/nix/store/sl10j863s32x7dv5vw6wfx1nh22f3xh2-lz4-1.10.0-dev/include -I/nix/store/di94mxmhhk390zzzv2gvavfwkgww7q6h-zstd-1.5.7-dev/include -I/nix/store/h5hfqhzcqszmsacj26hh3fngwcal04zs-icu4c-75.1-dev/include -c -o src/event.o src/event.c385 > In file included from /nix/store/wflnb8fxmq4lqx3ca91hlpv95vrqkv51-curl-8.17.0-dev/include/curl/curl.h:3333,386 > from /nix/store/wflnb8fxmq4lqx3ca91hlpv95vrqkv51-curl-8.17.0-dev/include/curl/multi.h:51,387 > from src/event.h:4,388 > from src/event.c:6:389 > /nix/store/wflnb8fxmq4lqx3ca91hlpv95vrqkv51-curl-8.17.0-dev/include/curl/multi.h:429:23: error: expected identifier or '(' before '__extension__'390 > 429 | CURL_EXTERN CURLMcode curl_multi_setopt(CURLM *multi_handle,391 > | ^~~~~~~~~~~~~~~~~392 > /nix/store/wflnb8fxmq4lqx3ca91hlpv95vrqkv51-curl-8.17.0-dev/include/curl/multi.h:429:23: error: expected identifier or '(' before ')' token393 > 429 | CURL_EXTERN CURLMcode curl_multi_setopt(CURLM *multi_handle,394 > | ^~~~~~~~~~~~~~~~~395 > make: *** [<builtin>: src/event.o] Error 1396 For full logs, run:397 nix log /nix/store/ymx9gp4jhvd7qpjvk95vw2m6ycb0jal7-pg_net-0.13.0.drv398error: Cannot build '/nix/store/5v6a4ssacxc4snck5dzagkmqhcsh2swz-pg_net-0.19.5.drv'.399 Reason: builder failed with exit code 2.400 Output paths:401 /nix/store/xcsw4jyz7w5071r5drjiify20gjvij99-pg_net-0.19.5402 Last 22 log lines:403 > Running phase: unpackPhase404 > unpacking source archive /nix/store/5zgdqy3bz93jyn79pizxc1hks0cdcadw-source405 > source root is source406 > Running phase: patchPhase407 > Running phase: updateAutotoolsGnuConfigScriptsPhase408 > Running phase: configurePhase409 > no configure script, doing nothing410 > Running phase: buildPhase411 > gcc -Wall -Wmissing-prototypes -Wpointer-arith -Wdeclaration-after-statement -Werror=vla -Wendif-labels -Wmissing-format-attribute -Wimplicit-fallthrough=3 -Wcast-function-type -Wformat-security -fno-strict-aliasing -fwrapv -fexcess-precision=standard -Wno-deprecated-non-prototype -Wno-format-truncation -Wno-stringop-truncation -g -O2 -std=gnu17 -std=c11 -Wextra -Wall -Werror -Wno-declaration-after-statement -Wno-vla -Wno-long-long -Wmissing-variable-declarations -fPIC -DEXTVERSION=\"0.19.5\" -I. -I./ -I/nix/store/804f042cyc4dca4vwl2fmh1rhfy0sij9-postgresql-15.19/include/server -I/nix/store/804f042cyc4dca4vwl2fmh1rhfy0sij9-postgresql-15.19/include/internal -D_GNU_SOURCE -I/nix/store/5nl2zr46dic7mxcw6cvbq85wa8c2gngh-libxml2-2.15.1-dev/include/libxml2 -I/nix/store/sl10j863s32x7dv5vw6wfx1nh22f3xh2-lz4-1.10.0-dev/include -I/nix/store/di94mxmhhk390zzzv2gvavfwkgww7q6h-zstd-1.5.7-dev/include -I/nix/store/h5hfqhzcqszmsacj26hh3fngwcal04zs-icu4c-75.1-dev/include -c -o src/core.o src/core.c412 > gcc -Wall -Wmissing-prototypes -Wpointer-arith -Wdeclaration-after-statement -Werror=vla -Wendif-labels -Wmissing-format-attribute -Wimplicit-fallthrough=3 -Wcast-function-type -Wformat-security -fno-strict-aliasing -fwrapv -fexcess-precision=standard -Wno-deprecated-non-prototype -Wno-format-truncation -Wno-stringop-truncation -g -O2 -std=gnu17 -std=c11 -Wextra -Wall -Werror -Wno-declaration-after-statement -Wno-vla -Wno-long-long -Wmissing-variable-declarations -fPIC -DEXTVERSION=\"0.19.5\" -I. -I./ -I/nix/store/804f042cyc4dca4vwl2fmh1rhfy0sij9-postgresql-15.19/include/server -I/nix/store/804f042cyc4dca4vwl2fmh1rhfy0sij9-postgresql-15.19/include/internal -D_GNU_SOURCE -I/nix/store/5nl2zr46dic7mxcw6cvbq85wa8c2gngh-libxml2-2.15.1-dev/include/libxml2 -I/nix/store/sl10j863s32x7dv5vw6wfx1nh22f3xh2-lz4-1.10.0-dev/include -I/nix/store/di94mxmhhk390zzzv2gvavfwkgww7q6h-zstd-1.5.7-dev/include -I/nix/store/h5hfqhzcqszmsacj26hh3fngwcal04zs-icu4c-75.1-dev/include -c -o src/errors.o src/errors.c413 > gcc -Wall -Wmissing-prototypes -Wpointer-arith -Wdeclaration-after-statement -Werror=vla -Wendif-labels -Wmissing-format-attribute -Wimplicit-fallthrough=3 -Wcast-function-type -Wformat-security -fno-strict-aliasing -fwrapv -fexcess-precision=standard -Wno-deprecated-non-prototype -Wno-format-truncation -Wno-stringop-truncation -g -O2 -std=gnu17 -std=c11 -Wextra -Wall -Werror -Wno-declaration-after-statement -Wno-vla -Wno-long-long -Wmissing-variable-declarations -fPIC -DEXTVERSION=\"0.19.5\" -I. -I./ -I/nix/store/804f042cyc4dca4vwl2fmh1rhfy0sij9-postgresql-15.19/include/server -I/nix/store/804f042cyc4dca4vwl2fmh1rhfy0sij9-postgresql-15.19/include/internal -D_GNU_SOURCE -I/nix/store/5nl2zr46dic7mxcw6cvbq85wa8c2gngh-libxml2-2.15.1-dev/include/libxml2 -I/nix/store/sl10j863s32x7dv5vw6wfx1nh22f3xh2-lz4-1.10.0-dev/include -I/nix/store/di94mxmhhk390zzzv2gvavfwkgww7q6h-zstd-1.5.7-dev/include -I/nix/store/h5hfqhzcqszmsacj26hh3fngwcal04zs-icu4c-75.1-dev/include -c -o src/event.o src/event.c414 > In file included from /nix/store/wflnb8fxmq4lqx3ca91hlpv95vrqkv51-curl-8.17.0-dev/include/curl/curl.h:3333,415 > from /nix/store/wflnb8fxmq4lqx3ca91hlpv95vrqkv51-curl-8.17.0-dev/include/curl/multi.h:51,416 > from src/event.h:4,417 > from src/event.c:6:418 > /nix/store/wflnb8fxmq4lqx3ca91hlpv95vrqkv51-curl-8.17.0-dev/include/curl/multi.h:429:23: error: expected identifier or '(' before '__extension__'419 > 429 | CURL_EXTERN CURLMcode curl_multi_setopt(CURLM *multi_handle,420 > | ^~~~~~~~~~~~~~~~~421 > /nix/store/wflnb8fxmq4lqx3ca91hlpv95vrqkv51-curl-8.17.0-dev/include/curl/multi.h:429:23: error: expected identifier or '(' before ')' token422 > 429 | CURL_EXTERN CURLMcode curl_multi_setopt(CURLM *multi_handle,423 > | ^~~~~~~~~~~~~~~~~424 > make: *** [<builtin>: src/event.o] Error 1425 For full logs, run:426 nix log /nix/store/5v6a4ssacxc4snck5dzagkmqhcsh2swz-pg_net-0.19.5.drv427error: Cannot build '/nix/store/ggfg6al5fkdp0r1jsc3iabgz0p7g6l1m-pg_net-0.7.drv'.428 Reason: builder failed with exit code 2.429 Output paths:430 /nix/store/pkfapf0li10b8b6nrhwm8880g4d2i8y5-pg_net-0.7431 Last 25 log lines:432 > | ^~~~~~~~~~~~~~433 > src/util.h:6:11: warning: call to 'Wcurl_easy_setopt_err_long' declared with attribute warning: curl_easy_setopt expects a long argument [-Wattribute-warning]434 > 6 | if (curl_easy_setopt(hdl, opt, prm) != CURLE_OK) \435 > | ^~~~~~~~~~~~~~~~436 > src/core.c:108:3: note: in expansion of macro 'CURL_EZ_SETOPT'437 > 108 | CURL_EZ_SETOPT(curl_ez_handle, CURLOPT_TIMEOUT_MS, timeout_milliseconds);438 > | ^~~~~~~~~~~~~~439 > src/util.h:6:11: warning: call to 'Wcurl_easy_setopt_err_long' declared with attribute warning: curl_easy_setopt expects a long argument [-Wattribute-warning]440 > 6 | if (curl_easy_setopt(hdl, opt, prm) != CURLE_OK) \441 > | ^~~~~~~~~~~~~~~~442 > src/core.c:110:3: note: in expansion of macro 'CURL_EZ_SETOPT'443 > 110 | CURL_EZ_SETOPT(curl_ez_handle, CURLOPT_FOLLOWLOCATION, true);444 > | ^~~~~~~~~~~~~~445 > gcc -Wall -Wmissing-prototypes -Wpointer-arith -Wdeclaration-after-statement -Werror=vla -Wendif-labels -Wmissing-format-attribute -Wimplicit-fallthrough=3 -Wcast-function-type -Wformat-security -fno-strict-aliasing -fwrapv -fexcess-precision=standard -Wno-deprecated-non-prototype -Wno-format-truncation -Wno-stringop-truncation -g -O2 -std=gnu17 -std=c11 -Werror -Wno-declaration-after-statement -fPIC -DEXTVERSION=\"0.13.0\" -I. -I./ -I/nix/store/804f042cyc4dca4vwl2fmh1rhfy0sij9-postgresql-15.19/include/server -I/nix/store/804f042cyc4dca4vwl2fmh1rhfy0sij9-postgresql-15.19/include/internal -D_GNU_SOURCE -I/nix/store/5nl2zr46dic7mxcw6cvbq85wa8c2gngh-libxml2-2.15.1-dev/include/libxml2 -I/nix/store/sl10j863s32x7dv5vw6wfx1nh22f3xh2-lz4-1.10.0-dev/include -I/nix/store/di94mxmhhk390zzzv2gvavfwkgww7q6h-zstd-1.5.7-dev/include -I/nix/store/h5hfqhzcqszmsacj26hh3fngwcal04zs-icu4c-75.1-dev/include -c -o src/event.o src/event.c446 > In file included from /nix/store/wflnb8fxmq4lqx3ca91hlpv95vrqkv51-curl-8.17.0-dev/include/curl/curl.h:3333,447 > from /nix/store/wflnb8fxmq4lqx3ca91hlpv95vrqkv51-curl-8.17.0-dev/include/curl/multi.h:51,448 > from src/event.h:4,449 > from src/event.c:6:450 > /nix/store/wflnb8fxmq4lqx3ca91hlpv95vrqkv51-curl-8.17.0-dev/include/curl/multi.h:429:23: error: expected identifier or '(' before '__extension__'451 > 429 | CURL_EXTERN CURLMcode curl_multi_setopt(CURLM *multi_handle,452 > | ^~~~~~~~~~~~~~~~~453 > /nix/store/wflnb8fxmq4lqx3ca91hlpv95vrqkv51-curl-8.17.0-dev/include/curl/multi.h:429:23: error: expected identifier or '(' before ')' token454 > 429 | CURL_EXTERN CURLMcode curl_multi_setopt(CURLM *multi_handle,455 > | ^~~~~~~~~~~~~~~~~456 > make: *** [<builtin>: src/event.o] Error 1457 For full logs, run:458 nix log /nix/store/ggfg6al5fkdp0r1jsc3iabgz0p7g6l1m-pg_net-0.7.drv459error: Cannot build '/nix/store/94hi7qqfg86lfxqnyqizx334my0yjbh3-pg_net.drv'.460 Reason: 5 dependencies failed.461 Output paths:462 /nix/store/88g5knkc68im4z0plvckvdf0ag9pl97y-pg_net463error: Cannot build '/nix/store/a5gfyj0k47cxv70v4a1zhhk1998vd290-postgresql-and-plugins-15.19.drv'.464 Reason: 1 dependency failed.465 Output paths:466 /nix/store/zn5pxdcd7zf2nviqxmbqb3whv0b89njc-postgresql-and-plugins-15.19467error: Cannot build '/nix/store/69zc44dp9979jf4p9hcpgfdf1wgpw40l-postgresql-and-plugins-15.19.drv'.468 Reason: 1 dependency failed.469 Output paths:470 /nix/store/hhm9gzfpx0h3lp8ld4wvl64kwnddl1yd-postgresql-and-plugins-15.19471error: Cannot build '/nix/store/y8b3ly63y3ghcvlfblm537wxpvbf3c4q-start-postgres-server-test.drv'.472 Reason: 3 dependencies failed.473 Output paths:474 /nix/store/2018z4q0jnwisgvgzb2zvrfy72z5bm88-start-postgres-server-test475error: Cannot build '/nix/store/jdcayg9r83y4vzdg9ayqw4ki6glb3spx-postgres-17-check-harness.drv'.476 Reason: 2 dependencies failed.477 Output paths:478 /nix/store/65pfabwx7gprjmyiqkp0wn8shxh355x0-postgres-17-check-harness479error: Cannot build '/nix/store/76nh7fljpj83m7a0qmvx0a20mbdvknln-run-check-harness-psql-17-cli.drv'.480 Reason: 1 dependency failed.481 Output paths:482 /nix/store/h303kf4r0dziim1fvxw58ms6vaj7hgxi-run-check-harness-psql-17-cli