nixbot

builds

supabase/postgres build #133 failed

branch develop · PR #2521 · commit a65495550d · · took 2h 33m · eval 6m 33s

54 failed
failed attributes
status attribute duration
failed checks.aarch64-linux.docker-image-test 2h 23m
pg_net-0.20.0: from src/event.c:6: /nix/store/jviasb44hibgh09829gbmbssbz2jjnhz-curl-8.17.0-dev/include/curl/multi.h:429:23: error: expected ide …
pg_net-0.20.0:
                 from src/event.c:6:
/nix/store/jviasb44hibgh09829gbmbssbz2jjnhz-curl-8.17.0-dev/include/curl/multi.h:429:23: error: expected identifier or '(' before '__extension__'
  429 | CURL_EXTERN CURLMcode curl_multi_setopt(CURLM *multi_handle,
      |                       ^~~~~~~~~~~~~~~~~
/nix/store/jviasb44hibgh09829gbmbssbz2jjnhz-curl-8.17.0-dev/include/curl/multi.h:429:23: error: expected identifier or '(' before ')' token
  429 | CURL_EXTERN CURLMcode curl_multi_setopt(CURLM *multi_handle,
      |                       ^~~~~~~~~~~~~~~~~
make: *** [<builtin>: src/event.o] Error 1

pg_net-0.20.0:
                 from src/event.c:6:
/nix/store/jviasb44hibgh09829gbmbssbz2jjnhz-curl-8.17.0-dev/include/curl/multi.h:429:23: error: expected identifier or '(' before '__extension__'
  429 | CURL_EXTERN CURLMcode curl_multi_setopt(CURLM *multi_handle,
      |                       ^~~~~~~~~~~~~~~~~
/nix/store/jviasb44hibgh09829gbmbssbz2jjnhz-curl-8.17.0-dev/include/curl/multi.h:429:23: error: expected identifier or '(' before ')' token
  429 | CURL_EXTERN CURLMcode curl_multi_setopt(CURLM *multi_handle,
      |                       ^~~~~~~~~~~~~~~~~
make: *** [<builtin>: src/event.o] Error 1

pg_net-0.7:
                 from src/event.c:6:
/nix/store/jviasb44hibgh09829gbmbssbz2jjnhz-curl-8.17.0-dev/include/curl/multi.h:429:23: error: expected identifier or '(' before '__extension__'
  429 | CURL_EXTERN CURLMcode curl_multi_setopt(CURLM *multi_handle,
      |                       ^~~~~~~~~~~~~~~~~
/nix/store/jviasb44hibgh09829gbmbssbz2jjnhz-curl-8.17.0-dev/include/curl/multi.h:429:23: error: expected identifier or '(' before ')' token
  429 | CURL_EXTERN CURLMcode curl_multi_setopt(CURLM *multi_handle,
      |                       ^~~~~~~~~~~~~~~~~
make: *** [<builtin>: src/event.o] Error 1

… and 10 more failed derivations
failed checks.aarch64-linux.ext-amcheck-upgrade 2h 23m
pg_net-0.20.0: from src/event.c:6: /nix/store/jviasb44hibgh09829gbmbssbz2jjnhz-curl-8.17.0-dev/include/curl/multi.h:429:23: error: expected ide …
pg_net-0.20.0:
                 from src/event.c:6:
/nix/store/jviasb44hibgh09829gbmbssbz2jjnhz-curl-8.17.0-dev/include/curl/multi.h:429:23: error: expected identifier or '(' before '__extension__'
  429 | CURL_EXTERN CURLMcode curl_multi_setopt(CURLM *multi_handle,
      |                       ^~~~~~~~~~~~~~~~~
/nix/store/jviasb44hibgh09829gbmbssbz2jjnhz-curl-8.17.0-dev/include/curl/multi.h:429:23: error: expected identifier or '(' before ')' token
  429 | CURL_EXTERN CURLMcode curl_multi_setopt(CURLM *multi_handle,
      |                       ^~~~~~~~~~~~~~~~~
make: *** [<builtin>: src/event.o] Error 1

pg_net-0.20.0:
                 from src/event.c:6:
/nix/store/jviasb44hibgh09829gbmbssbz2jjnhz-curl-8.17.0-dev/include/curl/multi.h:429:23: error: expected identifier or '(' before '__extension__'
  429 | CURL_EXTERN CURLMcode curl_multi_setopt(CURLM *multi_handle,
      |                       ^~~~~~~~~~~~~~~~~
/nix/store/jviasb44hibgh09829gbmbssbz2jjnhz-curl-8.17.0-dev/include/curl/multi.h:429:23: error: expected identifier or '(' before ')' token
  429 | CURL_EXTERN CURLMcode curl_multi_setopt(CURLM *multi_handle,
      |                       ^~~~~~~~~~~~~~~~~
make: *** [<builtin>: src/event.o] Error 1

pg_net-0.7:
                 from src/event.c:6:
/nix/store/jviasb44hibgh09829gbmbssbz2jjnhz-curl-8.17.0-dev/include/curl/multi.h:429:23: error: expected identifier or '(' before '__extension__'
  429 | CURL_EXTERN CURLMcode curl_multi_setopt(CURLM *multi_handle,
      |                       ^~~~~~~~~~~~~~~~~
/nix/store/jviasb44hibgh09829gbmbssbz2jjnhz-curl-8.17.0-dev/include/curl/multi.h:429:23: error: expected identifier or '(' before ')' token
  429 | CURL_EXTERN CURLMcode curl_multi_setopt(CURLM *multi_handle,
      |                       ^~~~~~~~~~~~~~~~~
make: *** [<builtin>: src/event.o] Error 1

… and 6 more failed derivations
failed checks.aarch64-linux.ext-http 2h 23m
pg_net-0.20.0: from src/event.c:6: /nix/store/jviasb44hibgh09829gbmbssbz2jjnhz-curl-8.17.0-dev/include/curl/multi.h:429:23: error: expected ide …
pg_net-0.20.0:
                 from src/event.c:6:
/nix/store/jviasb44hibgh09829gbmbssbz2jjnhz-curl-8.17.0-dev/include/curl/multi.h:429:23: error: expected identifier or '(' before '__extension__'
  429 | CURL_EXTERN CURLMcode curl_multi_setopt(CURLM *multi_handle,
      |                       ^~~~~~~~~~~~~~~~~
/nix/store/jviasb44hibgh09829gbmbssbz2jjnhz-curl-8.17.0-dev/include/curl/multi.h:429:23: error: expected identifier or '(' before ')' token
  429 | CURL_EXTERN CURLMcode curl_multi_setopt(CURLM *multi_handle,
      |                       ^~~~~~~~~~~~~~~~~
make: *** [<builtin>: src/event.o] Error 1

pg_net-0.20.0:
                 from src/event.c:6:
/nix/store/jviasb44hibgh09829gbmbssbz2jjnhz-curl-8.17.0-dev/include/curl/multi.h:429:23: error: expected identifier or '(' before '__extension__'
  429 | CURL_EXTERN CURLMcode curl_multi_setopt(CURLM *multi_handle,
      |                       ^~~~~~~~~~~~~~~~~
/nix/store/jviasb44hibgh09829gbmbssbz2jjnhz-curl-8.17.0-dev/include/curl/multi.h:429:23: error: expected identifier or '(' before ')' token
  429 | CURL_EXTERN CURLMcode curl_multi_setopt(CURLM *multi_handle,
      |                       ^~~~~~~~~~~~~~~~~
make: *** [<builtin>: src/event.o] Error 1

pg_net-0.7:
                 from src/event.c:6:
/nix/store/jviasb44hibgh09829gbmbssbz2jjnhz-curl-8.17.0-dev/include/curl/multi.h:429:23: error: expected identifier or '(' before '__extension__'
  429 | CURL_EXTERN CURLMcode curl_multi_setopt(CURLM *multi_handle,
      |                       ^~~~~~~~~~~~~~~~~
/nix/store/jviasb44hibgh09829gbmbssbz2jjnhz-curl-8.17.0-dev/include/curl/multi.h:429:23: error: expected identifier or '(' before ')' token
  429 | CURL_EXTERN CURLMcode curl_multi_setopt(CURLM *multi_handle,
      |                       ^~~~~~~~~~~~~~~~~
make: *** [<builtin>: src/event.o] Error 1

… and 10 more failed derivations
failed checks.aarch64-linux.ext-index_advisor 2h 23m
pg_net-0.20.0: from src/event.c:6: /nix/store/jviasb44hibgh09829gbmbssbz2jjnhz-curl-8.17.0-dev/include/curl/multi.h:429:23: error: expected ide …
pg_net-0.20.0:
                 from src/event.c:6:
/nix/store/jviasb44hibgh09829gbmbssbz2jjnhz-curl-8.17.0-dev/include/curl/multi.h:429:23: error: expected identifier or '(' before '__extension__'
  429 | CURL_EXTERN CURLMcode curl_multi_setopt(CURLM *multi_handle,
      |                       ^~~~~~~~~~~~~~~~~
/nix/store/jviasb44hibgh09829gbmbssbz2jjnhz-curl-8.17.0-dev/include/curl/multi.h:429:23: error: expected identifier or '(' before ')' token
  429 | CURL_EXTERN CURLMcode curl_multi_setopt(CURLM *multi_handle,
      |                       ^~~~~~~~~~~~~~~~~
make: *** [<builtin>: src/event.o] Error 1

pg_net-0.20.0:
                 from src/event.c:6:
/nix/store/jviasb44hibgh09829gbmbssbz2jjnhz-curl-8.17.0-dev/include/curl/multi.h:429:23: error: expected identifier or '(' before '__extension__'
  429 | CURL_EXTERN CURLMcode curl_multi_setopt(CURLM *multi_handle,
      |                       ^~~~~~~~~~~~~~~~~
/nix/store/jviasb44hibgh09829gbmbssbz2jjnhz-curl-8.17.0-dev/include/curl/multi.h:429:23: error: expected identifier or '(' before ')' token
  429 | CURL_EXTERN CURLMcode curl_multi_setopt(CURLM *multi_handle,
      |                       ^~~~~~~~~~~~~~~~~
make: *** [<builtin>: src/event.o] Error 1

pg_net-0.7:
                 from src/event.c:6:
/nix/store/jviasb44hibgh09829gbmbssbz2jjnhz-curl-8.17.0-dev/include/curl/multi.h:429:23: error: expected identifier or '(' before '__extension__'
  429 | CURL_EXTERN CURLMcode curl_multi_setopt(CURLM *multi_handle,
      |                       ^~~~~~~~~~~~~~~~~
/nix/store/jviasb44hibgh09829gbmbssbz2jjnhz-curl-8.17.0-dev/include/curl/multi.h:429:23: error: expected identifier or '(' before ')' token
  429 | CURL_EXTERN CURLMcode curl_multi_setopt(CURLM *multi_handle,
      |                       ^~~~~~~~~~~~~~~~~
make: *** [<builtin>: src/event.o] Error 1

… and 10 more failed derivations
failed checks.aarch64-linux.ext-orioledb 2h 23m
pg_net-0.19.5: from src/event.c:6: /nix/store/jviasb44hibgh09829gbmbssbz2jjnhz-curl-8.17.0-dev/include/curl/multi.h:429:23: error: expected ide …
pg_net-0.19.5:
                 from src/event.c:6:
/nix/store/jviasb44hibgh09829gbmbssbz2jjnhz-curl-8.17.0-dev/include/curl/multi.h:429:23: error: expected identifier or '(' before '__extension__'
  429 | CURL_EXTERN CURLMcode curl_multi_setopt(CURLM *multi_handle,
      |                       ^~~~~~~~~~~~~~~~~
/nix/store/jviasb44hibgh09829gbmbssbz2jjnhz-curl-8.17.0-dev/include/curl/multi.h:429:23: error: expected identifier or '(' before ')' token
  429 | CURL_EXTERN CURLMcode curl_multi_setopt(CURLM *multi_handle,
      |                       ^~~~~~~~~~~~~~~~~
make: *** [<builtin>: src/event.o] Error 1

pg_net-0.20.0:
                 from src/event.c:6:
/nix/store/jviasb44hibgh09829gbmbssbz2jjnhz-curl-8.17.0-dev/include/curl/multi.h:429:23: error: expected identifier or '(' before '__extension__'
  429 | CURL_EXTERN CURLMcode curl_multi_setopt(CURLM *multi_handle,
      |                       ^~~~~~~~~~~~~~~~~
/nix/store/jviasb44hibgh09829gbmbssbz2jjnhz-curl-8.17.0-dev/include/curl/multi.h:429:23: error: expected identifier or '(' before ')' token
  429 | CURL_EXTERN CURLMcode curl_multi_setopt(CURLM *multi_handle,
      |                       ^~~~~~~~~~~~~~~~~
make: *** [<builtin>: src/event.o] Error 1

pg_net-0.7:
                 from src/event.c:6:
/nix/store/jviasb44hibgh09829gbmbssbz2jjnhz-curl-8.17.0-dev/include/curl/multi.h:429:23: error: expected identifier or '(' before '__extension__'
  429 | CURL_EXTERN CURLMcode curl_multi_setopt(CURLM *multi_handle,
      |                       ^~~~~~~~~~~~~~~~~
/nix/store/jviasb44hibgh09829gbmbssbz2jjnhz-curl-8.17.0-dev/include/curl/multi.h:429:23: error: expected identifier or '(' before ')' token
  429 | CURL_EXTERN CURLMcode curl_multi_setopt(CURLM *multi_handle,
      |                       ^~~~~~~~~~~~~~~~~
make: *** [<builtin>: src/event.o] Error 1

… and 6 more failed derivations
failed checks.aarch64-linux.ext-pgjwt 2h 23m
pg_net-0.20.0: from src/event.c:6: /nix/store/jviasb44hibgh09829gbmbssbz2jjnhz-curl-8.17.0-dev/include/curl/multi.h:429:23: error: expected ide …
pg_net-0.20.0:
                 from src/event.c:6:
/nix/store/jviasb44hibgh09829gbmbssbz2jjnhz-curl-8.17.0-dev/include/curl/multi.h:429:23: error: expected identifier or '(' before '__extension__'
  429 | CURL_EXTERN CURLMcode curl_multi_setopt(CURLM *multi_handle,
      |                       ^~~~~~~~~~~~~~~~~
/nix/store/jviasb44hibgh09829gbmbssbz2jjnhz-curl-8.17.0-dev/include/curl/multi.h:429:23: error: expected identifier or '(' before ')' token
  429 | CURL_EXTERN CURLMcode curl_multi_setopt(CURLM *multi_handle,
      |                       ^~~~~~~~~~~~~~~~~
make: *** [<builtin>: src/event.o] Error 1

pg_net-0.20.0:
                 from src/event.c:6:
/nix/store/jviasb44hibgh09829gbmbssbz2jjnhz-curl-8.17.0-dev/include/curl/multi.h:429:23: error: expected identifier or '(' before '__extension__'
  429 | CURL_EXTERN CURLMcode curl_multi_setopt(CURLM *multi_handle,
      |                       ^~~~~~~~~~~~~~~~~
/nix/store/jviasb44hibgh09829gbmbssbz2jjnhz-curl-8.17.0-dev/include/curl/multi.h:429:23: error: expected identifier or '(' before ')' token
  429 | CURL_EXTERN CURLMcode curl_multi_setopt(CURLM *multi_handle,
      |                       ^~~~~~~~~~~~~~~~~
make: *** [<builtin>: src/event.o] Error 1

pg_net-0.7:
                 from src/event.c:6:
/nix/store/jviasb44hibgh09829gbmbssbz2jjnhz-curl-8.17.0-dev/include/curl/multi.h:429:23: error: expected identifier or '(' before '__extension__'
  429 | CURL_EXTERN CURLMcode curl_multi_setopt(CURLM *multi_handle,
      |                       ^~~~~~~~~~~~~~~~~
/nix/store/jviasb44hibgh09829gbmbssbz2jjnhz-curl-8.17.0-dev/include/curl/multi.h:429:23: error: expected identifier or '(' before ')' token
  429 | CURL_EXTERN CURLMcode curl_multi_setopt(CURLM *multi_handle,
      |                       ^~~~~~~~~~~~~~~~~
make: *** [<builtin>: src/event.o] Error 1

… and 10 more failed derivations
failed checks.aarch64-linux.ext-pgmq 2h 23m
pg_net-0.20.0: from src/event.c:6: /nix/store/jviasb44hibgh09829gbmbssbz2jjnhz-curl-8.17.0-dev/include/curl/multi.h:429:23: error: expected ide …
pg_net-0.20.0:
                 from src/event.c:6:
/nix/store/jviasb44hibgh09829gbmbssbz2jjnhz-curl-8.17.0-dev/include/curl/multi.h:429:23: error: expected identifier or '(' before '__extension__'
  429 | CURL_EXTERN CURLMcode curl_multi_setopt(CURLM *multi_handle,
      |                       ^~~~~~~~~~~~~~~~~
/nix/store/jviasb44hibgh09829gbmbssbz2jjnhz-curl-8.17.0-dev/include/curl/multi.h:429:23: error: expected identifier or '(' before ')' token
  429 | CURL_EXTERN CURLMcode curl_multi_setopt(CURLM *multi_handle,
      |                       ^~~~~~~~~~~~~~~~~
make: *** [<builtin>: src/event.o] Error 1

pg_net-0.20.0:
                 from src/event.c:6:
/nix/store/jviasb44hibgh09829gbmbssbz2jjnhz-curl-8.17.0-dev/include/curl/multi.h:429:23: error: expected identifier or '(' before '__extension__'
  429 | CURL_EXTERN CURLMcode curl_multi_setopt(CURLM *multi_handle,
      |                       ^~~~~~~~~~~~~~~~~
/nix/store/jviasb44hibgh09829gbmbssbz2jjnhz-curl-8.17.0-dev/include/curl/multi.h:429:23: error: expected identifier or '(' before ')' token
  429 | CURL_EXTERN CURLMcode curl_multi_setopt(CURLM *multi_handle,
      |                       ^~~~~~~~~~~~~~~~~
make: *** [<builtin>: src/event.o] Error 1

pg_net-0.7:
                 from src/event.c:6:
/nix/store/jviasb44hibgh09829gbmbssbz2jjnhz-curl-8.17.0-dev/include/curl/multi.h:429:23: error: expected identifier or '(' before '__extension__'
  429 | CURL_EXTERN CURLMcode curl_multi_setopt(CURLM *multi_handle,
      |                       ^~~~~~~~~~~~~~~~~
/nix/store/jviasb44hibgh09829gbmbssbz2jjnhz-curl-8.17.0-dev/include/curl/multi.h:429:23: error: expected identifier or '(' before ')' token
  429 | CURL_EXTERN CURLMcode curl_multi_setopt(CURLM *multi_handle,
      |                       ^~~~~~~~~~~~~~~~~
make: *** [<builtin>: src/event.o] Error 1

… and 10 more failed derivations
failed checks.aarch64-linux.ext-pg_net 2h 15m
pg_net-0.20.0: from src/event.c:6: /nix/store/jviasb44hibgh09829gbmbssbz2jjnhz-curl-8.17.0-dev/include/curl/multi.h:429:23: error: expected ide …
pg_net-0.20.0:
                 from src/event.c:6:
/nix/store/jviasb44hibgh09829gbmbssbz2jjnhz-curl-8.17.0-dev/include/curl/multi.h:429:23: error: expected identifier or '(' before '__extension__'
  429 | CURL_EXTERN CURLMcode curl_multi_setopt(CURLM *multi_handle,
      |                       ^~~~~~~~~~~~~~~~~
/nix/store/jviasb44hibgh09829gbmbssbz2jjnhz-curl-8.17.0-dev/include/curl/multi.h:429:23: error: expected identifier or '(' before ')' token
  429 | CURL_EXTERN CURLMcode curl_multi_setopt(CURLM *multi_handle,
      |                       ^~~~~~~~~~~~~~~~~
make: *** [<builtin>: src/event.o] Error 1

pg_net-0.20.0:
                 from src/event.c:6:
/nix/store/jviasb44hibgh09829gbmbssbz2jjnhz-curl-8.17.0-dev/include/curl/multi.h:429:23: error: expected identifier or '(' before '__extension__'
  429 | CURL_EXTERN CURLMcode curl_multi_setopt(CURLM *multi_handle,
      |                       ^~~~~~~~~~~~~~~~~
/nix/store/jviasb44hibgh09829gbmbssbz2jjnhz-curl-8.17.0-dev/include/curl/multi.h:429:23: error: expected identifier or '(' before ')' token
  429 | CURL_EXTERN CURLMcode curl_multi_setopt(CURLM *multi_handle,
      |                       ^~~~~~~~~~~~~~~~~
make: *** [<builtin>: src/event.o] Error 1

pg_net-0.7:
                 from src/event.c:6:
/nix/store/jviasb44hibgh09829gbmbssbz2jjnhz-curl-8.17.0-dev/include/curl/multi.h:429:23: error: expected identifier or '(' before '__extension__'
  429 | CURL_EXTERN CURLMcode curl_multi_setopt(CURLM *multi_handle,
      |                       ^~~~~~~~~~~~~~~~~
/nix/store/jviasb44hibgh09829gbmbssbz2jjnhz-curl-8.17.0-dev/include/curl/multi.h:429:23: error: expected identifier or '(' before ')' token
  429 | CURL_EXTERN CURLMcode curl_multi_setopt(CURLM *multi_handle,
      |                       ^~~~~~~~~~~~~~~~~
make: *** [<builtin>: src/event.o] Error 1

… and 10 more failed derivations
failed checks.aarch64-linux.ext-pg_plan_filter 2h 23m
pg_net-0.20.0: from src/event.c:6: /nix/store/jviasb44hibgh09829gbmbssbz2jjnhz-curl-8.17.0-dev/include/curl/multi.h:429:23: error: expected ide …
pg_net-0.20.0:
                 from src/event.c:6:
/nix/store/jviasb44hibgh09829gbmbssbz2jjnhz-curl-8.17.0-dev/include/curl/multi.h:429:23: error: expected identifier or '(' before '__extension__'
  429 | CURL_EXTERN CURLMcode curl_multi_setopt(CURLM *multi_handle,
      |                       ^~~~~~~~~~~~~~~~~
/nix/store/jviasb44hibgh09829gbmbssbz2jjnhz-curl-8.17.0-dev/include/curl/multi.h:429:23: error: expected identifier or '(' before ')' token
  429 | CURL_EXTERN CURLMcode curl_multi_setopt(CURLM *multi_handle,
      |                       ^~~~~~~~~~~~~~~~~
make: *** [<builtin>: src/event.o] Error 1

pg_net-0.20.0:
                 from src/event.c:6:
/nix/store/jviasb44hibgh09829gbmbssbz2jjnhz-curl-8.17.0-dev/include/curl/multi.h:429:23: error: expected identifier or '(' before '__extension__'
  429 | CURL_EXTERN CURLMcode curl_multi_setopt(CURLM *multi_handle,
      |                       ^~~~~~~~~~~~~~~~~
/nix/store/jviasb44hibgh09829gbmbssbz2jjnhz-curl-8.17.0-dev/include/curl/multi.h:429:23: error: expected identifier or '(' before ')' token
  429 | CURL_EXTERN CURLMcode curl_multi_setopt(CURLM *multi_handle,
      |                       ^~~~~~~~~~~~~~~~~
make: *** [<builtin>: src/event.o] Error 1

pg_net-0.7:
                 from src/event.c:6:
/nix/store/jviasb44hibgh09829gbmbssbz2jjnhz-curl-8.17.0-dev/include/curl/multi.h:429:23: error: expected identifier or '(' before '__extension__'
  429 | CURL_EXTERN CURLMcode curl_multi_setopt(CURLM *multi_handle,
      |                       ^~~~~~~~~~~~~~~~~
/nix/store/jviasb44hibgh09829gbmbssbz2jjnhz-curl-8.17.0-dev/include/curl/multi.h:429:23: error: expected identifier or '(' before ')' token
  429 | CURL_EXTERN CURLMcode curl_multi_setopt(CURLM *multi_handle,
      |                       ^~~~~~~~~~~~~~~~~
make: *** [<builtin>: src/event.o] Error 1

… and 10 more failed derivations
failed checks.aarch64-linux.ext-pg_repack 2h 23m
pg_net-0.20.0: from src/event.c:6: /nix/store/jviasb44hibgh09829gbmbssbz2jjnhz-curl-8.17.0-dev/include/curl/multi.h:429:23: error: expected ide …
pg_net-0.20.0:
                 from src/event.c:6:
/nix/store/jviasb44hibgh09829gbmbssbz2jjnhz-curl-8.17.0-dev/include/curl/multi.h:429:23: error: expected identifier or '(' before '__extension__'
  429 | CURL_EXTERN CURLMcode curl_multi_setopt(CURLM *multi_handle,
      |                       ^~~~~~~~~~~~~~~~~
/nix/store/jviasb44hibgh09829gbmbssbz2jjnhz-curl-8.17.0-dev/include/curl/multi.h:429:23: error: expected identifier or '(' before ')' token
  429 | CURL_EXTERN CURLMcode curl_multi_setopt(CURLM *multi_handle,
      |                       ^~~~~~~~~~~~~~~~~
make: *** [<builtin>: src/event.o] Error 1

pg_net-0.20.0:
                 from src/event.c:6:
/nix/store/jviasb44hibgh09829gbmbssbz2jjnhz-curl-8.17.0-dev/include/curl/multi.h:429:23: error: expected identifier or '(' before '__extension__'
  429 | CURL_EXTERN CURLMcode curl_multi_setopt(CURLM *multi_handle,
      |                       ^~~~~~~~~~~~~~~~~
/nix/store/jviasb44hibgh09829gbmbssbz2jjnhz-curl-8.17.0-dev/include/curl/multi.h:429:23: error: expected identifier or '(' before ')' token
  429 | CURL_EXTERN CURLMcode curl_multi_setopt(CURLM *multi_handle,
      |                       ^~~~~~~~~~~~~~~~~
make: *** [<builtin>: src/event.o] Error 1

pg_net-0.7:
                 from src/event.c:6:
/nix/store/jviasb44hibgh09829gbmbssbz2jjnhz-curl-8.17.0-dev/include/curl/multi.h:429:23: error: expected identifier or '(' before '__extension__'
  429 | CURL_EXTERN CURLMcode curl_multi_setopt(CURLM *multi_handle,
      |                       ^~~~~~~~~~~~~~~~~
/nix/store/jviasb44hibgh09829gbmbssbz2jjnhz-curl-8.17.0-dev/include/curl/multi.h:429:23: error: expected identifier or '(' before ')' token
  429 | CURL_EXTERN CURLMcode curl_multi_setopt(CURLM *multi_handle,
      |                       ^~~~~~~~~~~~~~~~~
make: *** [<builtin>: src/event.o] Error 1

… and 10 more failed derivations
failed checks.aarch64-linux.ext-pgroonga 2h 23m
pg_net-0.20.0: from src/event.c:6: /nix/store/jviasb44hibgh09829gbmbssbz2jjnhz-curl-8.17.0-dev/include/curl/multi.h:429:23: error: expected ide …
pg_net-0.20.0:
                 from src/event.c:6:
/nix/store/jviasb44hibgh09829gbmbssbz2jjnhz-curl-8.17.0-dev/include/curl/multi.h:429:23: error: expected identifier or '(' before '__extension__'
  429 | CURL_EXTERN CURLMcode curl_multi_setopt(CURLM *multi_handle,
      |                       ^~~~~~~~~~~~~~~~~
/nix/store/jviasb44hibgh09829gbmbssbz2jjnhz-curl-8.17.0-dev/include/curl/multi.h:429:23: error: expected identifier or '(' before ')' token
  429 | CURL_EXTERN CURLMcode curl_multi_setopt(CURLM *multi_handle,
      |                       ^~~~~~~~~~~~~~~~~
make: *** [<builtin>: src/event.o] Error 1

pg_net-0.20.0:
                 from src/event.c:6:
/nix/store/jviasb44hibgh09829gbmbssbz2jjnhz-curl-8.17.0-dev/include/curl/multi.h:429:23: error: expected identifier or '(' before '__extension__'
  429 | CURL_EXTERN CURLMcode curl_multi_setopt(CURLM *multi_handle,
      |                       ^~~~~~~~~~~~~~~~~
/nix/store/jviasb44hibgh09829gbmbssbz2jjnhz-curl-8.17.0-dev/include/curl/multi.h:429:23: error: expected identifier or '(' before ')' token
  429 | CURL_EXTERN CURLMcode curl_multi_setopt(CURLM *multi_handle,
      |                       ^~~~~~~~~~~~~~~~~
make: *** [<builtin>: src/event.o] Error 1

pg_net-0.7:
                 from src/event.c:6:
/nix/store/jviasb44hibgh09829gbmbssbz2jjnhz-curl-8.17.0-dev/include/curl/multi.h:429:23: error: expected identifier or '(' before '__extension__'
  429 | CURL_EXTERN CURLMcode curl_multi_setopt(CURLM *multi_handle,
      |                       ^~~~~~~~~~~~~~~~~
/nix/store/jviasb44hibgh09829gbmbssbz2jjnhz-curl-8.17.0-dev/include/curl/multi.h:429:23: error: expected identifier or '(' before ')' token
  429 | CURL_EXTERN CURLMcode curl_multi_setopt(CURLM *multi_handle,
      |                       ^~~~~~~~~~~~~~~~~
make: *** [<builtin>: src/event.o] Error 1

… and 10 more failed derivations
failed checks.aarch64-linux.ext-pgrouting 2h 23m
pg_net-0.20.0: from src/event.c:6: /nix/store/jviasb44hibgh09829gbmbssbz2jjnhz-curl-8.17.0-dev/include/curl/multi.h:429:23: error: expected ide …
pg_net-0.20.0:
                 from src/event.c:6:
/nix/store/jviasb44hibgh09829gbmbssbz2jjnhz-curl-8.17.0-dev/include/curl/multi.h:429:23: error: expected identifier or '(' before '__extension__'
  429 | CURL_EXTERN CURLMcode curl_multi_setopt(CURLM *multi_handle,
      |                       ^~~~~~~~~~~~~~~~~
/nix/store/jviasb44hibgh09829gbmbssbz2jjnhz-curl-8.17.0-dev/include/curl/multi.h:429:23: error: expected identifier or '(' before ')' token
  429 | CURL_EXTERN CURLMcode curl_multi_setopt(CURLM *multi_handle,
      |                       ^~~~~~~~~~~~~~~~~
make: *** [<builtin>: src/event.o] Error 1

pg_net-0.7:
                 from src/event.c:6:
/nix/store/jviasb44hibgh09829gbmbssbz2jjnhz-curl-8.17.0-dev/include/curl/multi.h:429:23: error: expected identifier or '(' before '__extension__'
  429 | CURL_EXTERN CURLMcode curl_multi_setopt(CURLM *multi_handle,
      |                       ^~~~~~~~~~~~~~~~~
/nix/store/jviasb44hibgh09829gbmbssbz2jjnhz-curl-8.17.0-dev/include/curl/multi.h:429:23: error: expected identifier or '(' before ')' token
  429 | CURL_EXTERN CURLMcode curl_multi_setopt(CURLM *multi_handle,
      |                       ^~~~~~~~~~~~~~~~~
make: *** [<builtin>: src/event.o] Error 1

pg_net-0.20.0:
                 from src/event.c:6:
/nix/store/jviasb44hibgh09829gbmbssbz2jjnhz-curl-8.17.0-dev/include/curl/multi.h:429:23: error: expected identifier or '(' before '__extension__'
  429 | CURL_EXTERN CURLMcode curl_multi_setopt(CURLM *multi_handle,
      |                       ^~~~~~~~~~~~~~~~~
/nix/store/jviasb44hibgh09829gbmbssbz2jjnhz-curl-8.17.0-dev/include/curl/multi.h:429:23: error: expected identifier or '(' before ')' token
  429 | CURL_EXTERN CURLMcode curl_multi_setopt(CURLM *multi_handle,
      |                       ^~~~~~~~~~~~~~~~~
make: *** [<builtin>: src/event.o] Error 1

… and 10 more failed derivations
failed checks.aarch64-linux.ext-pgsodium 2h 23m
pg_net-0.20.0: from src/event.c:6: /nix/store/jviasb44hibgh09829gbmbssbz2jjnhz-curl-8.17.0-dev/include/curl/multi.h:429:23: error: expected ide …
pg_net-0.20.0:
                 from src/event.c:6:
/nix/store/jviasb44hibgh09829gbmbssbz2jjnhz-curl-8.17.0-dev/include/curl/multi.h:429:23: error: expected identifier or '(' before '__extension__'
  429 | CURL_EXTERN CURLMcode curl_multi_setopt(CURLM *multi_handle,
      |                       ^~~~~~~~~~~~~~~~~
/nix/store/jviasb44hibgh09829gbmbssbz2jjnhz-curl-8.17.0-dev/include/curl/multi.h:429:23: error: expected identifier or '(' before ')' token
  429 | CURL_EXTERN CURLMcode curl_multi_setopt(CURLM *multi_handle,
      |                       ^~~~~~~~~~~~~~~~~
make: *** [<builtin>: src/event.o] Error 1

pg_net-0.20.0:
                 from src/event.c:6:
/nix/store/jviasb44hibgh09829gbmbssbz2jjnhz-curl-8.17.0-dev/include/curl/multi.h:429:23: error: expected identifier or '(' before '__extension__'
  429 | CURL_EXTERN CURLMcode curl_multi_setopt(CURLM *multi_handle,
      |                       ^~~~~~~~~~~~~~~~~
/nix/store/jviasb44hibgh09829gbmbssbz2jjnhz-curl-8.17.0-dev/include/curl/multi.h:429:23: error: expected identifier or '(' before ')' token
  429 | CURL_EXTERN CURLMcode curl_multi_setopt(CURLM *multi_handle,
      |                       ^~~~~~~~~~~~~~~~~
make: *** [<builtin>: src/event.o] Error 1

pg_net-0.7:
                 from src/event.c:6:
/nix/store/jviasb44hibgh09829gbmbssbz2jjnhz-curl-8.17.0-dev/include/curl/multi.h:429:23: error: expected identifier or '(' before '__extension__'
  429 | CURL_EXTERN CURLMcode curl_multi_setopt(CURLM *multi_handle,
      |                       ^~~~~~~~~~~~~~~~~
/nix/store/jviasb44hibgh09829gbmbssbz2jjnhz-curl-8.17.0-dev/include/curl/multi.h:429:23: error: expected identifier or '(' before ')' token
  429 | CURL_EXTERN CURLMcode curl_multi_setopt(CURLM *multi_handle,
      |                       ^~~~~~~~~~~~~~~~~
make: *** [<builtin>: src/event.o] Error 1

… and 10 more failed derivations
failed checks.aarch64-linux.ext-plpgsql_check 2h 23m
pg_net-0.20.0: from src/event.c:6: /nix/store/jviasb44hibgh09829gbmbssbz2jjnhz-curl-8.17.0-dev/include/curl/multi.h:429:23: error: expected ide …
pg_net-0.20.0:
                 from src/event.c:6:
/nix/store/jviasb44hibgh09829gbmbssbz2jjnhz-curl-8.17.0-dev/include/curl/multi.h:429:23: error: expected identifier or '(' before '__extension__'
  429 | CURL_EXTERN CURLMcode curl_multi_setopt(CURLM *multi_handle,
      |                       ^~~~~~~~~~~~~~~~~
/nix/store/jviasb44hibgh09829gbmbssbz2jjnhz-curl-8.17.0-dev/include/curl/multi.h:429:23: error: expected identifier or '(' before ')' token
  429 | CURL_EXTERN CURLMcode curl_multi_setopt(CURLM *multi_handle,
      |                       ^~~~~~~~~~~~~~~~~
make: *** [<builtin>: src/event.o] Error 1

pg_net-0.20.0:
                 from src/event.c:6:
/nix/store/jviasb44hibgh09829gbmbssbz2jjnhz-curl-8.17.0-dev/include/curl/multi.h:429:23: error: expected identifier or '(' before '__extension__'
  429 | CURL_EXTERN CURLMcode curl_multi_setopt(CURLM *multi_handle,
      |                       ^~~~~~~~~~~~~~~~~
/nix/store/jviasb44hibgh09829gbmbssbz2jjnhz-curl-8.17.0-dev/include/curl/multi.h:429:23: error: expected identifier or '(' before ')' token
  429 | CURL_EXTERN CURLMcode curl_multi_setopt(CURLM *multi_handle,
      |                       ^~~~~~~~~~~~~~~~~
make: *** [<builtin>: src/event.o] Error 1

pg_net-0.7:
                 from src/event.c:6:
/nix/store/jviasb44hibgh09829gbmbssbz2jjnhz-curl-8.17.0-dev/include/curl/multi.h:429:23: error: expected identifier or '(' before '__extension__'
  429 | CURL_EXTERN CURLMcode curl_multi_setopt(CURLM *multi_handle,
      |                       ^~~~~~~~~~~~~~~~~
/nix/store/jviasb44hibgh09829gbmbssbz2jjnhz-curl-8.17.0-dev/include/curl/multi.h:429:23: error: expected identifier or '(' before ')' token
  429 | CURL_EXTERN CURLMcode curl_multi_setopt(CURLM *multi_handle,
      |                       ^~~~~~~~~~~~~~~~~
make: *** [<builtin>: src/event.o] Error 1

… and 10 more failed derivations
failed checks.aarch64-linux.ext-plv8 2h 23m
pg_net-0.19.5: from src/event.c:6: /nix/store/jviasb44hibgh09829gbmbssbz2jjnhz-curl-8.17.0-dev/include/curl/multi.h:429:23: error: expected ide …
pg_net-0.19.5:
                 from src/event.c:6:
/nix/store/jviasb44hibgh09829gbmbssbz2jjnhz-curl-8.17.0-dev/include/curl/multi.h:429:23: error: expected identifier or '(' before '__extension__'
  429 | CURL_EXTERN CURLMcode curl_multi_setopt(CURLM *multi_handle,
      |                       ^~~~~~~~~~~~~~~~~
/nix/store/jviasb44hibgh09829gbmbssbz2jjnhz-curl-8.17.0-dev/include/curl/multi.h:429:23: error: expected identifier or '(' before ')' token
  429 | CURL_EXTERN CURLMcode curl_multi_setopt(CURLM *multi_handle,
      |                       ^~~~~~~~~~~~~~~~~
make: *** [<builtin>: src/event.o] Error 1

pg_net-0.20.0:
                 from src/event.c:6:
/nix/store/jviasb44hibgh09829gbmbssbz2jjnhz-curl-8.17.0-dev/include/curl/multi.h:429:23: error: expected identifier or '(' before '__extension__'
  429 | CURL_EXTERN CURLMcode curl_multi_setopt(CURLM *multi_handle,
      |                       ^~~~~~~~~~~~~~~~~
/nix/store/jviasb44hibgh09829gbmbssbz2jjnhz-curl-8.17.0-dev/include/curl/multi.h:429:23: error: expected identifier or '(' before ')' token
  429 | CURL_EXTERN CURLMcode curl_multi_setopt(CURLM *multi_handle,
      |                       ^~~~~~~~~~~~~~~~~
make: *** [<builtin>: src/event.o] Error 1

pg_net-0.7:
                 from src/event.c:6:
/nix/store/jviasb44hibgh09829gbmbssbz2jjnhz-curl-8.17.0-dev/include/curl/multi.h:429:23: error: expected identifier or '(' before '__extension__'
  429 | CURL_EXTERN CURLMcode curl_multi_setopt(CURLM *multi_handle,
      |                       ^~~~~~~~~~~~~~~~~
/nix/store/jviasb44hibgh09829gbmbssbz2jjnhz-curl-8.17.0-dev/include/curl/multi.h:429:23: error: expected identifier or '(' before ')' token
  429 | CURL_EXTERN CURLMcode curl_multi_setopt(CURLM *multi_handle,
      |                       ^~~~~~~~~~~~~~~~~
make: *** [<builtin>: src/event.o] Error 1

… and 2 more failed derivations
failed checks.aarch64-linux.ext-postgis 2h 23m
pg_net-0.20.0: from src/event.c:6: /nix/store/jviasb44hibgh09829gbmbssbz2jjnhz-curl-8.17.0-dev/include/curl/multi.h:429:23: error: expected ide …
pg_net-0.20.0:
                 from src/event.c:6:
/nix/store/jviasb44hibgh09829gbmbssbz2jjnhz-curl-8.17.0-dev/include/curl/multi.h:429:23: error: expected identifier or '(' before '__extension__'
  429 | CURL_EXTERN CURLMcode curl_multi_setopt(CURLM *multi_handle,
      |                       ^~~~~~~~~~~~~~~~~
/nix/store/jviasb44hibgh09829gbmbssbz2jjnhz-curl-8.17.0-dev/include/curl/multi.h:429:23: error: expected identifier or '(' before ')' token
  429 | CURL_EXTERN CURLMcode curl_multi_setopt(CURLM *multi_handle,
      |                       ^~~~~~~~~~~~~~~~~
make: *** [<builtin>: src/event.o] Error 1

pg_net-0.20.0:
                 from src/event.c:6:
/nix/store/jviasb44hibgh09829gbmbssbz2jjnhz-curl-8.17.0-dev/include/curl/multi.h:429:23: error: expected identifier or '(' before '__extension__'
  429 | CURL_EXTERN CURLMcode curl_multi_setopt(CURLM *multi_handle,
      |                       ^~~~~~~~~~~~~~~~~
/nix/store/jviasb44hibgh09829gbmbssbz2jjnhz-curl-8.17.0-dev/include/curl/multi.h:429:23: error: expected identifier or '(' before ')' token
  429 | CURL_EXTERN CURLMcode curl_multi_setopt(CURLM *multi_handle,
      |                       ^~~~~~~~~~~~~~~~~
make: *** [<builtin>: src/event.o] Error 1

pg_net-0.7:
                 from src/event.c:6:
/nix/store/jviasb44hibgh09829gbmbssbz2jjnhz-curl-8.17.0-dev/include/curl/multi.h:429:23: error: expected identifier or '(' before '__extension__'
  429 | CURL_EXTERN CURLMcode curl_multi_setopt(CURLM *multi_handle,
      |                       ^~~~~~~~~~~~~~~~~
/nix/store/jviasb44hibgh09829gbmbssbz2jjnhz-curl-8.17.0-dev/include/curl/multi.h:429:23: error: expected identifier or '(' before ')' token
  429 | CURL_EXTERN CURLMcode curl_multi_setopt(CURLM *multi_handle,
      |                       ^~~~~~~~~~~~~~~~~
make: *** [<builtin>: src/event.o] Error 1

… and 10 more failed derivations
failed checks.aarch64-linux.ext-timescaledb 2h 23m
pg_net-0.19.5: from src/event.c:6: /nix/store/jviasb44hibgh09829gbmbssbz2jjnhz-curl-8.17.0-dev/include/curl/multi.h:429:23: error: expected ide …
pg_net-0.19.5:
                 from src/event.c:6:
/nix/store/jviasb44hibgh09829gbmbssbz2jjnhz-curl-8.17.0-dev/include/curl/multi.h:429:23: error: expected identifier or '(' before '__extension__'
  429 | CURL_EXTERN CURLMcode curl_multi_setopt(CURLM *multi_handle,
      |                       ^~~~~~~~~~~~~~~~~
/nix/store/jviasb44hibgh09829gbmbssbz2jjnhz-curl-8.17.0-dev/include/curl/multi.h:429:23: error: expected identifier or '(' before ')' token
  429 | CURL_EXTERN CURLMcode curl_multi_setopt(CURLM *multi_handle,
      |                       ^~~~~~~~~~~~~~~~~
make: *** [<builtin>: src/event.o] Error 1

pg_net-0.20.0:
                 from src/event.c:6:
/nix/store/jviasb44hibgh09829gbmbssbz2jjnhz-curl-8.17.0-dev/include/curl/multi.h:429:23: error: expected identifier or '(' before '__extension__'
  429 | CURL_EXTERN CURLMcode curl_multi_setopt(CURLM *multi_handle,
      |                       ^~~~~~~~~~~~~~~~~
/nix/store/jviasb44hibgh09829gbmbssbz2jjnhz-curl-8.17.0-dev/include/curl/multi.h:429:23: error: expected identifier or '(' before ')' token
  429 | CURL_EXTERN CURLMcode curl_multi_setopt(CURLM *multi_handle,
      |                       ^~~~~~~~~~~~~~~~~
make: *** [<builtin>: src/event.o] Error 1

pg_net-0.7:
                 from src/event.c:6:
/nix/store/jviasb44hibgh09829gbmbssbz2jjnhz-curl-8.17.0-dev/include/curl/multi.h:429:23: error: expected identifier or '(' before '__extension__'
  429 | CURL_EXTERN CURLMcode curl_multi_setopt(CURLM *multi_handle,
      |                       ^~~~~~~~~~~~~~~~~
/nix/store/jviasb44hibgh09829gbmbssbz2jjnhz-curl-8.17.0-dev/include/curl/multi.h:429:23: error: expected identifier or '(' before ')' token
  429 | CURL_EXTERN CURLMcode curl_multi_setopt(CURLM *multi_handle,
      |                       ^~~~~~~~~~~~~~~~~
make: *** [<builtin>: src/event.o] Error 1

… and 2 more failed derivations
failed checks.aarch64-linux.ext-vault 2h 23m
pg_net-0.20.0: from src/event.c:6: /nix/store/jviasb44hibgh09829gbmbssbz2jjnhz-curl-8.17.0-dev/include/curl/multi.h:429:23: error: expected ide …
pg_net-0.20.0:
                 from src/event.c:6:
/nix/store/jviasb44hibgh09829gbmbssbz2jjnhz-curl-8.17.0-dev/include/curl/multi.h:429:23: error: expected identifier or '(' before '__extension__'
  429 | CURL_EXTERN CURLMcode curl_multi_setopt(CURLM *multi_handle,
      |                       ^~~~~~~~~~~~~~~~~
/nix/store/jviasb44hibgh09829gbmbssbz2jjnhz-curl-8.17.0-dev/include/curl/multi.h:429:23: error: expected identifier or '(' before ')' token
  429 | CURL_EXTERN CURLMcode curl_multi_setopt(CURLM *multi_handle,
      |                       ^~~~~~~~~~~~~~~~~
make: *** [<builtin>: src/event.o] Error 1

pg_net-0.20.0:
                 from src/event.c:6:
/nix/store/jviasb44hibgh09829gbmbssbz2jjnhz-curl-8.17.0-dev/include/curl/multi.h:429:23: error: expected identifier or '(' before '__extension__'
  429 | CURL_EXTERN CURLMcode curl_multi_setopt(CURLM *multi_handle,
      |                       ^~~~~~~~~~~~~~~~~
/nix/store/jviasb44hibgh09829gbmbssbz2jjnhz-curl-8.17.0-dev/include/curl/multi.h:429:23: error: expected identifier or '(' before ')' token
  429 | CURL_EXTERN CURLMcode curl_multi_setopt(CURLM *multi_handle,
      |                       ^~~~~~~~~~~~~~~~~
make: *** [<builtin>: src/event.o] Error 1

pg_net-0.7:
                 from src/event.c:6:
/nix/store/jviasb44hibgh09829gbmbssbz2jjnhz-curl-8.17.0-dev/include/curl/multi.h:429:23: error: expected identifier or '(' before '__extension__'
  429 | CURL_EXTERN CURLMcode curl_multi_setopt(CURLM *multi_handle,
      |                       ^~~~~~~~~~~~~~~~~
/nix/store/jviasb44hibgh09829gbmbssbz2jjnhz-curl-8.17.0-dev/include/curl/multi.h:429:23: error: expected identifier or '(' before ')' token
  429 | CURL_EXTERN CURLMcode curl_multi_setopt(CURLM *multi_handle,
      |                       ^~~~~~~~~~~~~~~~~
make: *** [<builtin>: src/event.o] Error 1

… and 10 more failed derivations
failed checks.aarch64-linux.ext-wrappers-regression-PSQL-1387 2h 23m
pg_net-0.19.5: from src/event.c:6: /nix/store/jviasb44hibgh09829gbmbssbz2jjnhz-curl-8.17.0-dev/include/curl/multi.h:429:23: error: expected ide …
pg_net-0.19.5:
                 from src/event.c:6:
/nix/store/jviasb44hibgh09829gbmbssbz2jjnhz-curl-8.17.0-dev/include/curl/multi.h:429:23: error: expected identifier or '(' before '__extension__'
  429 | CURL_EXTERN CURLMcode curl_multi_setopt(CURLM *multi_handle,
      |                       ^~~~~~~~~~~~~~~~~
/nix/store/jviasb44hibgh09829gbmbssbz2jjnhz-curl-8.17.0-dev/include/curl/multi.h:429:23: error: expected identifier or '(' before ')' token
  429 | CURL_EXTERN CURLMcode curl_multi_setopt(CURLM *multi_handle,
      |                       ^~~~~~~~~~~~~~~~~
make: *** [<builtin>: src/event.o] Error 1

pg_net-0.20.0:
                 from src/event.c:6:
/nix/store/jviasb44hibgh09829gbmbssbz2jjnhz-curl-8.17.0-dev/include/curl/multi.h:429:23: error: expected identifier or '(' before '__extension__'
  429 | CURL_EXTERN CURLMcode curl_multi_setopt(CURLM *multi_handle,
      |                       ^~~~~~~~~~~~~~~~~
/nix/store/jviasb44hibgh09829gbmbssbz2jjnhz-curl-8.17.0-dev/include/curl/multi.h:429:23: error: expected identifier or '(' before ')' token
  429 | CURL_EXTERN CURLMcode curl_multi_setopt(CURLM *multi_handle,
      |                       ^~~~~~~~~~~~~~~~~
make: *** [<builtin>: src/event.o] Error 1

pg_net-0.7:
                 from src/event.c:6:
/nix/store/jviasb44hibgh09829gbmbssbz2jjnhz-curl-8.17.0-dev/include/curl/multi.h:429:23: error: expected identifier or '(' before '__extension__'
  429 | CURL_EXTERN CURLMcode curl_multi_setopt(CURLM *multi_handle,
      |                       ^~~~~~~~~~~~~~~~~
/nix/store/jviasb44hibgh09829gbmbssbz2jjnhz-curl-8.17.0-dev/include/curl/multi.h:429:23: error: expected identifier or '(' before ')' token
  429 | CURL_EXTERN CURLMcode curl_multi_setopt(CURLM *multi_handle,
      |                       ^~~~~~~~~~~~~~~~~
make: *** [<builtin>: src/event.o] Error 1

… and 2 more failed derivations
failed checks.aarch64-linux.psql_15 2h 23m
pg_net-0.20.0: from src/event.c:6: /nix/store/jviasb44hibgh09829gbmbssbz2jjnhz-curl-8.17.0-dev/include/curl/multi.h:429:23: error: expected ide …
pg_net-0.20.0:
                 from src/event.c:6:
/nix/store/jviasb44hibgh09829gbmbssbz2jjnhz-curl-8.17.0-dev/include/curl/multi.h:429:23: error: expected identifier or '(' before '__extension__'
  429 | CURL_EXTERN CURLMcode curl_multi_setopt(CURLM *multi_handle,
      |                       ^~~~~~~~~~~~~~~~~
/nix/store/jviasb44hibgh09829gbmbssbz2jjnhz-curl-8.17.0-dev/include/curl/multi.h:429:23: error: expected identifier or '(' before ')' token
  429 | CURL_EXTERN CURLMcode curl_multi_setopt(CURLM *multi_handle,
      |                       ^~~~~~~~~~~~~~~~~
make: *** [<builtin>: src/event.o] Error 1

pg_net-0.20.0:
                 from src/event.c:6:
/nix/store/jviasb44hibgh09829gbmbssbz2jjnhz-curl-8.17.0-dev/include/curl/multi.h:429:23: error: expected identifier or '(' before '__extension__'
  429 | CURL_EXTERN CURLMcode curl_multi_setopt(CURLM *multi_handle,
      |                       ^~~~~~~~~~~~~~~~~
/nix/store/jviasb44hibgh09829gbmbssbz2jjnhz-curl-8.17.0-dev/include/curl/multi.h:429:23: error: expected identifier or '(' before ')' token
  429 | CURL_EXTERN CURLMcode curl_multi_setopt(CURLM *multi_handle,
      |                       ^~~~~~~~~~~~~~~~~
make: *** [<builtin>: src/event.o] Error 1

pg_net-0.7:
                 from src/event.c:6:
/nix/store/jviasb44hibgh09829gbmbssbz2jjnhz-curl-8.17.0-dev/include/curl/multi.h:429:23: error: expected identifier or '(' before '__extension__'
  429 | CURL_EXTERN CURLMcode curl_multi_setopt(CURLM *multi_handle,
      |                       ^~~~~~~~~~~~~~~~~
/nix/store/jviasb44hibgh09829gbmbssbz2jjnhz-curl-8.17.0-dev/include/curl/multi.h:429:23: error: expected identifier or '(' before ')' token
  429 | CURL_EXTERN CURLMcode curl_multi_setopt(CURLM *multi_handle,
      |                       ^~~~~~~~~~~~~~~~~
make: *** [<builtin>: src/event.o] Error 1

… and 10 more failed derivations
failed checks.aarch64-linux.psql_15_slim 2m 36s
pg_net-0.20.0: from src/event.c:6: /nix/store/jviasb44hibgh09829gbmbssbz2jjnhz-curl-8.17.0-dev/include/curl/multi.h:429:23: error: expected ide …
pg_net-0.20.0:
                 from src/event.c:6:
/nix/store/jviasb44hibgh09829gbmbssbz2jjnhz-curl-8.17.0-dev/include/curl/multi.h:429:23: error: expected identifier or '(' before '__extension__'
  429 | CURL_EXTERN CURLMcode curl_multi_setopt(CURLM *multi_handle,
      |                       ^~~~~~~~~~~~~~~~~
/nix/store/jviasb44hibgh09829gbmbssbz2jjnhz-curl-8.17.0-dev/include/curl/multi.h:429:23: error: expected identifier or '(' before ')' token
  429 | CURL_EXTERN CURLMcode curl_multi_setopt(CURLM *multi_handle,
      |                       ^~~~~~~~~~~~~~~~~
make: *** [<builtin>: src/event.o] Error 1

pg_net-0.20.0:
                 from src/event.c:6:
/nix/store/jviasb44hibgh09829gbmbssbz2jjnhz-curl-8.17.0-dev/include/curl/multi.h:429:23: error: expected identifier or '(' before '__extension__'
  429 | CURL_EXTERN CURLMcode curl_multi_setopt(CURLM *multi_handle,
      |                       ^~~~~~~~~~~~~~~~~
/nix/store/jviasb44hibgh09829gbmbssbz2jjnhz-curl-8.17.0-dev/include/curl/multi.h:429:23: error: expected identifier or '(' before ')' token
  429 | CURL_EXTERN CURLMcode curl_multi_setopt(CURLM *multi_handle,
      |                       ^~~~~~~~~~~~~~~~~
make: *** [<builtin>: src/event.o] Error 1

pg_net-0.7:
                 from src/event.c:6:
/nix/store/jviasb44hibgh09829gbmbssbz2jjnhz-curl-8.17.0-dev/include/curl/multi.h:429:23: error: expected identifier or '(' before '__extension__'
  429 | CURL_EXTERN CURLMcode curl_multi_setopt(CURLM *multi_handle,
      |                       ^~~~~~~~~~~~~~~~~
/nix/store/jviasb44hibgh09829gbmbssbz2jjnhz-curl-8.17.0-dev/include/curl/multi.h:429:23: error: expected identifier or '(' before ')' token
  429 | CURL_EXTERN CURLMcode curl_multi_setopt(CURLM *multi_handle,
      |                       ^~~~~~~~~~~~~~~~~
make: *** [<builtin>: src/event.o] Error 1

… and 10 more failed derivations
failed checks.aarch64-linux.psql_17 9m 6s
pg_net-0.20.0: from src/event.c:6: /nix/store/jviasb44hibgh09829gbmbssbz2jjnhz-curl-8.17.0-dev/include/curl/multi.h:429:23: error: expected ide …
pg_net-0.20.0:
                 from src/event.c:6:
/nix/store/jviasb44hibgh09829gbmbssbz2jjnhz-curl-8.17.0-dev/include/curl/multi.h:429:23: error: expected identifier or '(' before '__extension__'
  429 | CURL_EXTERN CURLMcode curl_multi_setopt(CURLM *multi_handle,
      |                       ^~~~~~~~~~~~~~~~~
/nix/store/jviasb44hibgh09829gbmbssbz2jjnhz-curl-8.17.0-dev/include/curl/multi.h:429:23: error: expected identifier or '(' before ')' token
  429 | CURL_EXTERN CURLMcode curl_multi_setopt(CURLM *multi_handle,
      |                       ^~~~~~~~~~~~~~~~~
make: *** [<builtin>: src/event.o] Error 1

pg_net-0.20.0:
                 from src/event.c:6:
/nix/store/jviasb44hibgh09829gbmbssbz2jjnhz-curl-8.17.0-dev/include/curl/multi.h:429:23: error: expected identifier or '(' before '__extension__'
  429 | CURL_EXTERN CURLMcode curl_multi_setopt(CURLM *multi_handle,
      |                       ^~~~~~~~~~~~~~~~~
/nix/store/jviasb44hibgh09829gbmbssbz2jjnhz-curl-8.17.0-dev/include/curl/multi.h:429:23: error: expected identifier or '(' before ')' token
  429 | CURL_EXTERN CURLMcode curl_multi_setopt(CURLM *multi_handle,
      |                       ^~~~~~~~~~~~~~~~~
make: *** [<builtin>: src/event.o] Error 1

pg_net-0.7:
                 from src/event.c:6:
/nix/store/jviasb44hibgh09829gbmbssbz2jjnhz-curl-8.17.0-dev/include/curl/multi.h:429:23: error: expected identifier or '(' before '__extension__'
  429 | CURL_EXTERN CURLMcode curl_multi_setopt(CURLM *multi_handle,
      |                       ^~~~~~~~~~~~~~~~~
/nix/store/jviasb44hibgh09829gbmbssbz2jjnhz-curl-8.17.0-dev/include/curl/multi.h:429:23: error: expected identifier or '(' before ')' token
  429 | CURL_EXTERN CURLMcode curl_multi_setopt(CURLM *multi_handle,
      |                       ^~~~~~~~~~~~~~~~~
make: *** [<builtin>: src/event.o] Error 1

… and 10 more failed derivations
failed checks.aarch64-linux.psql_17_cli 2m 5s
pg_net-0.20.0: from src/event.c:6: /nix/store/jviasb44hibgh09829gbmbssbz2jjnhz-curl-8.17.0-dev/include/curl/multi.h:429:23: error: expected ide …
pg_net-0.20.0:
                 from src/event.c:6:
/nix/store/jviasb44hibgh09829gbmbssbz2jjnhz-curl-8.17.0-dev/include/curl/multi.h:429:23: error: expected identifier or '(' before '__extension__'
  429 | CURL_EXTERN CURLMcode curl_multi_setopt(CURLM *multi_handle,
      |                       ^~~~~~~~~~~~~~~~~
/nix/store/jviasb44hibgh09829gbmbssbz2jjnhz-curl-8.17.0-dev/include/curl/multi.h:429:23: error: expected identifier or '(' before ')' token
  429 | CURL_EXTERN CURLMcode curl_multi_setopt(CURLM *multi_handle,
      |                       ^~~~~~~~~~~~~~~~~
make: *** [<builtin>: src/event.o] Error 1

pg_net-0.20.0:
                 from src/event.c:6:
/nix/store/jviasb44hibgh09829gbmbssbz2jjnhz-curl-8.17.0-dev/include/curl/multi.h:429:23: error: expected identifier or '(' before '__extension__'
  429 | CURL_EXTERN CURLMcode curl_multi_setopt(CURLM *multi_handle,
      |                       ^~~~~~~~~~~~~~~~~
/nix/store/jviasb44hibgh09829gbmbssbz2jjnhz-curl-8.17.0-dev/include/curl/multi.h:429:23: error: expected identifier or '(' before ')' token
  429 | CURL_EXTERN CURLMcode curl_multi_setopt(CURLM *multi_handle,
      |                       ^~~~~~~~~~~~~~~~~
make: *** [<builtin>: src/event.o] Error 1

pg_net-0.7:
                 from src/event.c:6:
/nix/store/jviasb44hibgh09829gbmbssbz2jjnhz-curl-8.17.0-dev/include/curl/multi.h:429:23: error: expected identifier or '(' before '__extension__'
  429 | CURL_EXTERN CURLMcode curl_multi_setopt(CURLM *multi_handle,
      |                       ^~~~~~~~~~~~~~~~~
/nix/store/jviasb44hibgh09829gbmbssbz2jjnhz-curl-8.17.0-dev/include/curl/multi.h:429:23: error: expected identifier or '(' before ')' token
  429 | CURL_EXTERN CURLMcode curl_multi_setopt(CURLM *multi_handle,
      |                       ^~~~~~~~~~~~~~~~~
make: *** [<builtin>: src/event.o] Error 1

… and 10 more failed derivations
failed checks.aarch64-linux.psql_17_cli_portable 7m 37s
pg_net-0.14.0: from src/event.c:6: /nix/store/jviasb44hibgh09829gbmbssbz2jjnhz-curl-8.17.0-dev/include/curl/multi.h:429:23: error: expected ide …
pg_net-0.14.0:
                 from src/event.c:6:
/nix/store/jviasb44hibgh09829gbmbssbz2jjnhz-curl-8.17.0-dev/include/curl/multi.h:429:23: error: expected identifier or '(' before '__extension__'
  429 | CURL_EXTERN CURLMcode curl_multi_setopt(CURLM *multi_handle,
      |                       ^~~~~~~~~~~~~~~~~
/nix/store/jviasb44hibgh09829gbmbssbz2jjnhz-curl-8.17.0-dev/include/curl/multi.h:429:23: error: expected identifier or '(' before ')' token
  429 | CURL_EXTERN CURLMcode curl_multi_setopt(CURLM *multi_handle,
      |                       ^~~~~~~~~~~~~~~~~
make: *** [<builtin>: src/event.o] Error 1

pg_net-0.19.5:
                 from src/event.c:6:
/nix/store/jviasb44hibgh09829gbmbssbz2jjnhz-curl-8.17.0-dev/include/curl/multi.h:429:23: error: expected identifier or '(' before '__extension__'
  429 | CURL_EXTERN CURLMcode curl_multi_setopt(CURLM *multi_handle,
      |                       ^~~~~~~~~~~~~~~~~
/nix/store/jviasb44hibgh09829gbmbssbz2jjnhz-curl-8.17.0-dev/include/curl/multi.h:429:23: error: expected identifier or '(' before ')' token
  429 | CURL_EXTERN CURLMcode curl_multi_setopt(CURLM *multi_handle,
      |                       ^~~~~~~~~~~~~~~~~
make: *** [<builtin>: src/event.o] Error 1

pg_net-0.20.0:
                 from src/event.c:6:
/nix/store/jviasb44hibgh09829gbmbssbz2jjnhz-curl-8.17.0-dev/include/curl/multi.h:429:23: error: expected identifier or '(' before '__extension__'
  429 | CURL_EXTERN CURLMcode curl_multi_setopt(CURLM *multi_handle,
      |                       ^~~~~~~~~~~~~~~~~
/nix/store/jviasb44hibgh09829gbmbssbz2jjnhz-curl-8.17.0-dev/include/curl/multi.h:429:23: error: expected identifier or '(' before ')' token
  429 | CURL_EXTERN CURLMcode curl_multi_setopt(CURLM *multi_handle,
      |                       ^~~~~~~~~~~~~~~~~
make: *** [<builtin>: src/event.o] Error 1

… and 1 more failed derivation
failed checks.aarch64-linux.psql_17_slim 21s
pg_net-0.20.0: from src/event.c:6: /nix/store/jviasb44hibgh09829gbmbssbz2jjnhz-curl-8.17.0-dev/include/curl/multi.h:429:23: error: expected ide …
pg_net-0.20.0:
                 from src/event.c:6:
/nix/store/jviasb44hibgh09829gbmbssbz2jjnhz-curl-8.17.0-dev/include/curl/multi.h:429:23: error: expected identifier or '(' before '__extension__'
  429 | CURL_EXTERN CURLMcode curl_multi_setopt(CURLM *multi_handle,
      |                       ^~~~~~~~~~~~~~~~~
/nix/store/jviasb44hibgh09829gbmbssbz2jjnhz-curl-8.17.0-dev/include/curl/multi.h:429:23: error: expected identifier or '(' before ')' token
  429 | CURL_EXTERN CURLMcode curl_multi_setopt(CURLM *multi_handle,
      |                       ^~~~~~~~~~~~~~~~~
make: *** [<builtin>: src/event.o] Error 1

pg_net-0.20.0:
                 from src/event.c:6:
/nix/store/jviasb44hibgh09829gbmbssbz2jjnhz-curl-8.17.0-dev/include/curl/multi.h:429:23: error: expected identifier or '(' before '__extension__'
  429 | CURL_EXTERN CURLMcode curl_multi_setopt(CURLM *multi_handle,
      |                       ^~~~~~~~~~~~~~~~~
/nix/store/jviasb44hibgh09829gbmbssbz2jjnhz-curl-8.17.0-dev/include/curl/multi.h:429:23: error: expected identifier or '(' before ')' token
  429 | CURL_EXTERN CURLMcode curl_multi_setopt(CURLM *multi_handle,
      |                       ^~~~~~~~~~~~~~~~~
make: *** [<builtin>: src/event.o] Error 1

pg_net-0.7:
                 from src/event.c:6:
/nix/store/jviasb44hibgh09829gbmbssbz2jjnhz-curl-8.17.0-dev/include/curl/multi.h:429:23: error: expected identifier or '(' before '__extension__'
  429 | CURL_EXTERN CURLMcode curl_multi_setopt(CURLM *multi_handle,
      |                       ^~~~~~~~~~~~~~~~~
/nix/store/jviasb44hibgh09829gbmbssbz2jjnhz-curl-8.17.0-dev/include/curl/multi.h:429:23: error: expected identifier or '(' before ')' token
  429 | CURL_EXTERN CURLMcode curl_multi_setopt(CURLM *multi_handle,
      |                       ^~~~~~~~~~~~~~~~~
make: *** [<builtin>: src/event.o] Error 1

… and 10 more failed derivations
failed checks.aarch64-linux.psql_orioledb-17 28s
pg_net-0.20.0: from src/event.c:6: /nix/store/jviasb44hibgh09829gbmbssbz2jjnhz-curl-8.17.0-dev/include/curl/multi.h:429:23: error: expected ide …
pg_net-0.20.0:
                 from src/event.c:6:
/nix/store/jviasb44hibgh09829gbmbssbz2jjnhz-curl-8.17.0-dev/include/curl/multi.h:429:23: error: expected identifier or '(' before '__extension__'
  429 | CURL_EXTERN CURLMcode curl_multi_setopt(CURLM *multi_handle,
      |                       ^~~~~~~~~~~~~~~~~
/nix/store/jviasb44hibgh09829gbmbssbz2jjnhz-curl-8.17.0-dev/include/curl/multi.h:429:23: error: expected identifier or '(' before ')' token
  429 | CURL_EXTERN CURLMcode curl_multi_setopt(CURLM *multi_handle,
      |                       ^~~~~~~~~~~~~~~~~
make: *** [<builtin>: src/event.o] Error 1

pg_net-0.20.0:
                 from src/event.c:6:
/nix/store/jviasb44hibgh09829gbmbssbz2jjnhz-curl-8.17.0-dev/include/curl/multi.h:429:23: error: expected identifier or '(' before '__extension__'
  429 | CURL_EXTERN CURLMcode curl_multi_setopt(CURLM *multi_handle,
      |                       ^~~~~~~~~~~~~~~~~
/nix/store/jviasb44hibgh09829gbmbssbz2jjnhz-curl-8.17.0-dev/include/curl/multi.h:429:23: error: expected identifier or '(' before ')' token
  429 | CURL_EXTERN CURLMcode curl_multi_setopt(CURLM *multi_handle,
      |                       ^~~~~~~~~~~~~~~~~
make: *** [<builtin>: src/event.o] Error 1

pg_net-0.7:
                 from src/event.c:6:
/nix/store/jviasb44hibgh09829gbmbssbz2jjnhz-curl-8.17.0-dev/include/curl/multi.h:429:23: error: expected identifier or '(' before '__extension__'
  429 | CURL_EXTERN CURLMcode curl_multi_setopt(CURLM *multi_handle,
      |                       ^~~~~~~~~~~~~~~~~
/nix/store/jviasb44hibgh09829gbmbssbz2jjnhz-curl-8.17.0-dev/include/curl/multi.h:429:23: error: expected identifier or '(' before ')' token
  429 | CURL_EXTERN CURLMcode curl_multi_setopt(CURLM *multi_handle,
      |                       ^~~~~~~~~~~~~~~~~
make: *** [<builtin>: src/event.o] Error 1

… and 10 more failed derivations
failed checks.aarch64-linux.psql_orioledb-17_slim 2m 51s
pg_net-0.20.0: from src/event.c:6: /nix/store/jviasb44hibgh09829gbmbssbz2jjnhz-curl-8.17.0-dev/include/curl/multi.h:429:23: error: expected ide …
pg_net-0.20.0:
                 from src/event.c:6:
/nix/store/jviasb44hibgh09829gbmbssbz2jjnhz-curl-8.17.0-dev/include/curl/multi.h:429:23: error: expected identifier or '(' before '__extension__'
  429 | CURL_EXTERN CURLMcode curl_multi_setopt(CURLM *multi_handle,
      |                       ^~~~~~~~~~~~~~~~~
/nix/store/jviasb44hibgh09829gbmbssbz2jjnhz-curl-8.17.0-dev/include/curl/multi.h:429:23: error: expected identifier or '(' before ')' token
  429 | CURL_EXTERN CURLMcode curl_multi_setopt(CURLM *multi_handle,
      |                       ^~~~~~~~~~~~~~~~~
make: *** [<builtin>: src/event.o] Error 1

pg_net-0.20.0:
                 from src/event.c:6:
/nix/store/jviasb44hibgh09829gbmbssbz2jjnhz-curl-8.17.0-dev/include/curl/multi.h:429:23: error: expected identifier or '(' before '__extension__'
  429 | CURL_EXTERN CURLMcode curl_multi_setopt(CURLM *multi_handle,
      |                       ^~~~~~~~~~~~~~~~~
/nix/store/jviasb44hibgh09829gbmbssbz2jjnhz-curl-8.17.0-dev/include/curl/multi.h:429:23: error: expected identifier or '(' before ')' token
  429 | CURL_EXTERN CURLMcode curl_multi_setopt(CURLM *multi_handle,
      |                       ^~~~~~~~~~~~~~~~~
make: *** [<builtin>: src/event.o] Error 1

pg_net-0.7:
                 from src/event.c:6:
/nix/store/jviasb44hibgh09829gbmbssbz2jjnhz-curl-8.17.0-dev/include/curl/multi.h:429:23: error: expected identifier or '(' before '__extension__'
  429 | CURL_EXTERN CURLMcode curl_multi_setopt(CURLM *multi_handle,
      |                       ^~~~~~~~~~~~~~~~~
/nix/store/jviasb44hibgh09829gbmbssbz2jjnhz-curl-8.17.0-dev/include/curl/multi.h:429:23: error: expected identifier or '(' before ')' token
  429 | CURL_EXTERN CURLMcode curl_multi_setopt(CURLM *multi_handle,
      |                       ^~~~~~~~~~~~~~~~~
make: *** [<builtin>: src/event.o] Error 1

… and 10 more failed derivations
failed checks.x86_64-linux.docker-image-test 1m 13s
pg_net-0.20.0: from src/event.c:6: /nix/store/wflnb8fxmq4lqx3ca91hlpv95vrqkv51-curl-8.17.0-dev/include/curl/multi.h:429:23: error: expected ide …
pg_net-0.20.0:
                 from src/event.c:6:
/nix/store/wflnb8fxmq4lqx3ca91hlpv95vrqkv51-curl-8.17.0-dev/include/curl/multi.h:429:23: error: expected identifier or '(' before '__extension__'
  429 | CURL_EXTERN CURLMcode curl_multi_setopt(CURLM *multi_handle,
      |                       ^~~~~~~~~~~~~~~~~
/nix/store/wflnb8fxmq4lqx3ca91hlpv95vrqkv51-curl-8.17.0-dev/include/curl/multi.h:429:23: error: expected identifier or '(' before ')' token
  429 | CURL_EXTERN CURLMcode curl_multi_setopt(CURLM *multi_handle,
      |                       ^~~~~~~~~~~~~~~~~
make: *** [<builtin>: src/event.o] Error 1

pg_net-0.19.5:
                 from src/event.c:6:
/nix/store/wflnb8fxmq4lqx3ca91hlpv95vrqkv51-curl-8.17.0-dev/include/curl/multi.h:429:23: error: expected identifier or '(' before '__extension__'
  429 | CURL_EXTERN CURLMcode curl_multi_setopt(CURLM *multi_handle,
      |                       ^~~~~~~~~~~~~~~~~
/nix/store/wflnb8fxmq4lqx3ca91hlpv95vrqkv51-curl-8.17.0-dev/include/curl/multi.h:429:23: error: expected identifier or '(' before ')' token
  429 | CURL_EXTERN CURLMcode curl_multi_setopt(CURLM *multi_handle,
      |                       ^~~~~~~~~~~~~~~~~
make: *** [<builtin>: src/event.o] Error 1

pg_net-0.7:
                 from src/event.c:6:
/nix/store/wflnb8fxmq4lqx3ca91hlpv95vrqkv51-curl-8.17.0-dev/include/curl/multi.h:429:23: error: expected identifier or '(' before '__extension__'
  429 | CURL_EXTERN CURLMcode curl_multi_setopt(CURLM *multi_handle,
      |                       ^~~~~~~~~~~~~~~~~
/nix/store/wflnb8fxmq4lqx3ca91hlpv95vrqkv51-curl-8.17.0-dev/include/curl/multi.h:429:23: error: expected identifier or '(' before ')' token
  429 | CURL_EXTERN CURLMcode curl_multi_setopt(CURLM *multi_handle,
      |                       ^~~~~~~~~~~~~~~~~
make: *** [<builtin>: src/event.o] Error 1

… and 10 more failed derivations
failed checks.x86_64-linux.ext-amcheck-upgrade 1m 12s
pg_net-0.13.0: from src/event.c:6: /nix/store/wflnb8fxmq4lqx3ca91hlpv95vrqkv51-curl-8.17.0-dev/include/curl/multi.h:429:23: error: expected ide …
pg_net-0.13.0:
                 from src/event.c:6:
/nix/store/wflnb8fxmq4lqx3ca91hlpv95vrqkv51-curl-8.17.0-dev/include/curl/multi.h:429:23: error: expected identifier or '(' before '__extension__'
  429 | CURL_EXTERN CURLMcode curl_multi_setopt(CURLM *multi_handle,
      |                       ^~~~~~~~~~~~~~~~~
/nix/store/wflnb8fxmq4lqx3ca91hlpv95vrqkv51-curl-8.17.0-dev/include/curl/multi.h:429:23: error: expected identifier or '(' before ')' token
  429 | CURL_EXTERN CURLMcode curl_multi_setopt(CURLM *multi_handle,
      |                       ^~~~~~~~~~~~~~~~~
make: *** [<builtin>: src/event.o] Error 1

pg_net-0.14.0:
                 from src/event.c:6:
/nix/store/wflnb8fxmq4lqx3ca91hlpv95vrqkv51-curl-8.17.0-dev/include/curl/multi.h:429:23: error: expected identifier or '(' before '__extension__'
  429 | CURL_EXTERN CURLMcode curl_multi_setopt(CURLM *multi_handle,
      |                       ^~~~~~~~~~~~~~~~~
/nix/store/wflnb8fxmq4lqx3ca91hlpv95vrqkv51-curl-8.17.0-dev/include/curl/multi.h:429:23: error: expected identifier or '(' before ')' token
  429 | CURL_EXTERN CURLMcode curl_multi_setopt(CURLM *multi_handle,
      |                       ^~~~~~~~~~~~~~~~~
make: *** [<builtin>: src/event.o] Error 1

pg_net-0.7:
                 from src/event.c:6:
/nix/store/wflnb8fxmq4lqx3ca91hlpv95vrqkv51-curl-8.17.0-dev/include/curl/multi.h:429:23: error: expected identifier or '(' before '__extension__'
  429 | CURL_EXTERN CURLMcode curl_multi_setopt(CURLM *multi_handle,
      |                       ^~~~~~~~~~~~~~~~~
/nix/store/wflnb8fxmq4lqx3ca91hlpv95vrqkv51-curl-8.17.0-dev/include/curl/multi.h:429:23: error: expected identifier or '(' before ')' token
  429 | CURL_EXTERN CURLMcode curl_multi_setopt(CURLM *multi_handle,
      |                       ^~~~~~~~~~~~~~~~~
make: *** [<builtin>: src/event.o] Error 1

… and 6 more failed derivations
failed checks.x86_64-linux.ext-http 20s
pg_net-0.7: from src/event.c:6: /nix/store/wflnb8fxmq4lqx3ca91hlpv95vrqkv51-curl-8.17.0-dev/include/curl/multi.h:429:23: error: expected identi …
pg_net-0.7:
                 from src/event.c:6:
/nix/store/wflnb8fxmq4lqx3ca91hlpv95vrqkv51-curl-8.17.0-dev/include/curl/multi.h:429:23: error: expected identifier or '(' before '__extension__'
  429 | CURL_EXTERN CURLMcode curl_multi_setopt(CURLM *multi_handle,
      |                       ^~~~~~~~~~~~~~~~~
/nix/store/wflnb8fxmq4lqx3ca91hlpv95vrqkv51-curl-8.17.0-dev/include/curl/multi.h:429:23: error: expected identifier or '(' before ')' token
  429 | CURL_EXTERN CURLMcode curl_multi_setopt(CURLM *multi_handle,
      |                       ^~~~~~~~~~~~~~~~~
make: *** [<builtin>: src/event.o] Error 1

pg_net-0.19.5:
                 from src/event.c:6:
/nix/store/wflnb8fxmq4lqx3ca91hlpv95vrqkv51-curl-8.17.0-dev/include/curl/multi.h:429:23: error: expected identifier or '(' before '__extension__'
  429 | CURL_EXTERN CURLMcode curl_multi_setopt(CURLM *multi_handle,
      |                       ^~~~~~~~~~~~~~~~~
/nix/store/wflnb8fxmq4lqx3ca91hlpv95vrqkv51-curl-8.17.0-dev/include/curl/multi.h:429:23: error: expected identifier or '(' before ')' token
  429 | CURL_EXTERN CURLMcode curl_multi_setopt(CURLM *multi_handle,
      |                       ^~~~~~~~~~~~~~~~~
make: *** [<builtin>: src/event.o] Error 1

pg_net-0.20.0:
                 from src/event.c:6:
/nix/store/wflnb8fxmq4lqx3ca91hlpv95vrqkv51-curl-8.17.0-dev/include/curl/multi.h:429:23: error: expected identifier or '(' before '__extension__'
  429 | CURL_EXTERN CURLMcode curl_multi_setopt(CURLM *multi_handle,
      |                       ^~~~~~~~~~~~~~~~~
/nix/store/wflnb8fxmq4lqx3ca91hlpv95vrqkv51-curl-8.17.0-dev/include/curl/multi.h:429:23: error: expected identifier or '(' before ')' token
  429 | CURL_EXTERN CURLMcode curl_multi_setopt(CURLM *multi_handle,
      |                       ^~~~~~~~~~~~~~~~~
make: *** [<builtin>: src/event.o] Error 1

… and 10 more failed derivations
failed checks.x86_64-linux.ext-index_advisor 1m 20s
pg_net-0.20.0: from src/event.c:6: /nix/store/wflnb8fxmq4lqx3ca91hlpv95vrqkv51-curl-8.17.0-dev/include/curl/multi.h:429:23: error: expected ide …
pg_net-0.20.0:
                 from src/event.c:6:
/nix/store/wflnb8fxmq4lqx3ca91hlpv95vrqkv51-curl-8.17.0-dev/include/curl/multi.h:429:23: error: expected identifier or '(' before '__extension__'
  429 | CURL_EXTERN CURLMcode curl_multi_setopt(CURLM *multi_handle,
      |                       ^~~~~~~~~~~~~~~~~
/nix/store/wflnb8fxmq4lqx3ca91hlpv95vrqkv51-curl-8.17.0-dev/include/curl/multi.h:429:23: error: expected identifier or '(' before ')' token
  429 | CURL_EXTERN CURLMcode curl_multi_setopt(CURLM *multi_handle,
      |                       ^~~~~~~~~~~~~~~~~
make: *** [<builtin>: src/event.o] Error 1

pg_net-0.7:
                 from src/event.c:6:
/nix/store/wflnb8fxmq4lqx3ca91hlpv95vrqkv51-curl-8.17.0-dev/include/curl/multi.h:429:23: error: expected identifier or '(' before '__extension__'
  429 | CURL_EXTERN CURLMcode curl_multi_setopt(CURLM *multi_handle,
      |                       ^~~~~~~~~~~~~~~~~
/nix/store/wflnb8fxmq4lqx3ca91hlpv95vrqkv51-curl-8.17.0-dev/include/curl/multi.h:429:23: error: expected identifier or '(' before ')' token
  429 | CURL_EXTERN CURLMcode curl_multi_setopt(CURLM *multi_handle,
      |                       ^~~~~~~~~~~~~~~~~
make: *** [<builtin>: src/event.o] Error 1

pg_net-0.19.5:
                 from src/event.c:6:
/nix/store/wflnb8fxmq4lqx3ca91hlpv95vrqkv51-curl-8.17.0-dev/include/curl/multi.h:429:23: error: expected identifier or '(' before '__extension__'
  429 | CURL_EXTERN CURLMcode curl_multi_setopt(CURLM *multi_handle,
      |                       ^~~~~~~~~~~~~~~~~
/nix/store/wflnb8fxmq4lqx3ca91hlpv95vrqkv51-curl-8.17.0-dev/include/curl/multi.h:429:23: error: expected identifier or '(' before ')' token
  429 | CURL_EXTERN CURLMcode curl_multi_setopt(CURLM *multi_handle,
      |                       ^~~~~~~~~~~~~~~~~
make: *** [<builtin>: src/event.o] Error 1

… and 10 more failed derivations
failed checks.x86_64-linux.ext-orioledb 1m 27s
pg_net-0.7: from src/event.c:6: /nix/store/wflnb8fxmq4lqx3ca91hlpv95vrqkv51-curl-8.17.0-dev/include/curl/multi.h:429:23: error: expected identi …
pg_net-0.7:
                 from src/event.c:6:
/nix/store/wflnb8fxmq4lqx3ca91hlpv95vrqkv51-curl-8.17.0-dev/include/curl/multi.h:429:23: error: expected identifier or '(' before '__extension__'
  429 | CURL_EXTERN CURLMcode curl_multi_setopt(CURLM *multi_handle,
      |                       ^~~~~~~~~~~~~~~~~
/nix/store/wflnb8fxmq4lqx3ca91hlpv95vrqkv51-curl-8.17.0-dev/include/curl/multi.h:429:23: error: expected identifier or '(' before ')' token
  429 | CURL_EXTERN CURLMcode curl_multi_setopt(CURLM *multi_handle,
      |                       ^~~~~~~~~~~~~~~~~
make: *** [<builtin>: src/event.o] Error 1

pg_net-0.20.0:
                 from src/event.c:6:
/nix/store/wflnb8fxmq4lqx3ca91hlpv95vrqkv51-curl-8.17.0-dev/include/curl/multi.h:429:23: error: expected identifier or '(' before '__extension__'
  429 | CURL_EXTERN CURLMcode curl_multi_setopt(CURLM *multi_handle,
      |                       ^~~~~~~~~~~~~~~~~
/nix/store/wflnb8fxmq4lqx3ca91hlpv95vrqkv51-curl-8.17.0-dev/include/curl/multi.h:429:23: error: expected identifier or '(' before ')' token
  429 | CURL_EXTERN CURLMcode curl_multi_setopt(CURLM *multi_handle,
      |                       ^~~~~~~~~~~~~~~~~
make: *** [<builtin>: src/event.o] Error 1

pg_net-0.19.5:
                 from src/event.c:6:
/nix/store/wflnb8fxmq4lqx3ca91hlpv95vrqkv51-curl-8.17.0-dev/include/curl/multi.h:429:23: error: expected identifier or '(' before '__extension__'
  429 | CURL_EXTERN CURLMcode curl_multi_setopt(CURLM *multi_handle,
      |                       ^~~~~~~~~~~~~~~~~
/nix/store/wflnb8fxmq4lqx3ca91hlpv95vrqkv51-curl-8.17.0-dev/include/curl/multi.h:429:23: error: expected identifier or '(' before ')' token
  429 | CURL_EXTERN CURLMcode curl_multi_setopt(CURLM *multi_handle,
      |                       ^~~~~~~~~~~~~~~~~
make: *** [<builtin>: src/event.o] Error 1

… and 6 more failed derivations
failed checks.x86_64-linux.ext-pgjwt 1m 39s
pg_net-0.14.0: from src/event.c:6: /nix/store/wflnb8fxmq4lqx3ca91hlpv95vrqkv51-curl-8.17.0-dev/include/curl/multi.h:429:23: error: expected ide …
pg_net-0.14.0:
                 from src/event.c:6:
/nix/store/wflnb8fxmq4lqx3ca91hlpv95vrqkv51-curl-8.17.0-dev/include/curl/multi.h:429:23: error: expected identifier or '(' before '__extension__'
  429 | CURL_EXTERN CURLMcode curl_multi_setopt(CURLM *multi_handle,
      |                       ^~~~~~~~~~~~~~~~~
/nix/store/wflnb8fxmq4lqx3ca91hlpv95vrqkv51-curl-8.17.0-dev/include/curl/multi.h:429:23: error: expected identifier or '(' before ')' token
  429 | CURL_EXTERN CURLMcode curl_multi_setopt(CURLM *multi_handle,
      |                       ^~~~~~~~~~~~~~~~~
make: *** [<builtin>: src/event.o] Error 1

pg_net-0.14.0:
                 from src/event.c:6:
/nix/store/wflnb8fxmq4lqx3ca91hlpv95vrqkv51-curl-8.17.0-dev/include/curl/multi.h:429:23: error: expected identifier or '(' before '__extension__'
  429 | CURL_EXTERN CURLMcode curl_multi_setopt(CURLM *multi_handle,
      |                       ^~~~~~~~~~~~~~~~~
/nix/store/wflnb8fxmq4lqx3ca91hlpv95vrqkv51-curl-8.17.0-dev/include/curl/multi.h:429:23: error: expected identifier or '(' before ')' token
  429 | CURL_EXTERN CURLMcode curl_multi_setopt(CURLM *multi_handle,
      |                       ^~~~~~~~~~~~~~~~~
make: *** [<builtin>: src/event.o] Error 1

pg_net-0.19.5:
                 from src/event.c:6:
/nix/store/wflnb8fxmq4lqx3ca91hlpv95vrqkv51-curl-8.17.0-dev/include/curl/multi.h:429:23: error: expected identifier or '(' before '__extension__'
  429 | CURL_EXTERN CURLMcode curl_multi_setopt(CURLM *multi_handle,
      |                       ^~~~~~~~~~~~~~~~~
/nix/store/wflnb8fxmq4lqx3ca91hlpv95vrqkv51-curl-8.17.0-dev/include/curl/multi.h:429:23: error: expected identifier or '(' before ')' token
  429 | CURL_EXTERN CURLMcode curl_multi_setopt(CURLM *multi_handle,
      |                       ^~~~~~~~~~~~~~~~~
make: *** [<builtin>: src/event.o] Error 1

… and 10 more failed derivations
failed checks.x86_64-linux.ext-pgmq 14s
pg_net-0.19.5: from src/event.c:6: /nix/store/wflnb8fxmq4lqx3ca91hlpv95vrqkv51-curl-8.17.0-dev/include/curl/multi.h:429:23: error: expected ide …
pg_net-0.19.5:
                 from src/event.c:6:
/nix/store/wflnb8fxmq4lqx3ca91hlpv95vrqkv51-curl-8.17.0-dev/include/curl/multi.h:429:23: error: expected identifier or '(' before '__extension__'
  429 | CURL_EXTERN CURLMcode curl_multi_setopt(CURLM *multi_handle,
      |                       ^~~~~~~~~~~~~~~~~
/nix/store/wflnb8fxmq4lqx3ca91hlpv95vrqkv51-curl-8.17.0-dev/include/curl/multi.h:429:23: error: expected identifier or '(' before ')' token
  429 | CURL_EXTERN CURLMcode curl_multi_setopt(CURLM *multi_handle,
      |                       ^~~~~~~~~~~~~~~~~
make: *** [<builtin>: src/event.o] Error 1

pg_net-0.7:
                 from src/event.c:6:
/nix/store/wflnb8fxmq4lqx3ca91hlpv95vrqkv51-curl-8.17.0-dev/include/curl/multi.h:429:23: error: expected identifier or '(' before '__extension__'
  429 | CURL_EXTERN CURLMcode curl_multi_setopt(CURLM *multi_handle,
      |                       ^~~~~~~~~~~~~~~~~
/nix/store/wflnb8fxmq4lqx3ca91hlpv95vrqkv51-curl-8.17.0-dev/include/curl/multi.h:429:23: error: expected identifier or '(' before ')' token
  429 | CURL_EXTERN CURLMcode curl_multi_setopt(CURLM *multi_handle,
      |                       ^~~~~~~~~~~~~~~~~
make: *** [<builtin>: src/event.o] Error 1

pg_net-0.20.0:
                 from src/event.c:6:
/nix/store/wflnb8fxmq4lqx3ca91hlpv95vrqkv51-curl-8.17.0-dev/include/curl/multi.h:429:23: error: expected identifier or '(' before '__extension__'
  429 | CURL_EXTERN CURLMcode curl_multi_setopt(CURLM *multi_handle,
      |                       ^~~~~~~~~~~~~~~~~
/nix/store/wflnb8fxmq4lqx3ca91hlpv95vrqkv51-curl-8.17.0-dev/include/curl/multi.h:429:23: error: expected identifier or '(' before ')' token
  429 | CURL_EXTERN CURLMcode curl_multi_setopt(CURLM *multi_handle,
      |                       ^~~~~~~~~~~~~~~~~
make: *** [<builtin>: src/event.o] Error 1

… and 10 more failed derivations
failed checks.x86_64-linux.ext-pg_net 1m 13s
pg_net-0.14.0: from src/event.c:6: /nix/store/wflnb8fxmq4lqx3ca91hlpv95vrqkv51-curl-8.17.0-dev/include/curl/multi.h:429:23: error: expected ide …
pg_net-0.14.0:
                 from src/event.c:6:
/nix/store/wflnb8fxmq4lqx3ca91hlpv95vrqkv51-curl-8.17.0-dev/include/curl/multi.h:429:23: error: expected identifier or '(' before '__extension__'
  429 | CURL_EXTERN CURLMcode curl_multi_setopt(CURLM *multi_handle,
      |                       ^~~~~~~~~~~~~~~~~
/nix/store/wflnb8fxmq4lqx3ca91hlpv95vrqkv51-curl-8.17.0-dev/include/curl/multi.h:429:23: error: expected identifier or '(' before ')' token
  429 | CURL_EXTERN CURLMcode curl_multi_setopt(CURLM *multi_handle,
      |                       ^~~~~~~~~~~~~~~~~
make: *** [<builtin>: src/event.o] Error 1

pg_net-0.19.5:
                 from src/event.c:6:
/nix/store/wflnb8fxmq4lqx3ca91hlpv95vrqkv51-curl-8.17.0-dev/include/curl/multi.h:429:23: error: expected identifier or '(' before '__extension__'
  429 | CURL_EXTERN CURLMcode curl_multi_setopt(CURLM *multi_handle,
      |                       ^~~~~~~~~~~~~~~~~
/nix/store/wflnb8fxmq4lqx3ca91hlpv95vrqkv51-curl-8.17.0-dev/include/curl/multi.h:429:23: error: expected identifier or '(' before ')' token
  429 | CURL_EXTERN CURLMcode curl_multi_setopt(CURLM *multi_handle,
      |                       ^~~~~~~~~~~~~~~~~
make: *** [<builtin>: src/event.o] Error 1

pg_net-0.20.0:
                 from src/event.c:6:
/nix/store/wflnb8fxmq4lqx3ca91hlpv95vrqkv51-curl-8.17.0-dev/include/curl/multi.h:429:23: error: expected identifier or '(' before '__extension__'
  429 | CURL_EXTERN CURLMcode curl_multi_setopt(CURLM *multi_handle,
      |                       ^~~~~~~~~~~~~~~~~
/nix/store/wflnb8fxmq4lqx3ca91hlpv95vrqkv51-curl-8.17.0-dev/include/curl/multi.h:429:23: error: expected identifier or '(' before ')' token
  429 | CURL_EXTERN CURLMcode curl_multi_setopt(CURLM *multi_handle,
      |                       ^~~~~~~~~~~~~~~~~
make: *** [<builtin>: src/event.o] Error 1

… and 10 more failed derivations
failed checks.x86_64-linux.ext-pg_plan_filter 1m 40s
pg_net-0.7: from src/event.c:6: /nix/store/wflnb8fxmq4lqx3ca91hlpv95vrqkv51-curl-8.17.0-dev/include/curl/multi.h:429:23: error: expected identi …
pg_net-0.7:
                 from src/event.c:6:
/nix/store/wflnb8fxmq4lqx3ca91hlpv95vrqkv51-curl-8.17.0-dev/include/curl/multi.h:429:23: error: expected identifier or '(' before '__extension__'
  429 | CURL_EXTERN CURLMcode curl_multi_setopt(CURLM *multi_handle,
      |                       ^~~~~~~~~~~~~~~~~
/nix/store/wflnb8fxmq4lqx3ca91hlpv95vrqkv51-curl-8.17.0-dev/include/curl/multi.h:429:23: error: expected identifier or '(' before ')' token
  429 | CURL_EXTERN CURLMcode curl_multi_setopt(CURLM *multi_handle,
      |                       ^~~~~~~~~~~~~~~~~
make: *** [<builtin>: src/event.o] Error 1

pg_net-0.19.5:
                 from src/event.c:6:
/nix/store/wflnb8fxmq4lqx3ca91hlpv95vrqkv51-curl-8.17.0-dev/include/curl/multi.h:429:23: error: expected identifier or '(' before '__extension__'
  429 | CURL_EXTERN CURLMcode curl_multi_setopt(CURLM *multi_handle,
      |                       ^~~~~~~~~~~~~~~~~
/nix/store/wflnb8fxmq4lqx3ca91hlpv95vrqkv51-curl-8.17.0-dev/include/curl/multi.h:429:23: error: expected identifier or '(' before ')' token
  429 | CURL_EXTERN CURLMcode curl_multi_setopt(CURLM *multi_handle,
      |                       ^~~~~~~~~~~~~~~~~
make: *** [<builtin>: src/event.o] Error 1

pg_net-0.19.5:
                 from src/event.c:6:
/nix/store/wflnb8fxmq4lqx3ca91hlpv95vrqkv51-curl-8.17.0-dev/include/curl/multi.h:429:23: error: expected identifier or '(' before '__extension__'
  429 | CURL_EXTERN CURLMcode curl_multi_setopt(CURLM *multi_handle,
      |                       ^~~~~~~~~~~~~~~~~
/nix/store/wflnb8fxmq4lqx3ca91hlpv95vrqkv51-curl-8.17.0-dev/include/curl/multi.h:429:23: error: expected identifier or '(' before ')' token
  429 | CURL_EXTERN CURLMcode curl_multi_setopt(CURLM *multi_handle,
      |                       ^~~~~~~~~~~~~~~~~
make: *** [<builtin>: src/event.o] Error 1

… and 10 more failed derivations
failed checks.x86_64-linux.ext-pg_repack 1m 35s
pg_net-0.14.0: from src/event.c:6: /nix/store/wflnb8fxmq4lqx3ca91hlpv95vrqkv51-curl-8.17.0-dev/include/curl/multi.h:429:23: error: expected ide …
pg_net-0.14.0:
                 from src/event.c:6:
/nix/store/wflnb8fxmq4lqx3ca91hlpv95vrqkv51-curl-8.17.0-dev/include/curl/multi.h:429:23: error: expected identifier or '(' before '__extension__'
  429 | CURL_EXTERN CURLMcode curl_multi_setopt(CURLM *multi_handle,
      |                       ^~~~~~~~~~~~~~~~~
/nix/store/wflnb8fxmq4lqx3ca91hlpv95vrqkv51-curl-8.17.0-dev/include/curl/multi.h:429:23: error: expected identifier or '(' before ')' token
  429 | CURL_EXTERN CURLMcode curl_multi_setopt(CURLM *multi_handle,
      |                       ^~~~~~~~~~~~~~~~~
make: *** [<builtin>: src/event.o] Error 1

pg_net-0.7:
                 from src/event.c:6:
/nix/store/wflnb8fxmq4lqx3ca91hlpv95vrqkv51-curl-8.17.0-dev/include/curl/multi.h:429:23: error: expected identifier or '(' before '__extension__'
  429 | CURL_EXTERN CURLMcode curl_multi_setopt(CURLM *multi_handle,
      |                       ^~~~~~~~~~~~~~~~~
/nix/store/wflnb8fxmq4lqx3ca91hlpv95vrqkv51-curl-8.17.0-dev/include/curl/multi.h:429:23: error: expected identifier or '(' before ')' token
  429 | CURL_EXTERN CURLMcode curl_multi_setopt(CURLM *multi_handle,
      |                       ^~~~~~~~~~~~~~~~~
make: *** [<builtin>: src/event.o] Error 1

pg_net-0.19.5:
                 from src/event.c:6:
/nix/store/wflnb8fxmq4lqx3ca91hlpv95vrqkv51-curl-8.17.0-dev/include/curl/multi.h:429:23: error: expected identifier or '(' before '__extension__'
  429 | CURL_EXTERN CURLMcode curl_multi_setopt(CURLM *multi_handle,
      |                       ^~~~~~~~~~~~~~~~~
/nix/store/wflnb8fxmq4lqx3ca91hlpv95vrqkv51-curl-8.17.0-dev/include/curl/multi.h:429:23: error: expected identifier or '(' before ')' token
  429 | CURL_EXTERN CURLMcode curl_multi_setopt(CURLM *multi_handle,
      |                       ^~~~~~~~~~~~~~~~~
make: *** [<builtin>: src/event.o] Error 1

… and 10 more failed derivations
failed checks.x86_64-linux.ext-pgroonga 15s
pg_net-0.20.0: from src/event.c:6: /nix/store/wflnb8fxmq4lqx3ca91hlpv95vrqkv51-curl-8.17.0-dev/include/curl/multi.h:429:23: error: expected ide …
pg_net-0.20.0:
                 from src/event.c:6:
/nix/store/wflnb8fxmq4lqx3ca91hlpv95vrqkv51-curl-8.17.0-dev/include/curl/multi.h:429:23: error: expected identifier or '(' before '__extension__'
  429 | CURL_EXTERN CURLMcode curl_multi_setopt(CURLM *multi_handle,
      |                       ^~~~~~~~~~~~~~~~~
/nix/store/wflnb8fxmq4lqx3ca91hlpv95vrqkv51-curl-8.17.0-dev/include/curl/multi.h:429:23: error: expected identifier or '(' before ')' token
  429 | CURL_EXTERN CURLMcode curl_multi_setopt(CURLM *multi_handle,
      |                       ^~~~~~~~~~~~~~~~~
make: *** [<builtin>: src/event.o] Error 1

pg_net-0.13.0:
                 from src/event.c:6:
/nix/store/wflnb8fxmq4lqx3ca91hlpv95vrqkv51-curl-8.17.0-dev/include/curl/multi.h:429:23: error: expected identifier or '(' before '__extension__'
  429 | CURL_EXTERN CURLMcode curl_multi_setopt(CURLM *multi_handle,
      |                       ^~~~~~~~~~~~~~~~~
/nix/store/wflnb8fxmq4lqx3ca91hlpv95vrqkv51-curl-8.17.0-dev/include/curl/multi.h:429:23: error: expected identifier or '(' before ')' token
  429 | CURL_EXTERN CURLMcode curl_multi_setopt(CURLM *multi_handle,
      |                       ^~~~~~~~~~~~~~~~~
make: *** [<builtin>: src/event.o] Error 1

pg_net-0.19.5:
                 from src/event.c:6:
/nix/store/wflnb8fxmq4lqx3ca91hlpv95vrqkv51-curl-8.17.0-dev/include/curl/multi.h:429:23: error: expected identifier or '(' before '__extension__'
  429 | CURL_EXTERN CURLMcode curl_multi_setopt(CURLM *multi_handle,
      |                       ^~~~~~~~~~~~~~~~~
/nix/store/wflnb8fxmq4lqx3ca91hlpv95vrqkv51-curl-8.17.0-dev/include/curl/multi.h:429:23: error: expected identifier or '(' before ')' token
  429 | CURL_EXTERN CURLMcode curl_multi_setopt(CURLM *multi_handle,
      |                       ^~~~~~~~~~~~~~~~~
make: *** [<builtin>: src/event.o] Error 1

… and 10 more failed derivations
failed checks.x86_64-linux.ext-pgrouting 1m 35s
pg_net-0.19.5: from src/event.c:6: /nix/store/wflnb8fxmq4lqx3ca91hlpv95vrqkv51-curl-8.17.0-dev/include/curl/multi.h:429:23: error: expected ide …
pg_net-0.19.5:
                 from src/event.c:6:
/nix/store/wflnb8fxmq4lqx3ca91hlpv95vrqkv51-curl-8.17.0-dev/include/curl/multi.h:429:23: error: expected identifier or '(' before '__extension__'
  429 | CURL_EXTERN CURLMcode curl_multi_setopt(CURLM *multi_handle,
      |                       ^~~~~~~~~~~~~~~~~
/nix/store/wflnb8fxmq4lqx3ca91hlpv95vrqkv51-curl-8.17.0-dev/include/curl/multi.h:429:23: error: expected identifier or '(' before ')' token
  429 | CURL_EXTERN CURLMcode curl_multi_setopt(CURLM *multi_handle,
      |                       ^~~~~~~~~~~~~~~~~
make: *** [<builtin>: src/event.o] Error 1

pg_net-0.19.5:
                 from src/event.c:6:
/nix/store/wflnb8fxmq4lqx3ca91hlpv95vrqkv51-curl-8.17.0-dev/include/curl/multi.h:429:23: error: expected identifier or '(' before '__extension__'
  429 | CURL_EXTERN CURLMcode curl_multi_setopt(CURLM *multi_handle,
      |                       ^~~~~~~~~~~~~~~~~
/nix/store/wflnb8fxmq4lqx3ca91hlpv95vrqkv51-curl-8.17.0-dev/include/curl/multi.h:429:23: error: expected identifier or '(' before ')' token
  429 | CURL_EXTERN CURLMcode curl_multi_setopt(CURLM *multi_handle,
      |                       ^~~~~~~~~~~~~~~~~
make: *** [<builtin>: src/event.o] Error 1

pg_net-0.7:
                 from src/event.c:6:
/nix/store/wflnb8fxmq4lqx3ca91hlpv95vrqkv51-curl-8.17.0-dev/include/curl/multi.h:429:23: error: expected identifier or '(' before '__extension__'
  429 | CURL_EXTERN CURLMcode curl_multi_setopt(CURLM *multi_handle,
      |                       ^~~~~~~~~~~~~~~~~
/nix/store/wflnb8fxmq4lqx3ca91hlpv95vrqkv51-curl-8.17.0-dev/include/curl/multi.h:429:23: error: expected identifier or '(' before ')' token
  429 | CURL_EXTERN CURLMcode curl_multi_setopt(CURLM *multi_handle,
      |                       ^~~~~~~~~~~~~~~~~
make: *** [<builtin>: src/event.o] Error 1

… and 10 more failed derivations
failed checks.x86_64-linux.ext-pgsodium 1m 14s
pg_net-0.20.0: from src/event.c:6: /nix/store/wflnb8fxmq4lqx3ca91hlpv95vrqkv51-curl-8.17.0-dev/include/curl/multi.h:429:23: error: expected ide …
pg_net-0.20.0:
                 from src/event.c:6:
/nix/store/wflnb8fxmq4lqx3ca91hlpv95vrqkv51-curl-8.17.0-dev/include/curl/multi.h:429:23: error: expected identifier or '(' before '__extension__'
  429 | CURL_EXTERN CURLMcode curl_multi_setopt(CURLM *multi_handle,
      |                       ^~~~~~~~~~~~~~~~~
/nix/store/wflnb8fxmq4lqx3ca91hlpv95vrqkv51-curl-8.17.0-dev/include/curl/multi.h:429:23: error: expected identifier or '(' before ')' token
  429 | CURL_EXTERN CURLMcode curl_multi_setopt(CURLM *multi_handle,
      |                       ^~~~~~~~~~~~~~~~~
make: *** [<builtin>: src/event.o] Error 1

pg_net-0.19.5:
                 from src/event.c:6:
/nix/store/wflnb8fxmq4lqx3ca91hlpv95vrqkv51-curl-8.17.0-dev/include/curl/multi.h:429:23: error: expected identifier or '(' before '__extension__'
  429 | CURL_EXTERN CURLMcode curl_multi_setopt(CURLM *multi_handle,
      |                       ^~~~~~~~~~~~~~~~~
/nix/store/wflnb8fxmq4lqx3ca91hlpv95vrqkv51-curl-8.17.0-dev/include/curl/multi.h:429:23: error: expected identifier or '(' before ')' token
  429 | CURL_EXTERN CURLMcode curl_multi_setopt(CURLM *multi_handle,
      |                       ^~~~~~~~~~~~~~~~~
make: *** [<builtin>: src/event.o] Error 1

pg_net-0.19.5:
                 from src/event.c:6:
/nix/store/wflnb8fxmq4lqx3ca91hlpv95vrqkv51-curl-8.17.0-dev/include/curl/multi.h:429:23: error: expected identifier or '(' before '__extension__'
  429 | CURL_EXTERN CURLMcode curl_multi_setopt(CURLM *multi_handle,
      |                       ^~~~~~~~~~~~~~~~~
/nix/store/wflnb8fxmq4lqx3ca91hlpv95vrqkv51-curl-8.17.0-dev/include/curl/multi.h:429:23: error: expected identifier or '(' before ')' token
  429 | CURL_EXTERN CURLMcode curl_multi_setopt(CURLM *multi_handle,
      |                       ^~~~~~~~~~~~~~~~~
make: *** [<builtin>: src/event.o] Error 1

… and 10 more failed derivations
failed checks.x86_64-linux.ext-plpgsql_check 41s
pg_net-0.13.0: from src/event.c:6: /nix/store/wflnb8fxmq4lqx3ca91hlpv95vrqkv51-curl-8.17.0-dev/include/curl/multi.h:429:23: error: expected ide …
pg_net-0.13.0:
                 from src/event.c:6:
/nix/store/wflnb8fxmq4lqx3ca91hlpv95vrqkv51-curl-8.17.0-dev/include/curl/multi.h:429:23: error: expected identifier or '(' before '__extension__'
  429 | CURL_EXTERN CURLMcode curl_multi_setopt(CURLM *multi_handle,
      |                       ^~~~~~~~~~~~~~~~~
/nix/store/wflnb8fxmq4lqx3ca91hlpv95vrqkv51-curl-8.17.0-dev/include/curl/multi.h:429:23: error: expected identifier or '(' before ')' token
  429 | CURL_EXTERN CURLMcode curl_multi_setopt(CURLM *multi_handle,
      |                       ^~~~~~~~~~~~~~~~~
make: *** [<builtin>: src/event.o] Error 1

pg_net-0.20.0:
                 from src/event.c:6:
/nix/store/wflnb8fxmq4lqx3ca91hlpv95vrqkv51-curl-8.17.0-dev/include/curl/multi.h:429:23: error: expected identifier or '(' before '__extension__'
  429 | CURL_EXTERN CURLMcode curl_multi_setopt(CURLM *multi_handle,
      |                       ^~~~~~~~~~~~~~~~~
/nix/store/wflnb8fxmq4lqx3ca91hlpv95vrqkv51-curl-8.17.0-dev/include/curl/multi.h:429:23: error: expected identifier or '(' before ')' token
  429 | CURL_EXTERN CURLMcode curl_multi_setopt(CURLM *multi_handle,
      |                       ^~~~~~~~~~~~~~~~~
make: *** [<builtin>: src/event.o] Error 1

pg_net-0.7:
                 from src/event.c:6:
/nix/store/wflnb8fxmq4lqx3ca91hlpv95vrqkv51-curl-8.17.0-dev/include/curl/multi.h:429:23: error: expected identifier or '(' before '__extension__'
  429 | CURL_EXTERN CURLMcode curl_multi_setopt(CURLM *multi_handle,
      |                       ^~~~~~~~~~~~~~~~~
/nix/store/wflnb8fxmq4lqx3ca91hlpv95vrqkv51-curl-8.17.0-dev/include/curl/multi.h:429:23: error: expected identifier or '(' before ')' token
  429 | CURL_EXTERN CURLMcode curl_multi_setopt(CURLM *multi_handle,
      |                       ^~~~~~~~~~~~~~~~~
make: *** [<builtin>: src/event.o] Error 1

… and 10 more failed derivations
failed checks.x86_64-linux.ext-plv8 1m 54s
pg_net-0.14.0: from src/event.c:6: /nix/store/wflnb8fxmq4lqx3ca91hlpv95vrqkv51-curl-8.17.0-dev/include/curl/multi.h:429:23: error: expected ide …
pg_net-0.14.0:
                 from src/event.c:6:
/nix/store/wflnb8fxmq4lqx3ca91hlpv95vrqkv51-curl-8.17.0-dev/include/curl/multi.h:429:23: error: expected identifier or '(' before '__extension__'
  429 | CURL_EXTERN CURLMcode curl_multi_setopt(CURLM *multi_handle,
      |                       ^~~~~~~~~~~~~~~~~
/nix/store/wflnb8fxmq4lqx3ca91hlpv95vrqkv51-curl-8.17.0-dev/include/curl/multi.h:429:23: error: expected identifier or '(' before ')' token
  429 | CURL_EXTERN CURLMcode curl_multi_setopt(CURLM *multi_handle,
      |                       ^~~~~~~~~~~~~~~~~
make: *** [<builtin>: src/event.o] Error 1

pg_net-0.7:
                 from src/event.c:6:
/nix/store/wflnb8fxmq4lqx3ca91hlpv95vrqkv51-curl-8.17.0-dev/include/curl/multi.h:429:23: error: expected identifier or '(' before '__extension__'
  429 | CURL_EXTERN CURLMcode curl_multi_setopt(CURLM *multi_handle,
      |                       ^~~~~~~~~~~~~~~~~
/nix/store/wflnb8fxmq4lqx3ca91hlpv95vrqkv51-curl-8.17.0-dev/include/curl/multi.h:429:23: error: expected identifier or '(' before ')' token
  429 | CURL_EXTERN CURLMcode curl_multi_setopt(CURLM *multi_handle,
      |                       ^~~~~~~~~~~~~~~~~
make: *** [<builtin>: src/event.o] Error 1

pg_net-0.19.5:
                 from src/event.c:6:
/nix/store/wflnb8fxmq4lqx3ca91hlpv95vrqkv51-curl-8.17.0-dev/include/curl/multi.h:429:23: error: expected identifier or '(' before '__extension__'
  429 | CURL_EXTERN CURLMcode curl_multi_setopt(CURLM *multi_handle,
      |                       ^~~~~~~~~~~~~~~~~
/nix/store/wflnb8fxmq4lqx3ca91hlpv95vrqkv51-curl-8.17.0-dev/include/curl/multi.h:429:23: error: expected identifier or '(' before ')' token
  429 | CURL_EXTERN CURLMcode curl_multi_setopt(CURLM *multi_handle,
      |                       ^~~~~~~~~~~~~~~~~
make: *** [<builtin>: src/event.o] Error 1

… and 2 more failed derivations
failed checks.x86_64-linux.ext-postgis 25s
pg_net-0.19.5: from src/event.c:6: /nix/store/wflnb8fxmq4lqx3ca91hlpv95vrqkv51-curl-8.17.0-dev/include/curl/multi.h:429:23: error: expected ide …
pg_net-0.19.5:
                 from src/event.c:6:
/nix/store/wflnb8fxmq4lqx3ca91hlpv95vrqkv51-curl-8.17.0-dev/include/curl/multi.h:429:23: error: expected identifier or '(' before '__extension__'
  429 | CURL_EXTERN CURLMcode curl_multi_setopt(CURLM *multi_handle,
      |                       ^~~~~~~~~~~~~~~~~
/nix/store/wflnb8fxmq4lqx3ca91hlpv95vrqkv51-curl-8.17.0-dev/include/curl/multi.h:429:23: error: expected identifier or '(' before ')' token
  429 | CURL_EXTERN CURLMcode curl_multi_setopt(CURLM *multi_handle,
      |                       ^~~~~~~~~~~~~~~~~
make: *** [<builtin>: src/event.o] Error 1

pg_net-0.19.5:
                 from src/event.c:6:
/nix/store/wflnb8fxmq4lqx3ca91hlpv95vrqkv51-curl-8.17.0-dev/include/curl/multi.h:429:23: error: expected identifier or '(' before '__extension__'
  429 | CURL_EXTERN CURLMcode curl_multi_setopt(CURLM *multi_handle,
      |                       ^~~~~~~~~~~~~~~~~
/nix/store/wflnb8fxmq4lqx3ca91hlpv95vrqkv51-curl-8.17.0-dev/include/curl/multi.h:429:23: error: expected identifier or '(' before ')' token
  429 | CURL_EXTERN CURLMcode curl_multi_setopt(CURLM *multi_handle,
      |                       ^~~~~~~~~~~~~~~~~
make: *** [<builtin>: src/event.o] Error 1

pg_net-0.20.0:
                 from src/event.c:6:
/nix/store/wflnb8fxmq4lqx3ca91hlpv95vrqkv51-curl-8.17.0-dev/include/curl/multi.h:429:23: error: expected identifier or '(' before '__extension__'
  429 | CURL_EXTERN CURLMcode curl_multi_setopt(CURLM *multi_handle,
      |                       ^~~~~~~~~~~~~~~~~
/nix/store/wflnb8fxmq4lqx3ca91hlpv95vrqkv51-curl-8.17.0-dev/include/curl/multi.h:429:23: error: expected identifier or '(' before ')' token
  429 | CURL_EXTERN CURLMcode curl_multi_setopt(CURLM *multi_handle,
      |                       ^~~~~~~~~~~~~~~~~
make: *** [<builtin>: src/event.o] Error 1

… and 10 more failed derivations
failed checks.x86_64-linux.ext-timescaledb 1m 22s
pg_net-0.20.0: from src/event.c:6: /nix/store/wflnb8fxmq4lqx3ca91hlpv95vrqkv51-curl-8.17.0-dev/include/curl/multi.h:429:23: error: expected ide …
pg_net-0.20.0:
                 from src/event.c:6:
/nix/store/wflnb8fxmq4lqx3ca91hlpv95vrqkv51-curl-8.17.0-dev/include/curl/multi.h:429:23: error: expected identifier or '(' before '__extension__'
  429 | CURL_EXTERN CURLMcode curl_multi_setopt(CURLM *multi_handle,
      |                       ^~~~~~~~~~~~~~~~~
/nix/store/wflnb8fxmq4lqx3ca91hlpv95vrqkv51-curl-8.17.0-dev/include/curl/multi.h:429:23: error: expected identifier or '(' before ')' token
  429 | CURL_EXTERN CURLMcode curl_multi_setopt(CURLM *multi_handle,
      |                       ^~~~~~~~~~~~~~~~~
make: *** [<builtin>: src/event.o] Error 1

pg_net-0.19.5:
                 from src/event.c:6:
/nix/store/wflnb8fxmq4lqx3ca91hlpv95vrqkv51-curl-8.17.0-dev/include/curl/multi.h:429:23: error: expected identifier or '(' before '__extension__'
  429 | CURL_EXTERN CURLMcode curl_multi_setopt(CURLM *multi_handle,
      |                       ^~~~~~~~~~~~~~~~~
/nix/store/wflnb8fxmq4lqx3ca91hlpv95vrqkv51-curl-8.17.0-dev/include/curl/multi.h:429:23: error: expected identifier or '(' before ')' token
  429 | CURL_EXTERN CURLMcode curl_multi_setopt(CURLM *multi_handle,
      |                       ^~~~~~~~~~~~~~~~~
make: *** [<builtin>: src/event.o] Error 1

pg_net-0.7:
                 from src/event.c:6:
/nix/store/wflnb8fxmq4lqx3ca91hlpv95vrqkv51-curl-8.17.0-dev/include/curl/multi.h:429:23: error: expected identifier or '(' before '__extension__'
  429 | CURL_EXTERN CURLMcode curl_multi_setopt(CURLM *multi_handle,
      |                       ^~~~~~~~~~~~~~~~~
/nix/store/wflnb8fxmq4lqx3ca91hlpv95vrqkv51-curl-8.17.0-dev/include/curl/multi.h:429:23: error: expected identifier or '(' before ')' token
  429 | CURL_EXTERN CURLMcode curl_multi_setopt(CURLM *multi_handle,
      |                       ^~~~~~~~~~~~~~~~~
make: *** [<builtin>: src/event.o] Error 1

… and 2 more failed derivations
failed checks.x86_64-linux.ext-vault 14s
pg_net-0.19.5: from src/event.c:6: /nix/store/wflnb8fxmq4lqx3ca91hlpv95vrqkv51-curl-8.17.0-dev/include/curl/multi.h:429:23: error: expected ide …
pg_net-0.19.5:
                 from src/event.c:6:
/nix/store/wflnb8fxmq4lqx3ca91hlpv95vrqkv51-curl-8.17.0-dev/include/curl/multi.h:429:23: error: expected identifier or '(' before '__extension__'
  429 | CURL_EXTERN CURLMcode curl_multi_setopt(CURLM *multi_handle,
      |                       ^~~~~~~~~~~~~~~~~
/nix/store/wflnb8fxmq4lqx3ca91hlpv95vrqkv51-curl-8.17.0-dev/include/curl/multi.h:429:23: error: expected identifier or '(' before ')' token
  429 | CURL_EXTERN CURLMcode curl_multi_setopt(CURLM *multi_handle,
      |                       ^~~~~~~~~~~~~~~~~
make: *** [<builtin>: src/event.o] Error 1

pg_net-0.19.5:
                 from src/event.c:6:
/nix/store/wflnb8fxmq4lqx3ca91hlpv95vrqkv51-curl-8.17.0-dev/include/curl/multi.h:429:23: error: expected identifier or '(' before '__extension__'
  429 | CURL_EXTERN CURLMcode curl_multi_setopt(CURLM *multi_handle,
      |                       ^~~~~~~~~~~~~~~~~
/nix/store/wflnb8fxmq4lqx3ca91hlpv95vrqkv51-curl-8.17.0-dev/include/curl/multi.h:429:23: error: expected identifier or '(' before ')' token
  429 | CURL_EXTERN CURLMcode curl_multi_setopt(CURLM *multi_handle,
      |                       ^~~~~~~~~~~~~~~~~
make: *** [<builtin>: src/event.o] Error 1

pg_net-0.20.0:
                 from src/event.c:6:
/nix/store/wflnb8fxmq4lqx3ca91hlpv95vrqkv51-curl-8.17.0-dev/include/curl/multi.h:429:23: error: expected identifier or '(' before '__extension__'
  429 | CURL_EXTERN CURLMcode curl_multi_setopt(CURLM *multi_handle,
      |                       ^~~~~~~~~~~~~~~~~
/nix/store/wflnb8fxmq4lqx3ca91hlpv95vrqkv51-curl-8.17.0-dev/include/curl/multi.h:429:23: error: expected identifier or '(' before ')' token
  429 | CURL_EXTERN CURLMcode curl_multi_setopt(CURLM *multi_handle,
      |                       ^~~~~~~~~~~~~~~~~
make: *** [<builtin>: src/event.o] Error 1

… and 10 more failed derivations
failed checks.x86_64-linux.ext-wrappers-regression-PSQL-1387 53s
pg_net-0.19.5: from src/event.c:6: /nix/store/wflnb8fxmq4lqx3ca91hlpv95vrqkv51-curl-8.17.0-dev/include/curl/multi.h:429:23: error: expected ide …
pg_net-0.19.5:
                 from src/event.c:6:
/nix/store/wflnb8fxmq4lqx3ca91hlpv95vrqkv51-curl-8.17.0-dev/include/curl/multi.h:429:23: error: expected identifier or '(' before '__extension__'
  429 | CURL_EXTERN CURLMcode curl_multi_setopt(CURLM *multi_handle,
      |                       ^~~~~~~~~~~~~~~~~
/nix/store/wflnb8fxmq4lqx3ca91hlpv95vrqkv51-curl-8.17.0-dev/include/curl/multi.h:429:23: error: expected identifier or '(' before ')' token
  429 | CURL_EXTERN CURLMcode curl_multi_setopt(CURLM *multi_handle,
      |                       ^~~~~~~~~~~~~~~~~
make: *** [<builtin>: src/event.o] Error 1

pg_net-0.20.0:
                 from src/event.c:6:
/nix/store/wflnb8fxmq4lqx3ca91hlpv95vrqkv51-curl-8.17.0-dev/include/curl/multi.h:429:23: error: expected identifier or '(' before '__extension__'
  429 | CURL_EXTERN CURLMcode curl_multi_setopt(CURLM *multi_handle,
      |                       ^~~~~~~~~~~~~~~~~
/nix/store/wflnb8fxmq4lqx3ca91hlpv95vrqkv51-curl-8.17.0-dev/include/curl/multi.h:429:23: error: expected identifier or '(' before ')' token
  429 | CURL_EXTERN CURLMcode curl_multi_setopt(CURLM *multi_handle,
      |                       ^~~~~~~~~~~~~~~~~
make: *** [<builtin>: src/event.o] Error 1

pg_net-0.7:
                 from src/event.c:6:
/nix/store/wflnb8fxmq4lqx3ca91hlpv95vrqkv51-curl-8.17.0-dev/include/curl/multi.h:429:23: error: expected identifier or '(' before '__extension__'
  429 | CURL_EXTERN CURLMcode curl_multi_setopt(CURLM *multi_handle,
      |                       ^~~~~~~~~~~~~~~~~
/nix/store/wflnb8fxmq4lqx3ca91hlpv95vrqkv51-curl-8.17.0-dev/include/curl/multi.h:429:23: error: expected identifier or '(' before ')' token
  429 | CURL_EXTERN CURLMcode curl_multi_setopt(CURLM *multi_handle,
      |                       ^~~~~~~~~~~~~~~~~
make: *** [<builtin>: src/event.o] Error 1

… and 2 more failed derivations
failed checks.x86_64-linux.psql_15 1m 18s
pg_net-0.19.5: from src/event.c:6: /nix/store/wflnb8fxmq4lqx3ca91hlpv95vrqkv51-curl-8.17.0-dev/include/curl/multi.h:429:23: error: expected ide …
pg_net-0.19.5:
                 from src/event.c:6:
/nix/store/wflnb8fxmq4lqx3ca91hlpv95vrqkv51-curl-8.17.0-dev/include/curl/multi.h:429:23: error: expected identifier or '(' before '__extension__'
  429 | CURL_EXTERN CURLMcode curl_multi_setopt(CURLM *multi_handle,
      |                       ^~~~~~~~~~~~~~~~~
/nix/store/wflnb8fxmq4lqx3ca91hlpv95vrqkv51-curl-8.17.0-dev/include/curl/multi.h:429:23: error: expected identifier or '(' before ')' token
  429 | CURL_EXTERN CURLMcode curl_multi_setopt(CURLM *multi_handle,
      |                       ^~~~~~~~~~~~~~~~~
make: *** [<builtin>: src/event.o] Error 1

pg_net-0.13.0:
                 from src/event.c:6:
/nix/store/wflnb8fxmq4lqx3ca91hlpv95vrqkv51-curl-8.17.0-dev/include/curl/multi.h:429:23: error: expected identifier or '(' before '__extension__'
  429 | CURL_EXTERN CURLMcode curl_multi_setopt(CURLM *multi_handle,
      |                       ^~~~~~~~~~~~~~~~~
/nix/store/wflnb8fxmq4lqx3ca91hlpv95vrqkv51-curl-8.17.0-dev/include/curl/multi.h:429:23: error: expected identifier or '(' before ')' token
  429 | CURL_EXTERN CURLMcode curl_multi_setopt(CURLM *multi_handle,
      |                       ^~~~~~~~~~~~~~~~~
make: *** [<builtin>: src/event.o] Error 1

pg_net-0.7:
                 from src/event.c:6:
/nix/store/wflnb8fxmq4lqx3ca91hlpv95vrqkv51-curl-8.17.0-dev/include/curl/multi.h:429:23: error: expected identifier or '(' before '__extension__'
  429 | CURL_EXTERN CURLMcode curl_multi_setopt(CURLM *multi_handle,
      |                       ^~~~~~~~~~~~~~~~~
/nix/store/wflnb8fxmq4lqx3ca91hlpv95vrqkv51-curl-8.17.0-dev/include/curl/multi.h:429:23: error: expected identifier or '(' before ')' token
  429 | CURL_EXTERN CURLMcode curl_multi_setopt(CURLM *multi_handle,
      |                       ^~~~~~~~~~~~~~~~~
make: *** [<builtin>: src/event.o] Error 1

… and 10 more failed derivations
failed checks.x86_64-linux.psql_15_slim 20s
pg_net-0.19.5: from src/event.c:6: /nix/store/wflnb8fxmq4lqx3ca91hlpv95vrqkv51-curl-8.17.0-dev/include/curl/multi.h:429:23: error: expected ide …
pg_net-0.19.5:
                 from src/event.c:6:
/nix/store/wflnb8fxmq4lqx3ca91hlpv95vrqkv51-curl-8.17.0-dev/include/curl/multi.h:429:23: error: expected identifier or '(' before '__extension__'
  429 | CURL_EXTERN CURLMcode curl_multi_setopt(CURLM *multi_handle,
      |                       ^~~~~~~~~~~~~~~~~
/nix/store/wflnb8fxmq4lqx3ca91hlpv95vrqkv51-curl-8.17.0-dev/include/curl/multi.h:429:23: error: expected identifier or '(' before ')' token
  429 | CURL_EXTERN CURLMcode curl_multi_setopt(CURLM *multi_handle,
      |                       ^~~~~~~~~~~~~~~~~
make: *** [<builtin>: src/event.o] Error 1

pg_net-0.20.0:
                 from src/event.c:6:
/nix/store/wflnb8fxmq4lqx3ca91hlpv95vrqkv51-curl-8.17.0-dev/include/curl/multi.h:429:23: error: expected identifier or '(' before '__extension__'
  429 | CURL_EXTERN CURLMcode curl_multi_setopt(CURLM *multi_handle,
      |                       ^~~~~~~~~~~~~~~~~
/nix/store/wflnb8fxmq4lqx3ca91hlpv95vrqkv51-curl-8.17.0-dev/include/curl/multi.h:429:23: error: expected identifier or '(' before ')' token
  429 | CURL_EXTERN CURLMcode curl_multi_setopt(CURLM *multi_handle,
      |                       ^~~~~~~~~~~~~~~~~
make: *** [<builtin>: src/event.o] Error 1

pg_net-0.19.5:
                 from src/event.c:6:
/nix/store/wflnb8fxmq4lqx3ca91hlpv95vrqkv51-curl-8.17.0-dev/include/curl/multi.h:429:23: error: expected identifier or '(' before '__extension__'
  429 | CURL_EXTERN CURLMcode curl_multi_setopt(CURLM *multi_handle,
      |                       ^~~~~~~~~~~~~~~~~
/nix/store/wflnb8fxmq4lqx3ca91hlpv95vrqkv51-curl-8.17.0-dev/include/curl/multi.h:429:23: error: expected identifier or '(' before ')' token
  429 | CURL_EXTERN CURLMcode curl_multi_setopt(CURLM *multi_handle,
      |                       ^~~~~~~~~~~~~~~~~
make: *** [<builtin>: src/event.o] Error 1

… and 10 more failed derivations
failed checks.x86_64-linux.psql_17 31s
pg_net-0.7: from src/event.c:6: /nix/store/wflnb8fxmq4lqx3ca91hlpv95vrqkv51-curl-8.17.0-dev/include/curl/multi.h:429:23: error: expected identi …
pg_net-0.7:
                 from src/event.c:6:
/nix/store/wflnb8fxmq4lqx3ca91hlpv95vrqkv51-curl-8.17.0-dev/include/curl/multi.h:429:23: error: expected identifier or '(' before '__extension__'
  429 | CURL_EXTERN CURLMcode curl_multi_setopt(CURLM *multi_handle,
      |                       ^~~~~~~~~~~~~~~~~
/nix/store/wflnb8fxmq4lqx3ca91hlpv95vrqkv51-curl-8.17.0-dev/include/curl/multi.h:429:23: error: expected identifier or '(' before ')' token
  429 | CURL_EXTERN CURLMcode curl_multi_setopt(CURLM *multi_handle,
      |                       ^~~~~~~~~~~~~~~~~
make: *** [<builtin>: src/event.o] Error 1

pg_net-0.20.0:
                 from src/event.c:6:
/nix/store/wflnb8fxmq4lqx3ca91hlpv95vrqkv51-curl-8.17.0-dev/include/curl/multi.h:429:23: error: expected identifier or '(' before '__extension__'
  429 | CURL_EXTERN CURLMcode curl_multi_setopt(CURLM *multi_handle,
      |                       ^~~~~~~~~~~~~~~~~
/nix/store/wflnb8fxmq4lqx3ca91hlpv95vrqkv51-curl-8.17.0-dev/include/curl/multi.h:429:23: error: expected identifier or '(' before ')' token
  429 | CURL_EXTERN CURLMcode curl_multi_setopt(CURLM *multi_handle,
      |                       ^~~~~~~~~~~~~~~~~
make: *** [<builtin>: src/event.o] Error 1

pg_net-0.19.5:
                 from src/event.c:6:
/nix/store/wflnb8fxmq4lqx3ca91hlpv95vrqkv51-curl-8.17.0-dev/include/curl/multi.h:429:23: error: expected identifier or '(' before '__extension__'
  429 | CURL_EXTERN CURLMcode curl_multi_setopt(CURLM *multi_handle,
      |                       ^~~~~~~~~~~~~~~~~
/nix/store/wflnb8fxmq4lqx3ca91hlpv95vrqkv51-curl-8.17.0-dev/include/curl/multi.h:429:23: error: expected identifier or '(' before ')' token
  429 | CURL_EXTERN CURLMcode curl_multi_setopt(CURLM *multi_handle,
      |                       ^~~~~~~~~~~~~~~~~
make: *** [<builtin>: src/event.o] Error 1

… and 10 more failed derivations
failed checks.x86_64-linux.psql_17_cli 14s
pg_net-0.14.0: from src/event.c:6: /nix/store/wflnb8fxmq4lqx3ca91hlpv95vrqkv51-curl-8.17.0-dev/include/curl/multi.h:429:23: error: expected ide …
pg_net-0.14.0:
                 from src/event.c:6:
/nix/store/wflnb8fxmq4lqx3ca91hlpv95vrqkv51-curl-8.17.0-dev/include/curl/multi.h:429:23: error: expected identifier or '(' before '__extension__'
  429 | CURL_EXTERN CURLMcode curl_multi_setopt(CURLM *multi_handle,
      |                       ^~~~~~~~~~~~~~~~~
/nix/store/wflnb8fxmq4lqx3ca91hlpv95vrqkv51-curl-8.17.0-dev/include/curl/multi.h:429:23: error: expected identifier or '(' before ')' token
  429 | CURL_EXTERN CURLMcode curl_multi_setopt(CURLM *multi_handle,
      |                       ^~~~~~~~~~~~~~~~~
make: *** [<builtin>: src/event.o] Error 1

pg_net-0.19.5:
                 from src/event.c:6:
/nix/store/wflnb8fxmq4lqx3ca91hlpv95vrqkv51-curl-8.17.0-dev/include/curl/multi.h:429:23: error: expected identifier or '(' before '__extension__'
  429 | CURL_EXTERN CURLMcode curl_multi_setopt(CURLM *multi_handle,
      |                       ^~~~~~~~~~~~~~~~~
/nix/store/wflnb8fxmq4lqx3ca91hlpv95vrqkv51-curl-8.17.0-dev/include/curl/multi.h:429:23: error: expected identifier or '(' before ')' token
  429 | CURL_EXTERN CURLMcode curl_multi_setopt(CURLM *multi_handle,
      |                       ^~~~~~~~~~~~~~~~~
make: *** [<builtin>: src/event.o] Error 1

pg_net-0.7:
                 from src/event.c:6:
/nix/store/wflnb8fxmq4lqx3ca91hlpv95vrqkv51-curl-8.17.0-dev/include/curl/multi.h:429:23: error: expected identifier or '(' before '__extension__'
  429 | CURL_EXTERN CURLMcode curl_multi_setopt(CURLM *multi_handle,
      |                       ^~~~~~~~~~~~~~~~~
/nix/store/wflnb8fxmq4lqx3ca91hlpv95vrqkv51-curl-8.17.0-dev/include/curl/multi.h:429:23: error: expected identifier or '(' before ')' token
  429 | CURL_EXTERN CURLMcode curl_multi_setopt(CURLM *multi_handle,
      |                       ^~~~~~~~~~~~~~~~~
make: *** [<builtin>: src/event.o] Error 1

… and 10 more failed derivations
failed checks.x86_64-linux.psql_17_cli_portable 3s
pg_net-0.14.0: from src/event.c:6: /nix/store/wflnb8fxmq4lqx3ca91hlpv95vrqkv51-curl-8.17.0-dev/include/curl/multi.h:429:23: error: expected ide …
pg_net-0.14.0:
                 from src/event.c:6:
/nix/store/wflnb8fxmq4lqx3ca91hlpv95vrqkv51-curl-8.17.0-dev/include/curl/multi.h:429:23: error: expected identifier or '(' before '__extension__'
  429 | CURL_EXTERN CURLMcode curl_multi_setopt(CURLM *multi_handle,
      |                       ^~~~~~~~~~~~~~~~~
/nix/store/wflnb8fxmq4lqx3ca91hlpv95vrqkv51-curl-8.17.0-dev/include/curl/multi.h:429:23: error: expected identifier or '(' before ')' token
  429 | CURL_EXTERN CURLMcode curl_multi_setopt(CURLM *multi_handle,
      |                       ^~~~~~~~~~~~~~~~~
make: *** [<builtin>: src/event.o] Error 1

pg_net-0.19.5:
                 from src/event.c:6:
/nix/store/wflnb8fxmq4lqx3ca91hlpv95vrqkv51-curl-8.17.0-dev/include/curl/multi.h:429:23: error: expected identifier or '(' before '__extension__'
  429 | CURL_EXTERN CURLMcode curl_multi_setopt(CURLM *multi_handle,
      |                       ^~~~~~~~~~~~~~~~~
/nix/store/wflnb8fxmq4lqx3ca91hlpv95vrqkv51-curl-8.17.0-dev/include/curl/multi.h:429:23: error: expected identifier or '(' before ')' token
  429 | CURL_EXTERN CURLMcode curl_multi_setopt(CURLM *multi_handle,
      |                       ^~~~~~~~~~~~~~~~~
make: *** [<builtin>: src/event.o] Error 1

pg_net-0.20.0:
                 from src/event.c:6:
/nix/store/wflnb8fxmq4lqx3ca91hlpv95vrqkv51-curl-8.17.0-dev/include/curl/multi.h:429:23: error: expected identifier or '(' before '__extension__'
  429 | CURL_EXTERN CURLMcode curl_multi_setopt(CURLM *multi_handle,
      |                       ^~~~~~~~~~~~~~~~~
/nix/store/wflnb8fxmq4lqx3ca91hlpv95vrqkv51-curl-8.17.0-dev/include/curl/multi.h:429:23: error: expected identifier or '(' before ')' token
  429 | CURL_EXTERN CURLMcode curl_multi_setopt(CURLM *multi_handle,
      |                       ^~~~~~~~~~~~~~~~~
make: *** [<builtin>: src/event.o] Error 1

… and 1 more failed derivation
failed checks.x86_64-linux.psql_17_slim 41s
pg_net-0.19.5: from src/event.c:6: /nix/store/wflnb8fxmq4lqx3ca91hlpv95vrqkv51-curl-8.17.0-dev/include/curl/multi.h:429:23: error: expected ide …
pg_net-0.19.5:
                 from src/event.c:6:
/nix/store/wflnb8fxmq4lqx3ca91hlpv95vrqkv51-curl-8.17.0-dev/include/curl/multi.h:429:23: error: expected identifier or '(' before '__extension__'
  429 | CURL_EXTERN CURLMcode curl_multi_setopt(CURLM *multi_handle,
      |                       ^~~~~~~~~~~~~~~~~
/nix/store/wflnb8fxmq4lqx3ca91hlpv95vrqkv51-curl-8.17.0-dev/include/curl/multi.h:429:23: error: expected identifier or '(' before ')' token
  429 | CURL_EXTERN CURLMcode curl_multi_setopt(CURLM *multi_handle,
      |                       ^~~~~~~~~~~~~~~~~
make: *** [<builtin>: src/event.o] Error 1

pg_net-0.19.5:
                 from src/event.c:6:
/nix/store/wflnb8fxmq4lqx3ca91hlpv95vrqkv51-curl-8.17.0-dev/include/curl/multi.h:429:23: error: expected identifier or '(' before '__extension__'
  429 | CURL_EXTERN CURLMcode curl_multi_setopt(CURLM *multi_handle,
      |                       ^~~~~~~~~~~~~~~~~
/nix/store/wflnb8fxmq4lqx3ca91hlpv95vrqkv51-curl-8.17.0-dev/include/curl/multi.h:429:23: error: expected identifier or '(' before ')' token
  429 | CURL_EXTERN CURLMcode curl_multi_setopt(CURLM *multi_handle,
      |                       ^~~~~~~~~~~~~~~~~
make: *** [<builtin>: src/event.o] Error 1

pg_net-0.7:
                 from src/event.c:6:
/nix/store/wflnb8fxmq4lqx3ca91hlpv95vrqkv51-curl-8.17.0-dev/include/curl/multi.h:429:23: error: expected identifier or '(' before '__extension__'
  429 | CURL_EXTERN CURLMcode curl_multi_setopt(CURLM *multi_handle,
      |                       ^~~~~~~~~~~~~~~~~
/nix/store/wflnb8fxmq4lqx3ca91hlpv95vrqkv51-curl-8.17.0-dev/include/curl/multi.h:429:23: error: expected identifier or '(' before ')' token
  429 | CURL_EXTERN CURLMcode curl_multi_setopt(CURLM *multi_handle,
      |                       ^~~~~~~~~~~~~~~~~
make: *** [<builtin>: src/event.o] Error 1

… and 10 more failed derivations
failed checks.x86_64-linux.psql_orioledb-17 32s
pg_net-0.19.5: from src/event.c:6: /nix/store/wflnb8fxmq4lqx3ca91hlpv95vrqkv51-curl-8.17.0-dev/include/curl/multi.h:429:23: error: expected ide …
pg_net-0.19.5:
                 from src/event.c:6:
/nix/store/wflnb8fxmq4lqx3ca91hlpv95vrqkv51-curl-8.17.0-dev/include/curl/multi.h:429:23: error: expected identifier or '(' before '__extension__'
  429 | CURL_EXTERN CURLMcode curl_multi_setopt(CURLM *multi_handle,
      |                       ^~~~~~~~~~~~~~~~~
/nix/store/wflnb8fxmq4lqx3ca91hlpv95vrqkv51-curl-8.17.0-dev/include/curl/multi.h:429:23: error: expected identifier or '(' before ')' token
  429 | CURL_EXTERN CURLMcode curl_multi_setopt(CURLM *multi_handle,
      |                       ^~~~~~~~~~~~~~~~~
make: *** [<builtin>: src/event.o] Error 1

pg_net-0.19.5:
                 from src/event.c:6:
/nix/store/wflnb8fxmq4lqx3ca91hlpv95vrqkv51-curl-8.17.0-dev/include/curl/multi.h:429:23: error: expected identifier or '(' before '__extension__'
  429 | CURL_EXTERN CURLMcode curl_multi_setopt(CURLM *multi_handle,
      |                       ^~~~~~~~~~~~~~~~~
/nix/store/wflnb8fxmq4lqx3ca91hlpv95vrqkv51-curl-8.17.0-dev/include/curl/multi.h:429:23: error: expected identifier or '(' before ')' token
  429 | CURL_EXTERN CURLMcode curl_multi_setopt(CURLM *multi_handle,
      |                       ^~~~~~~~~~~~~~~~~
make: *** [<builtin>: src/event.o] Error 1

pg_net-0.7:
                 from src/event.c:6:
/nix/store/wflnb8fxmq4lqx3ca91hlpv95vrqkv51-curl-8.17.0-dev/include/curl/multi.h:429:23: error: expected identifier or '(' before '__extension__'
  429 | CURL_EXTERN CURLMcode curl_multi_setopt(CURLM *multi_handle,
      |                       ^~~~~~~~~~~~~~~~~
/nix/store/wflnb8fxmq4lqx3ca91hlpv95vrqkv51-curl-8.17.0-dev/include/curl/multi.h:429:23: error: expected identifier or '(' before ')' token
  429 | CURL_EXTERN CURLMcode curl_multi_setopt(CURLM *multi_handle,
      |                       ^~~~~~~~~~~~~~~~~
make: *** [<builtin>: src/event.o] Error 1

… and 10 more failed derivations
failed checks.x86_64-linux.psql_orioledb-17_slim 31s
pg_net-0.7: from src/event.c:6: /nix/store/wflnb8fxmq4lqx3ca91hlpv95vrqkv51-curl-8.17.0-dev/include/curl/multi.h:429:23: error: expected identi …
pg_net-0.7:
                 from src/event.c:6:
/nix/store/wflnb8fxmq4lqx3ca91hlpv95vrqkv51-curl-8.17.0-dev/include/curl/multi.h:429:23: error: expected identifier or '(' before '__extension__'
  429 | CURL_EXTERN CURLMcode curl_multi_setopt(CURLM *multi_handle,
      |                       ^~~~~~~~~~~~~~~~~
/nix/store/wflnb8fxmq4lqx3ca91hlpv95vrqkv51-curl-8.17.0-dev/include/curl/multi.h:429:23: error: expected identifier or '(' before ')' token
  429 | CURL_EXTERN CURLMcode curl_multi_setopt(CURLM *multi_handle,
      |                       ^~~~~~~~~~~~~~~~~
make: *** [<builtin>: src/event.o] Error 1

pg_net-0.20.0:
                 from src/event.c:6:
/nix/store/wflnb8fxmq4lqx3ca91hlpv95vrqkv51-curl-8.17.0-dev/include/curl/multi.h:429:23: error: expected identifier or '(' before '__extension__'
  429 | CURL_EXTERN CURLMcode curl_multi_setopt(CURLM *multi_handle,
      |                       ^~~~~~~~~~~~~~~~~
/nix/store/wflnb8fxmq4lqx3ca91hlpv95vrqkv51-curl-8.17.0-dev/include/curl/multi.h:429:23: error: expected identifier or '(' before ')' token
  429 | CURL_EXTERN CURLMcode curl_multi_setopt(CURLM *multi_handle,
      |                       ^~~~~~~~~~~~~~~~~
make: *** [<builtin>: src/event.o] Error 1

pg_net-0.20.0:
                 from src/event.c:6:
/nix/store/wflnb8fxmq4lqx3ca91hlpv95vrqkv51-curl-8.17.0-dev/include/curl/multi.h:429:23: error: expected identifier or '(' before '__extension__'
  429 | CURL_EXTERN CURLMcode curl_multi_setopt(CURLM *multi_handle,
      |                       ^~~~~~~~~~~~~~~~~
/nix/store/wflnb8fxmq4lqx3ca91hlpv95vrqkv51-curl-8.17.0-dev/include/curl/multi.h:429:23: error: expected identifier or '(' before ')' token
  429 | CURL_EXTERN CURLMcode curl_multi_setopt(CURLM *multi_handle,
      |                       ^~~~~~~~~~~~~~~~~
make: *** [<builtin>: src/event.o] Error 1

… and 10 more failed derivations
32 succeeded
succeeded attributes
status attribute duration
loading…
36 already built
skipped attributes
status attribute duration
loading…