nixbot

builds

supabase/postgres build #132 failed

branch develop · PR #2521 · commit d3f77d39b3 · · took 53m 13s · eval 19m 31s

eval warnings 2 kinds · 28 occurrences
  • error ×14
  • error path '«git+file:///var/lib/nixbot/worktrees/1-d3f77d39b325-7?ref=HEAD&rev=c4bcf750636232787cf8cd8a1af084710e5b9716»/ext/supautils.nix' does not exist ×14

15 failed
failed attributes
status attribute duration
failed eval checks.aarch64-linux.psql_15 —
error: … while calling the 'derivationStrict' builtin at «nix-internal»/derivation-internal.nix:37:12: 36| 37| strict = …
error:
       … while calling the 'derivationStrict' builtin
         at «nix-internal»/derivation-internal.nix:37:12:
           36|
           37|   strict = derivationStrict drvAttrs;
             |            ^
           38|

       … while evaluating derivation 'run-check-harness-psql-15'
         whose name attribute is located at «https://releases.nixos.org/nixos/unstable/nixos-26.05pre921484.fb7944c166a3/nixexprs.tar.xz?narHash=sha256-3xDI4xtzovwqE/eAxCwmXxUqBg6Yoam2L1u0IwRNhW4%3D»/pkgs/stdenv/generic/make-derivation.nix:541:13

       … while evaluating attribute 'buildCommand' of derivation 'run-check-harness-psql-15'
         at «https://releases.nixos.org/nixos/unstable/nixos-26.05pre921484.fb7944c166a3/nixexprs.tar.xz?narHash=sha256-3xDI4xtzovwqE/eAxCwmXxUqBg6Yoam2L1u0IwRNhW4%3D»/pkgs/build-support/trivial-builders/default.nix:80:17:
           79|         enableParallelBuilding = true;
           80|         inherit buildCommand name;
             |                 ^
           81|         passAsFile = [ "buildCommand" ] ++ (derivationArgs.passAsFile or [ ]);

       (stack trace truncated; use '--show-trace' to show the full, detailed trace)

       error: path '«git+file:///var/lib/nixbot/worktrees/1-d3f77d39b325-7?ref=HEAD&rev=c4bcf750636232787cf8cd8a1af084710e5b9716»/ext/supautils.nix' does not exist
failed eval checks.aarch64-linux.psql_15_slim —
error: … while calling the 'derivationStrict' builtin at «nix-internal»/derivation-internal.nix:37:12: 36| 37| strict = …
error:
       … while calling the 'derivationStrict' builtin
         at «nix-internal»/derivation-internal.nix:37:12:
           36|
           37|   strict = derivationStrict drvAttrs;
             |            ^
           38|

       … while evaluating derivation 'run-check-harness-psql-15-slim'
         whose name attribute is located at «https://releases.nixos.org/nixos/unstable/nixos-26.05pre921484.fb7944c166a3/nixexprs.tar.xz?narHash=sha256-3xDI4xtzovwqE/eAxCwmXxUqBg6Yoam2L1u0IwRNhW4%3D»/pkgs/stdenv/generic/make-derivation.nix:541:13

       … while evaluating attribute 'buildCommand' of derivation 'run-check-harness-psql-15-slim'
         at «https://releases.nixos.org/nixos/unstable/nixos-26.05pre921484.fb7944c166a3/nixexprs.tar.xz?narHash=sha256-3xDI4xtzovwqE/eAxCwmXxUqBg6Yoam2L1u0IwRNhW4%3D»/pkgs/build-support/trivial-builders/default.nix:80:17:
           79|         enableParallelBuilding = true;
           80|         inherit buildCommand name;
             |                 ^
           81|         passAsFile = [ "buildCommand" ] ++ (derivationArgs.passAsFile or [ ]);

       (stack trace truncated; use '--show-trace' to show the full, detailed trace)

       error: path '«git+file:///var/lib/nixbot/worktrees/1-d3f77d39b325-7?ref=HEAD&rev=c4bcf750636232787cf8cd8a1af084710e5b9716»/ext/supautils.nix' does not exist
failed eval checks.aarch64-linux.psql_17 —
error: … while calling the 'derivationStrict' builtin at «nix-internal»/derivation-internal.nix:37:12: 36| 37| strict = …
error:
       … while calling the 'derivationStrict' builtin
         at «nix-internal»/derivation-internal.nix:37:12:
           36|
           37|   strict = derivationStrict drvAttrs;
             |            ^
           38|

       … while evaluating derivation 'run-check-harness-psql-17'
         whose name attribute is located at «https://releases.nixos.org/nixos/unstable/nixos-26.05pre921484.fb7944c166a3/nixexprs.tar.xz?narHash=sha256-3xDI4xtzovwqE/eAxCwmXxUqBg6Yoam2L1u0IwRNhW4%3D»/pkgs/stdenv/generic/make-derivation.nix:541:13

       … while evaluating attribute 'buildCommand' of derivation 'run-check-harness-psql-17'
         at «https://releases.nixos.org/nixos/unstable/nixos-26.05pre921484.fb7944c166a3/nixexprs.tar.xz?narHash=sha256-3xDI4xtzovwqE/eAxCwmXxUqBg6Yoam2L1u0IwRNhW4%3D»/pkgs/build-support/trivial-builders/default.nix:80:17:
           79|         enableParallelBuilding = true;
           80|         inherit buildCommand name;
             |                 ^
           81|         passAsFile = [ "buildCommand" ] ++ (derivationArgs.passAsFile or [ ]);

       (stack trace truncated; use '--show-trace' to show the full, detailed trace)

       error: path '«git+file:///var/lib/nixbot/worktrees/1-d3f77d39b325-7?ref=HEAD&rev=c4bcf750636232787cf8cd8a1af084710e5b9716»/ext/supautils.nix' does not exist
failed eval checks.aarch64-linux.psql_17_cli —
error: … while calling the 'derivationStrict' builtin at «nix-internal»/derivation-internal.nix:37:12: 36| 37| strict = …
error:
       … while calling the 'derivationStrict' builtin
         at «nix-internal»/derivation-internal.nix:37:12:
           36|
           37|   strict = derivationStrict drvAttrs;
             |            ^
           38|

       … while evaluating derivation 'run-check-harness-psql-17-cli'
         whose name attribute is located at «https://releases.nixos.org/nixos/unstable/nixos-26.05pre921484.fb7944c166a3/nixexprs.tar.xz?narHash=sha256-3xDI4xtzovwqE/eAxCwmXxUqBg6Yoam2L1u0IwRNhW4%3D»/pkgs/stdenv/generic/make-derivation.nix:541:13

       … while evaluating attribute 'buildCommand' of derivation 'run-check-harness-psql-17-cli'
         at «https://releases.nixos.org/nixos/unstable/nixos-26.05pre921484.fb7944c166a3/nixexprs.tar.xz?narHash=sha256-3xDI4xtzovwqE/eAxCwmXxUqBg6Yoam2L1u0IwRNhW4%3D»/pkgs/build-support/trivial-builders/default.nix:80:17:
           79|         enableParallelBuilding = true;
           80|         inherit buildCommand name;
             |                 ^
           81|         passAsFile = [ "buildCommand" ] ++ (derivationArgs.passAsFile or [ ]);

       (stack trace truncated; use '--show-trace' to show the full, detailed trace)

       error: path '«git+file:///var/lib/nixbot/worktrees/1-d3f77d39b325-7?ref=HEAD&rev=c4bcf750636232787cf8cd8a1af084710e5b9716»/ext/supautils.nix' does not exist
failed eval checks.aarch64-linux.psql_17_slim —
error: … while calling the 'derivationStrict' builtin at «nix-internal»/derivation-internal.nix:37:12: 36| 37| strict = …
error:
       … while calling the 'derivationStrict' builtin
         at «nix-internal»/derivation-internal.nix:37:12:
           36|
           37|   strict = derivationStrict drvAttrs;
             |            ^
           38|

       … while evaluating derivation 'run-check-harness-psql-17-slim'
         whose name attribute is located at «https://releases.nixos.org/nixos/unstable/nixos-26.05pre921484.fb7944c166a3/nixexprs.tar.xz?narHash=sha256-3xDI4xtzovwqE/eAxCwmXxUqBg6Yoam2L1u0IwRNhW4%3D»/pkgs/stdenv/generic/make-derivation.nix:541:13

       … while evaluating attribute 'buildCommand' of derivation 'run-check-harness-psql-17-slim'
         at «https://releases.nixos.org/nixos/unstable/nixos-26.05pre921484.fb7944c166a3/nixexprs.tar.xz?narHash=sha256-3xDI4xtzovwqE/eAxCwmXxUqBg6Yoam2L1u0IwRNhW4%3D»/pkgs/build-support/trivial-builders/default.nix:80:17:
           79|         enableParallelBuilding = true;
           80|         inherit buildCommand name;
             |                 ^
           81|         passAsFile = [ "buildCommand" ] ++ (derivationArgs.passAsFile or [ ]);

       (stack trace truncated; use '--show-trace' to show the full, detailed trace)

       error: path '«git+file:///var/lib/nixbot/worktrees/1-d3f77d39b325-7?ref=HEAD&rev=c4bcf750636232787cf8cd8a1af084710e5b9716»/ext/supautils.nix' does not exist
failed eval checks.aarch64-linux.psql_orioledb-17 —
error: … while calling the 'derivationStrict' builtin at «nix-internal»/derivation-internal.nix:37:12: 36| 37| strict = …
error:
       … while calling the 'derivationStrict' builtin
         at «nix-internal»/derivation-internal.nix:37:12:
           36|
           37|   strict = derivationStrict drvAttrs;
             |            ^
           38|

       … while evaluating derivation 'run-check-harness-psql-orioledb-17'
         whose name attribute is located at «https://releases.nixos.org/nixos/unstable/nixos-26.05pre921484.fb7944c166a3/nixexprs.tar.xz?narHash=sha256-3xDI4xtzovwqE/eAxCwmXxUqBg6Yoam2L1u0IwRNhW4%3D»/pkgs/stdenv/generic/make-derivation.nix:541:13

       … while evaluating attribute 'buildCommand' of derivation 'run-check-harness-psql-orioledb-17'
         at «https://releases.nixos.org/nixos/unstable/nixos-26.05pre921484.fb7944c166a3/nixexprs.tar.xz?narHash=sha256-3xDI4xtzovwqE/eAxCwmXxUqBg6Yoam2L1u0IwRNhW4%3D»/pkgs/build-support/trivial-builders/default.nix:80:17:
           79|         enableParallelBuilding = true;
           80|         inherit buildCommand name;
             |                 ^
           81|         passAsFile = [ "buildCommand" ] ++ (derivationArgs.passAsFile or [ ]);

       (stack trace truncated; use '--show-trace' to show the full, detailed trace)

       error: path '«git+file:///var/lib/nixbot/worktrees/1-d3f77d39b325-7?ref=HEAD&rev=c4bcf750636232787cf8cd8a1af084710e5b9716»/ext/supautils.nix' does not exist
failed eval checks.aarch64-linux.psql_orioledb-17_slim —
error: … while calling the 'derivationStrict' builtin at «nix-internal»/derivation-internal.nix:37:12: 36| 37| strict = …
error:
       … while calling the 'derivationStrict' builtin
         at «nix-internal»/derivation-internal.nix:37:12:
           36|
           37|   strict = derivationStrict drvAttrs;
             |            ^
           38|

       … while evaluating derivation 'run-check-harness-psql-orioledb-17-slim'
         whose name attribute is located at «https://releases.nixos.org/nixos/unstable/nixos-26.05pre921484.fb7944c166a3/nixexprs.tar.xz?narHash=sha256-3xDI4xtzovwqE/eAxCwmXxUqBg6Yoam2L1u0IwRNhW4%3D»/pkgs/stdenv/generic/make-derivation.nix:541:13

       … while evaluating attribute 'buildCommand' of derivation 'run-check-harness-psql-orioledb-17-slim'
         at «https://releases.nixos.org/nixos/unstable/nixos-26.05pre921484.fb7944c166a3/nixexprs.tar.xz?narHash=sha256-3xDI4xtzovwqE/eAxCwmXxUqBg6Yoam2L1u0IwRNhW4%3D»/pkgs/build-support/trivial-builders/default.nix:80:17:
           79|         enableParallelBuilding = true;
           80|         inherit buildCommand name;
             |                 ^
           81|         passAsFile = [ "buildCommand" ] ++ (derivationArgs.passAsFile or [ ]);

       (stack trace truncated; use '--show-trace' to show the full, detailed trace)

       error: path '«git+file:///var/lib/nixbot/worktrees/1-d3f77d39b325-7?ref=HEAD&rev=c4bcf750636232787cf8cd8a1af084710e5b9716»/ext/supautils.nix' does not exist
failed eval checks.x86_64-linux.psql_15 —
error: … while calling the 'derivationStrict' builtin at «nix-internal»/derivation-internal.nix:37:12: 36| 37| strict = …
error:
       … while calling the 'derivationStrict' builtin
         at «nix-internal»/derivation-internal.nix:37:12:
           36|
           37|   strict = derivationStrict drvAttrs;
             |            ^
           38|

       … while evaluating derivation 'run-check-harness-psql-15'
         whose name attribute is located at «https://releases.nixos.org/nixos/unstable/nixos-26.05pre921484.fb7944c166a3/nixexprs.tar.xz?narHash=sha256-3xDI4xtzovwqE/eAxCwmXxUqBg6Yoam2L1u0IwRNhW4%3D»/pkgs/stdenv/generic/make-derivation.nix:541:13

       … while evaluating attribute 'buildCommand' of derivation 'run-check-harness-psql-15'
         at «https://releases.nixos.org/nixos/unstable/nixos-26.05pre921484.fb7944c166a3/nixexprs.tar.xz?narHash=sha256-3xDI4xtzovwqE/eAxCwmXxUqBg6Yoam2L1u0IwRNhW4%3D»/pkgs/build-support/trivial-builders/default.nix:80:17:
           79|         enableParallelBuilding = true;
           80|         inherit buildCommand name;
             |                 ^
           81|         passAsFile = [ "buildCommand" ] ++ (derivationArgs.passAsFile or [ ]);

       (stack trace truncated; use '--show-trace' to show the full, detailed trace)

       error: path '«git+file:///var/lib/nixbot/worktrees/1-d3f77d39b325-7?ref=HEAD&rev=c4bcf750636232787cf8cd8a1af084710e5b9716»/ext/supautils.nix' does not exist
failed eval checks.x86_64-linux.psql_15_slim —
error: … while calling the 'derivationStrict' builtin at «nix-internal»/derivation-internal.nix:37:12: 36| 37| strict = …
error:
       … while calling the 'derivationStrict' builtin
         at «nix-internal»/derivation-internal.nix:37:12:
           36|
           37|   strict = derivationStrict drvAttrs;
             |            ^
           38|

       … while evaluating derivation 'run-check-harness-psql-15-slim'
         whose name attribute is located at «https://releases.nixos.org/nixos/unstable/nixos-26.05pre921484.fb7944c166a3/nixexprs.tar.xz?narHash=sha256-3xDI4xtzovwqE/eAxCwmXxUqBg6Yoam2L1u0IwRNhW4%3D»/pkgs/stdenv/generic/make-derivation.nix:541:13

       … while evaluating attribute 'buildCommand' of derivation 'run-check-harness-psql-15-slim'
         at «https://releases.nixos.org/nixos/unstable/nixos-26.05pre921484.fb7944c166a3/nixexprs.tar.xz?narHash=sha256-3xDI4xtzovwqE/eAxCwmXxUqBg6Yoam2L1u0IwRNhW4%3D»/pkgs/build-support/trivial-builders/default.nix:80:17:
           79|         enableParallelBuilding = true;
           80|         inherit buildCommand name;
             |                 ^
           81|         passAsFile = [ "buildCommand" ] ++ (derivationArgs.passAsFile or [ ]);

       (stack trace truncated; use '--show-trace' to show the full, detailed trace)

       error: path '«git+file:///var/lib/nixbot/worktrees/1-d3f77d39b325-7?ref=HEAD&rev=c4bcf750636232787cf8cd8a1af084710e5b9716»/ext/supautils.nix' does not exist
failed eval checks.x86_64-linux.psql_17 —
error: … while calling the 'derivationStrict' builtin at «nix-internal»/derivation-internal.nix:37:12: 36| 37| strict = …
error:
       … while calling the 'derivationStrict' builtin
         at «nix-internal»/derivation-internal.nix:37:12:
           36|
           37|   strict = derivationStrict drvAttrs;
             |            ^
           38|

       … while evaluating derivation 'run-check-harness-psql-17'
         whose name attribute is located at «https://releases.nixos.org/nixos/unstable/nixos-26.05pre921484.fb7944c166a3/nixexprs.tar.xz?narHash=sha256-3xDI4xtzovwqE/eAxCwmXxUqBg6Yoam2L1u0IwRNhW4%3D»/pkgs/stdenv/generic/make-derivation.nix:541:13

       … while evaluating attribute 'buildCommand' of derivation 'run-check-harness-psql-17'
         at «https://releases.nixos.org/nixos/unstable/nixos-26.05pre921484.fb7944c166a3/nixexprs.tar.xz?narHash=sha256-3xDI4xtzovwqE/eAxCwmXxUqBg6Yoam2L1u0IwRNhW4%3D»/pkgs/build-support/trivial-builders/default.nix:80:17:
           79|         enableParallelBuilding = true;
           80|         inherit buildCommand name;
             |                 ^
           81|         passAsFile = [ "buildCommand" ] ++ (derivationArgs.passAsFile or [ ]);

       (stack trace truncated; use '--show-trace' to show the full, detailed trace)

       error: path '«git+file:///var/lib/nixbot/worktrees/1-d3f77d39b325-7?ref=HEAD&rev=c4bcf750636232787cf8cd8a1af084710e5b9716»/ext/supautils.nix' does not exist
failed eval checks.x86_64-linux.psql_17_cli —
error: … while calling the 'derivationStrict' builtin at «nix-internal»/derivation-internal.nix:37:12: 36| 37| strict = …
error:
       … while calling the 'derivationStrict' builtin
         at «nix-internal»/derivation-internal.nix:37:12:
           36|
           37|   strict = derivationStrict drvAttrs;
             |            ^
           38|

       … while evaluating derivation 'run-check-harness-psql-17-cli'
         whose name attribute is located at «https://releases.nixos.org/nixos/unstable/nixos-26.05pre921484.fb7944c166a3/nixexprs.tar.xz?narHash=sha256-3xDI4xtzovwqE/eAxCwmXxUqBg6Yoam2L1u0IwRNhW4%3D»/pkgs/stdenv/generic/make-derivation.nix:541:13

       … while evaluating attribute 'buildCommand' of derivation 'run-check-harness-psql-17-cli'
         at «https://releases.nixos.org/nixos/unstable/nixos-26.05pre921484.fb7944c166a3/nixexprs.tar.xz?narHash=sha256-3xDI4xtzovwqE/eAxCwmXxUqBg6Yoam2L1u0IwRNhW4%3D»/pkgs/build-support/trivial-builders/default.nix:80:17:
           79|         enableParallelBuilding = true;
           80|         inherit buildCommand name;
             |                 ^
           81|         passAsFile = [ "buildCommand" ] ++ (derivationArgs.passAsFile or [ ]);

       (stack trace truncated; use '--show-trace' to show the full, detailed trace)

       error: path '«git+file:///var/lib/nixbot/worktrees/1-d3f77d39b325-7?ref=HEAD&rev=c4bcf750636232787cf8cd8a1af084710e5b9716»/ext/supautils.nix' does not exist
failed checks.x86_64-linux.psql_17_cli_portable 3m 38s
pg_net-0.14.0: from src/event.c:6: /nix/store/wflnb8fxmq4lqx3ca91hlpv95vrqkv51-curl-8.17.0-dev/include/curl/multi.h:429:23: error: expected ide …
pg_net-0.14.0:
                 from src/event.c:6:
/nix/store/wflnb8fxmq4lqx3ca91hlpv95vrqkv51-curl-8.17.0-dev/include/curl/multi.h:429:23: error: expected identifier or '(' before '__extension__'
  429 | CURL_EXTERN CURLMcode curl_multi_setopt(CURLM *multi_handle,
      |                       ^~~~~~~~~~~~~~~~~
/nix/store/wflnb8fxmq4lqx3ca91hlpv95vrqkv51-curl-8.17.0-dev/include/curl/multi.h:429:23: error: expected identifier or '(' before ')' token
  429 | CURL_EXTERN CURLMcode curl_multi_setopt(CURLM *multi_handle,
      |                       ^~~~~~~~~~~~~~~~~
make: *** [<builtin>: src/event.o] Error 1

pg_net-0.19.5:
                 from src/event.c:6:
/nix/store/wflnb8fxmq4lqx3ca91hlpv95vrqkv51-curl-8.17.0-dev/include/curl/multi.h:429:23: error: expected identifier or '(' before '__extension__'
  429 | CURL_EXTERN CURLMcode curl_multi_setopt(CURLM *multi_handle,
      |                       ^~~~~~~~~~~~~~~~~
/nix/store/wflnb8fxmq4lqx3ca91hlpv95vrqkv51-curl-8.17.0-dev/include/curl/multi.h:429:23: error: expected identifier or '(' before ')' token
  429 | CURL_EXTERN CURLMcode curl_multi_setopt(CURLM *multi_handle,
      |                       ^~~~~~~~~~~~~~~~~
make: *** [<builtin>: src/event.o] Error 1

pg_net-0.20.0:
                 from src/event.c:6:
/nix/store/wflnb8fxmq4lqx3ca91hlpv95vrqkv51-curl-8.17.0-dev/include/curl/multi.h:429:23: error: expected identifier or '(' before '__extension__'
  429 | CURL_EXTERN CURLMcode curl_multi_setopt(CURLM *multi_handle,
      |                       ^~~~~~~~~~~~~~~~~
/nix/store/wflnb8fxmq4lqx3ca91hlpv95vrqkv51-curl-8.17.0-dev/include/curl/multi.h:429:23: error: expected identifier or '(' before ')' token
  429 | CURL_EXTERN CURLMcode curl_multi_setopt(CURLM *multi_handle,
      |                       ^~~~~~~~~~~~~~~~~
make: *** [<builtin>: src/event.o] Error 1

… and 1 more failed derivation
failed eval checks.x86_64-linux.psql_17_slim —
error: … while calling the 'derivationStrict' builtin at «nix-internal»/derivation-internal.nix:37:12: 36| 37| strict = …
error:
       … while calling the 'derivationStrict' builtin
         at «nix-internal»/derivation-internal.nix:37:12:
           36|
           37|   strict = derivationStrict drvAttrs;
             |            ^
           38|

       … while evaluating derivation 'run-check-harness-psql-17-slim'
         whose name attribute is located at «https://releases.nixos.org/nixos/unstable/nixos-26.05pre921484.fb7944c166a3/nixexprs.tar.xz?narHash=sha256-3xDI4xtzovwqE/eAxCwmXxUqBg6Yoam2L1u0IwRNhW4%3D»/pkgs/stdenv/generic/make-derivation.nix:541:13

       … while evaluating attribute 'buildCommand' of derivation 'run-check-harness-psql-17-slim'
         at «https://releases.nixos.org/nixos/unstable/nixos-26.05pre921484.fb7944c166a3/nixexprs.tar.xz?narHash=sha256-3xDI4xtzovwqE/eAxCwmXxUqBg6Yoam2L1u0IwRNhW4%3D»/pkgs/build-support/trivial-builders/default.nix:80:17:
           79|         enableParallelBuilding = true;
           80|         inherit buildCommand name;
             |                 ^
           81|         passAsFile = [ "buildCommand" ] ++ (derivationArgs.passAsFile or [ ]);

       (stack trace truncated; use '--show-trace' to show the full, detailed trace)

       error: path '«git+file:///var/lib/nixbot/worktrees/1-d3f77d39b325-7?ref=HEAD&rev=c4bcf750636232787cf8cd8a1af084710e5b9716»/ext/supautils.nix' does not exist
failed eval checks.x86_64-linux.psql_orioledb-17 —
error: … while calling the 'derivationStrict' builtin at «nix-internal»/derivation-internal.nix:37:12: 36| 37| strict = …
error:
       … while calling the 'derivationStrict' builtin
         at «nix-internal»/derivation-internal.nix:37:12:
           36|
           37|   strict = derivationStrict drvAttrs;
             |            ^
           38|

       … while evaluating derivation 'run-check-harness-psql-orioledb-17'
         whose name attribute is located at «https://releases.nixos.org/nixos/unstable/nixos-26.05pre921484.fb7944c166a3/nixexprs.tar.xz?narHash=sha256-3xDI4xtzovwqE/eAxCwmXxUqBg6Yoam2L1u0IwRNhW4%3D»/pkgs/stdenv/generic/make-derivation.nix:541:13

       … while evaluating attribute 'buildCommand' of derivation 'run-check-harness-psql-orioledb-17'
         at «https://releases.nixos.org/nixos/unstable/nixos-26.05pre921484.fb7944c166a3/nixexprs.tar.xz?narHash=sha256-3xDI4xtzovwqE/eAxCwmXxUqBg6Yoam2L1u0IwRNhW4%3D»/pkgs/build-support/trivial-builders/default.nix:80:17:
           79|         enableParallelBuilding = true;
           80|         inherit buildCommand name;
             |                 ^
           81|         passAsFile = [ "buildCommand" ] ++ (derivationArgs.passAsFile or [ ]);

       (stack trace truncated; use '--show-trace' to show the full, detailed trace)

       error: path '«git+file:///var/lib/nixbot/worktrees/1-d3f77d39b325-7?ref=HEAD&rev=c4bcf750636232787cf8cd8a1af084710e5b9716»/ext/supautils.nix' does not exist
failed eval checks.x86_64-linux.psql_orioledb-17_slim —
error: … while calling the 'derivationStrict' builtin at «nix-internal»/derivation-internal.nix:37:12: 36| 37| strict = …
error:
       … while calling the 'derivationStrict' builtin
         at «nix-internal»/derivation-internal.nix:37:12:
           36|
           37|   strict = derivationStrict drvAttrs;
             |            ^
           38|

       … while evaluating derivation 'run-check-harness-psql-orioledb-17-slim'
         whose name attribute is located at «https://releases.nixos.org/nixos/unstable/nixos-26.05pre921484.fb7944c166a3/nixexprs.tar.xz?narHash=sha256-3xDI4xtzovwqE/eAxCwmXxUqBg6Yoam2L1u0IwRNhW4%3D»/pkgs/stdenv/generic/make-derivation.nix:541:13

       … while evaluating attribute 'buildCommand' of derivation 'run-check-harness-psql-orioledb-17-slim'
         at «https://releases.nixos.org/nixos/unstable/nixos-26.05pre921484.fb7944c166a3/nixexprs.tar.xz?narHash=sha256-3xDI4xtzovwqE/eAxCwmXxUqBg6Yoam2L1u0IwRNhW4%3D»/pkgs/build-support/trivial-builders/default.nix:80:17:
           79|         enableParallelBuilding = true;
           80|         inherit buildCommand name;
             |                 ^
           81|         passAsFile = [ "buildCommand" ] ++ (derivationArgs.passAsFile or [ ]);

       (stack trace truncated; use '--show-trace' to show the full, detailed trace)

       error: path '«git+file:///var/lib/nixbot/worktrees/1-d3f77d39b325-7?ref=HEAD&rev=c4bcf750636232787cf8cd8a1af084710e5b9716»/ext/supautils.nix' does not exist
67 cancelled
cancelled attributes
status attribute duration
loading…
18 succeeded
succeeded attributes
status attribute duration
loading…
22 already built
skipped attributes
status attribute duration
loading…