setup
checks.x86_64-linux.psql_15
· build #133
· raw
1these 57 derivations will be built:2 /nix/store/0ghzb9i3wrf3s927kg39aa01cd1lm0ic-pgtap.drv3 /nix/store/1nyr8hxhdprfgmxj3y07r35vb4vwpcbc-pgrouting.drv4 /nix/store/1qxq6npfmh7zfj0qs2ld3a1fpd0sbr7k-pg_repack.drv5 /nix/store/2z9gqy2kdcqh0l3s21fdvaiwji4bw085-wrappers.drv6 /nix/store/6xiqjskc06w7z35k5pacs4276hqawiww-timescaledb.drv7 /nix/store/5v6a4ssacxc4snck5dzagkmqhcsh2swz-pg_net-0.19.5.drv8 /nix/store/7b5ar71808xp6cc9vi64vcr3gxhaq9w2-pg_net-0.14.0.drv9 /nix/store/82vkrfmb1h23wpf7jvwwb1r82vfiqb7w-pg_net-0.8.0.drv10 /nix/store/ggfg6al5fkdp0r1jsc3iabgz0p7g6l1m-pg_net-0.7.drv11 /nix/store/hfwkzpr1kplwaywhvayqm6j4gsva8n5n-pg_net-0.20.0.drv12 /nix/store/ymx9gp4jhvd7qpjvk95vw2m6ycb0jal7-pg_net-0.13.0.drv13 /nix/store/94hi7qqfg86lfxqnyqizx334my0yjbh3-pg_net.drv14 /nix/store/lzgjq8v4l4vm5lwyxkllg0ii0n1vvam6-http.drv15 /nix/store/pjhzv6b54gh758msf91ibg3aggs5v63y-safeupdate.drv16 /nix/store/rcl303fv0rxrbkgjcwqi92h8hlsksl86-plv8.drv17 /nix/store/w8w3j8l9i3fwp8lvrddpz6szlbsz1b80-wrappers.drv18 /nix/store/ypgp6sck1rcalskz253f3a3g2vg8dqxn-postgis.drv19 /nix/store/zpy0anvh5rgr1fnrs39j7db1j07adpip-rum.drv20 /nix/store/a5gfyj0k47cxv70v4a1zhhk1998vd290-postgresql-and-plugins-15.19.drv21 /nix/store/69zc44dp9979jf4p9hcpgfdf1wgpw40l-postgresql-and-plugins-15.19.drv22 /nix/store/8rlk8y0giv6av6yxjvain89wy868fxzw-postgis.drv23 /nix/store/h3jfznl8xhwm8wvvxg23yj74srzz3vii-pg_net-0.19.5.drv24 /nix/store/jdx62c5jlcjxsbqjaqi25zwfy2ys9jp5-pg_net-0.13.0.drv25 /nix/store/ky294hja2giinx8655lj1d83j4jq5gjj-pg_net-0.14.0.drv26 /nix/store/ky7414m088qm5h8xn9z7xzw0k08wgcrh-pg_net-0.20.0.drv27 /nix/store/cqdc5q7n6g9pkxy0cjcvkq185rps4bfd-pg_net.drv28 /nix/store/i9c59glkkfckl8igi51prmm5q8q0l9ii-wrappers.drv29 /nix/store/kjb0q84944pahkp1dirilg67gg7knp0i-plan_filter.drv30 /nix/store/pp6iq08yhjcnrm9cpgfn8bnlskbj452w-pgroonga.drv31 /nix/store/vjn7gz0pab3nkxs3klbqdbi8j68v291p-pgrouting.drv32 /nix/store/xibm7yh8fni2maxnqscqm8mmsswpv9nb-plpgsql_check.drv33 /nix/store/z1c8kqi7q1ixgzsnw9i726rj3jk14b9v-wal2json.drv34 /nix/store/d5s4s970iizz6a8w5ndnpzyw63w1m1qv-postgresql-and-plugins-17.11.drv35 /nix/store/7hla3p20yajypj5w3hnrx38bc3kq14vq-postgresql-and-plugins-17.11.drv36 /nix/store/5qbkncy11hxa3hjvxlivyk5jl56cqaca-pgroonga.drv37 /nix/store/67j8ga6fwaypskbxhllbgq14gg17lbgv-plpgsql_check.drv38 /nix/store/a1l87bw0qg8qb986f3iw25zbq2bh1kxl-wal2json.drv39 /nix/store/fpx02gfczpp7gcdldgabjzhc7pj2b3yq-index_advisor.drv40 /nix/store/g8h2i50jjjbj01nf9na2hjc5p8jilfwq-vector.drv41 /nix/store/g9clk05ymhqn7csk59fpd1iksabh2vp2-safeupdate.drv42 /nix/store/h5axh42309k5kr942f64rxkr35s86nhm-pgtap.drv43 /nix/store/izcyq3yalzyqj7np7qbzynzk3k2ly0bi-supabase_vault.drv44 /nix/store/mdaxp5nsyc1yzfzmbyblarpc0sh9wwap-pg_graphql.drv45 /nix/store/mh8gnpab20pmx5vf0y4mckhswgh49akd-pgaudit.drv46 /nix/store/q1dbay5va74kwxzxl0mj6q02899srnx1-plan_filter.drv47 /nix/store/r4vfiabbhgs1g8sj39raqak5w0yz6ks3-pgsodium.drv48 /nix/store/vgh7yrjnkl0nxm6bv1ssagw53l2zp28w-rum.drv49 /nix/store/bv2b3hyfiwg59frhybs6cmf9l26byfrs-pg_net-0.13.0.drv50 /nix/store/dxjxg15c0m6vdgy5yswqbm50g4fww2p1-pg_net-0.14.0.drv51 /nix/store/jvalwdcdi2ci9kcx1q2zx6hyla1sa738-pg_net-0.20.0.drv52 /nix/store/v7i610b6q10zpsd2536yvba9pd2xqrr6-pg_net-0.19.5.drv53 /nix/store/zd0hg58y5nwnnwfzy7sd19l7dzx4zvv5-pg_net.drv54 /nix/store/m7073j3kxn6vxs53jdm448q51cxiimys-postgresql-and-plugins-17_22.drv55 /nix/store/q8qv7gf9izi4my9mjapggg0fx2dhzlwc-postgresql-and-plugins-17_22.drv56 /nix/store/78dxmxknxafy8xgdswvqh5976pnyfmj3-start-postgres-server-test.drv57 /nix/store/44kjn34pf0m8jpv21pzvmg6ga88dnns8-postgres-15-check-harness.drv58 /nix/store/i6jq4167z79adj5i91r8dlgxp6bi5yal-run-check-harness-psql-15.drv59these 3 paths will be fetched (44.4 MiB download, 181.2 MiB unpacked):60 /nix/store/jmnfs376345gf70flaf4g96g8vvnxr1f-supautils61 /nix/store/hj2wcbblrszjmm89w39x9bigw7i563sw-wrappers-0.5.762 /nix/store/kqgyk1gz07nfphc66dx8a61gmbdvnkyy-wrappers-0.6.063error: Cannot build '/nix/store/7b5ar71808xp6cc9vi64vcr3gxhaq9w2-pg_net-0.14.0.drv'.64 Reason: builder failed with exit code 2.65 Output paths:66 /nix/store/2vyqm50vp9dxrrm1lidjzvr6difmnnqc-pg_net-0.14.067 Last 25 log lines:68 > src/errors.h:6:11: warning: call to 'Wcurl_easy_setopt_err_long' declared with attribute warning: curl_easy_setopt expects a long argument [-Wattribute-warning]69 > 6 | if (curl_easy_setopt(hdl, opt, prm) != CURLE_OK) \70 > | ^~~~~~~~~~~~~~~~71 > src/core.c:134:3: note: in expansion of macro 'EREPORT_CURL_SETOPT'72 > 134 | EREPORT_CURL_SETOPT(curl_ez_handle, CURLOPT_TIMEOUT_MS, cdata->timeout_milliseconds);73 > | ^~~~~~~~~~~~~~~~~~~74 > src/errors.h:6:11: warning: call to 'Wcurl_easy_setopt_err_long' declared with attribute warning: curl_easy_setopt expects a long argument [-Wattribute-warning]75 > 6 | if (curl_easy_setopt(hdl, opt, prm) != CURLE_OK) \76 > | ^~~~~~~~~~~~~~~~77 > src/core.c:136:3: note: in expansion of macro 'EREPORT_CURL_SETOPT'78 > 136 | EREPORT_CURL_SETOPT(curl_ez_handle, CURLOPT_FOLLOWLOCATION, true);79 > | ^~~~~~~~~~~~~~~~~~~80 > gcc -Wall -Wmissing-prototypes -Wpointer-arith -Wdeclaration-after-statement -Werror=vla -Wendif-labels -Wmissing-format-attribute -Wimplicit-fallthrough=3 -Wcast-function-type -Wformat-security -fno-strict-aliasing -fwrapv -fexcess-precision=standard -Wno-deprecated-non-prototype -Wno-format-truncation -Wno-stringop-truncation -g -O2 -std=gnu17 -std=c11 -Werror -Wno-declaration-after-statement -fPIC -DEXTVERSION=\"0.14.0\" -I. -I./ -I/nix/store/804f042cyc4dca4vwl2fmh1rhfy0sij9-postgresql-15.19/include/server -I/nix/store/804f042cyc4dca4vwl2fmh1rhfy0sij9-postgresql-15.19/include/internal -D_GNU_SOURCE -I/nix/store/5nl2zr46dic7mxcw6cvbq85wa8c2gngh-libxml2-2.15.1-dev/include/libxml2 -I/nix/store/sl10j863s32x7dv5vw6wfx1nh22f3xh2-lz4-1.10.0-dev/include -I/nix/store/di94mxmhhk390zzzv2gvavfwkgww7q6h-zstd-1.5.7-dev/include -I/nix/store/h5hfqhzcqszmsacj26hh3fngwcal04zs-icu4c-75.1-dev/include -c -o src/errors.o src/errors.c81 > gcc -Wall -Wmissing-prototypes -Wpointer-arith -Wdeclaration-after-statement -Werror=vla -Wendif-labels -Wmissing-format-attribute -Wimplicit-fallthrough=3 -Wcast-function-type -Wformat-security -fno-strict-aliasing -fwrapv -fexcess-precision=standard -Wno-deprecated-non-prototype -Wno-format-truncation -Wno-stringop-truncation -g -O2 -std=gnu17 -std=c11 -Werror -Wno-declaration-after-statement -fPIC -DEXTVERSION=\"0.14.0\" -I. -I./ -I/nix/store/804f042cyc4dca4vwl2fmh1rhfy0sij9-postgresql-15.19/include/server -I/nix/store/804f042cyc4dca4vwl2fmh1rhfy0sij9-postgresql-15.19/include/internal -D_GNU_SOURCE -I/nix/store/5nl2zr46dic7mxcw6cvbq85wa8c2gngh-libxml2-2.15.1-dev/include/libxml2 -I/nix/store/sl10j863s32x7dv5vw6wfx1nh22f3xh2-lz4-1.10.0-dev/include -I/nix/store/di94mxmhhk390zzzv2gvavfwkgww7q6h-zstd-1.5.7-dev/include -I/nix/store/h5hfqhzcqszmsacj26hh3fngwcal04zs-icu4c-75.1-dev/include -c -o src/event.o src/event.c82 > In file included from /nix/store/wflnb8fxmq4lqx3ca91hlpv95vrqkv51-curl-8.17.0-dev/include/curl/curl.h:3333,83 > from /nix/store/wflnb8fxmq4lqx3ca91hlpv95vrqkv51-curl-8.17.0-dev/include/curl/multi.h:51,84 > from src/event.h:4,85 > from src/event.c:6:86 > /nix/store/wflnb8fxmq4lqx3ca91hlpv95vrqkv51-curl-8.17.0-dev/include/curl/multi.h:429:23: error: expected identifier or '(' before '__extension__'87 > 429 | CURL_EXTERN CURLMcode curl_multi_setopt(CURLM *multi_handle,88 > | ^~~~~~~~~~~~~~~~~89 > /nix/store/wflnb8fxmq4lqx3ca91hlpv95vrqkv51-curl-8.17.0-dev/include/curl/multi.h:429:23: error: expected identifier or '(' before ')' token90 > 429 | CURL_EXTERN CURLMcode curl_multi_setopt(CURLM *multi_handle,91 > | ^~~~~~~~~~~~~~~~~92 > make: *** [<builtin>: src/event.o] Error 193 For full logs, run:94 nix log /nix/store/7b5ar71808xp6cc9vi64vcr3gxhaq9w2-pg_net-0.14.0.drv95error: Cannot build '/nix/store/dxjxg15c0m6vdgy5yswqbm50g4fww2p1-pg_net-0.14.0.drv'.96 Reason: builder failed with exit code 2.97 Output paths:98 /nix/store/xqh65xhxx9wcmpgwvzh7kkpf9zs0y72x-pg_net-0.14.099 Last 25 log lines:100 > src/errors.h:6:11: warning: call to 'Wcurl_easy_setopt_err_long' declared with attribute warning: curl_easy_setopt expects a long argument [-Wattribute-warning]101 > 6 | if (curl_easy_setopt(hdl, opt, prm) != CURLE_OK) \102 > | ^~~~~~~~~~~~~~~~103 > src/core.c:134:3: note: in expansion of macro 'EREPORT_CURL_SETOPT'104 > 134 | EREPORT_CURL_SETOPT(curl_ez_handle, CURLOPT_TIMEOUT_MS, cdata->timeout_milliseconds);105 > | ^~~~~~~~~~~~~~~~~~~106 > src/errors.h:6:11: warning: call to 'Wcurl_easy_setopt_err_long' declared with attribute warning: curl_easy_setopt expects a long argument [-Wattribute-warning]107 > 6 | if (curl_easy_setopt(hdl, opt, prm) != CURLE_OK) \108 > | ^~~~~~~~~~~~~~~~109 > src/core.c:136:3: note: in expansion of macro 'EREPORT_CURL_SETOPT'110 > 136 | EREPORT_CURL_SETOPT(curl_ez_handle, CURLOPT_FOLLOWLOCATION, true);111 > | ^~~~~~~~~~~~~~~~~~~112 > gcc -Wall -Wmissing-prototypes -Wpointer-arith -Wdeclaration-after-statement -Werror=vla -Wendif-labels -Wmissing-format-attribute -Wimplicit-fallthrough=3 -Wcast-function-type -Wshadow=compatible-local -Wformat-security -fno-strict-aliasing -fwrapv -fexcess-precision=standard -Wno-format-truncation -Wno-stringop-truncation -g -O2 -std=c11 -Werror -Wno-declaration-after-statement -fPIC -fvisibility=hidden -DEXTVERSION=\"0.14.0\" -I. -I./ -I/nix/store/qmc7y6nc0qxg50ywm46x4iaqq5knz702-postgresql-17_22/include/server -I/nix/store/qmc7y6nc0qxg50ywm46x4iaqq5knz702-postgresql-17_22/include/internal -D_GNU_SOURCE -I/nix/store/5nl2zr46dic7mxcw6cvbq85wa8c2gngh-libxml2-2.15.1-dev/include/libxml2 -I/nix/store/sl10j863s32x7dv5vw6wfx1nh22f3xh2-lz4-1.10.0-dev/include -I/nix/store/di94mxmhhk390zzzv2gvavfwkgww7q6h-zstd-1.5.7-dev/include -I/nix/store/h5hfqhzcqszmsacj26hh3fngwcal04zs-icu4c-75.1-dev/include -c -o src/errors.o src/errors.c113 > gcc -Wall -Wmissing-prototypes -Wpointer-arith -Wdeclaration-after-statement -Werror=vla -Wendif-labels -Wmissing-format-attribute -Wimplicit-fallthrough=3 -Wcast-function-type -Wshadow=compatible-local -Wformat-security -fno-strict-aliasing -fwrapv -fexcess-precision=standard -Wno-format-truncation -Wno-stringop-truncation -g -O2 -std=c11 -Werror -Wno-declaration-after-statement -fPIC -fvisibility=hidden -DEXTVERSION=\"0.14.0\" -I. -I./ -I/nix/store/qmc7y6nc0qxg50ywm46x4iaqq5knz702-postgresql-17_22/include/server -I/nix/store/qmc7y6nc0qxg50ywm46x4iaqq5knz702-postgresql-17_22/include/internal -D_GNU_SOURCE -I/nix/store/5nl2zr46dic7mxcw6cvbq85wa8c2gngh-libxml2-2.15.1-dev/include/libxml2 -I/nix/store/sl10j863s32x7dv5vw6wfx1nh22f3xh2-lz4-1.10.0-dev/include -I/nix/store/di94mxmhhk390zzzv2gvavfwkgww7q6h-zstd-1.5.7-dev/include -I/nix/store/h5hfqhzcqszmsacj26hh3fngwcal04zs-icu4c-75.1-dev/include -c -o src/event.o src/event.c114 > In file included from /nix/store/wflnb8fxmq4lqx3ca91hlpv95vrqkv51-curl-8.17.0-dev/include/curl/curl.h:3333,115 > from /nix/store/wflnb8fxmq4lqx3ca91hlpv95vrqkv51-curl-8.17.0-dev/include/curl/multi.h:51,116 > from src/event.h:4,117 > from src/event.c:6:118 > /nix/store/wflnb8fxmq4lqx3ca91hlpv95vrqkv51-curl-8.17.0-dev/include/curl/multi.h:429:23: error: expected identifier or '(' before '__extension__'119 > 429 | CURL_EXTERN CURLMcode curl_multi_setopt(CURLM *multi_handle,120 > | ^~~~~~~~~~~~~~~~~121 > /nix/store/wflnb8fxmq4lqx3ca91hlpv95vrqkv51-curl-8.17.0-dev/include/curl/multi.h:429:23: error: expected identifier or '(' before ')' token122 > 429 | CURL_EXTERN CURLMcode curl_multi_setopt(CURLM *multi_handle,123 > | ^~~~~~~~~~~~~~~~~124 > make: *** [<builtin>: src/event.o] Error 1125 For full logs, run:126 nix log /nix/store/dxjxg15c0m6vdgy5yswqbm50g4fww2p1-pg_net-0.14.0.drv127error: Cannot build '/nix/store/ymx9gp4jhvd7qpjvk95vw2m6ycb0jal7-pg_net-0.13.0.drv'.128 Reason: builder failed with exit code 2.129 Output paths:130 /nix/store/pxjg6rykpbbhl7xmwasvyb94bc1v5w3r-pg_net-0.13.0131 Last 25 log lines:132 > | ^~~~~~~~~~~~~~133 > src/util.h:6:11: warning: call to 'Wcurl_easy_setopt_err_long' declared with attribute warning: curl_easy_setopt expects a long argument [-Wattribute-warning]134 > 6 | if (curl_easy_setopt(hdl, opt, prm) != CURLE_OK) \135 > | ^~~~~~~~~~~~~~~~136 > src/core.c:108:3: note: in expansion of macro 'CURL_EZ_SETOPT'137 > 108 | CURL_EZ_SETOPT(curl_ez_handle, CURLOPT_TIMEOUT_MS, timeout_milliseconds);138 > | ^~~~~~~~~~~~~~139 > src/util.h:6:11: warning: call to 'Wcurl_easy_setopt_err_long' declared with attribute warning: curl_easy_setopt expects a long argument [-Wattribute-warning]140 > 6 | if (curl_easy_setopt(hdl, opt, prm) != CURLE_OK) \141 > | ^~~~~~~~~~~~~~~~142 > src/core.c:110:3: note: in expansion of macro 'CURL_EZ_SETOPT'143 > 110 | CURL_EZ_SETOPT(curl_ez_handle, CURLOPT_FOLLOWLOCATION, true);144 > | ^~~~~~~~~~~~~~145 > gcc -Wall -Wmissing-prototypes -Wpointer-arith -Wdeclaration-after-statement -Werror=vla -Wendif-labels -Wmissing-format-attribute -Wimplicit-fallthrough=3 -Wcast-function-type -Wformat-security -fno-strict-aliasing -fwrapv -fexcess-precision=standard -Wno-deprecated-non-prototype -Wno-format-truncation -Wno-stringop-truncation -g -O2 -std=gnu17 -std=c11 -Werror -Wno-declaration-after-statement -fPIC -DEXTVERSION=\"0.13.0\" -I. -I./ -I/nix/store/804f042cyc4dca4vwl2fmh1rhfy0sij9-postgresql-15.19/include/server -I/nix/store/804f042cyc4dca4vwl2fmh1rhfy0sij9-postgresql-15.19/include/internal -D_GNU_SOURCE -I/nix/store/5nl2zr46dic7mxcw6cvbq85wa8c2gngh-libxml2-2.15.1-dev/include/libxml2 -I/nix/store/sl10j863s32x7dv5vw6wfx1nh22f3xh2-lz4-1.10.0-dev/include -I/nix/store/di94mxmhhk390zzzv2gvavfwkgww7q6h-zstd-1.5.7-dev/include -I/nix/store/h5hfqhzcqszmsacj26hh3fngwcal04zs-icu4c-75.1-dev/include -c -o src/event.o src/event.c146 > In file included from /nix/store/wflnb8fxmq4lqx3ca91hlpv95vrqkv51-curl-8.17.0-dev/include/curl/curl.h:3333,147 > from /nix/store/wflnb8fxmq4lqx3ca91hlpv95vrqkv51-curl-8.17.0-dev/include/curl/multi.h:51,148 > from src/event.h:4,149 > from src/event.c:6:150 > /nix/store/wflnb8fxmq4lqx3ca91hlpv95vrqkv51-curl-8.17.0-dev/include/curl/multi.h:429:23: error: expected identifier or '(' before '__extension__'151 > 429 | CURL_EXTERN CURLMcode curl_multi_setopt(CURLM *multi_handle,152 > | ^~~~~~~~~~~~~~~~~153 > /nix/store/wflnb8fxmq4lqx3ca91hlpv95vrqkv51-curl-8.17.0-dev/include/curl/multi.h:429:23: error: expected identifier or '(' before ')' token154 > 429 | CURL_EXTERN CURLMcode curl_multi_setopt(CURLM *multi_handle,155 > | ^~~~~~~~~~~~~~~~~156 > make: *** [<builtin>: src/event.o] Error 1157 For full logs, run:158 nix log /nix/store/ymx9gp4jhvd7qpjvk95vw2m6ycb0jal7-pg_net-0.13.0.drv159error: Cannot build '/nix/store/ky294hja2giinx8655lj1d83j4jq5gjj-pg_net-0.14.0.drv'.160 Reason: builder failed with exit code 2.161 Output paths:162 /nix/store/da6kcjzl896sjpnd8rrkfzykfm8chlaz-pg_net-0.14.0163 Last 25 log lines:164 > src/errors.h:6:11: warning: call to 'Wcurl_easy_setopt_err_long' declared with attribute warning: curl_easy_setopt expects a long argument [-Wattribute-warning]165 > 6 | if (curl_easy_setopt(hdl, opt, prm) != CURLE_OK) \166 > | ^~~~~~~~~~~~~~~~167 > src/core.c:134:3: note: in expansion of macro 'EREPORT_CURL_SETOPT'168 > 134 | EREPORT_CURL_SETOPT(curl_ez_handle, CURLOPT_TIMEOUT_MS, cdata->timeout_milliseconds);169 > | ^~~~~~~~~~~~~~~~~~~170 > src/errors.h:6:11: warning: call to 'Wcurl_easy_setopt_err_long' declared with attribute warning: curl_easy_setopt expects a long argument [-Wattribute-warning]171 > 6 | if (curl_easy_setopt(hdl, opt, prm) != CURLE_OK) \172 > | ^~~~~~~~~~~~~~~~173 > src/core.c:136:3: note: in expansion of macro 'EREPORT_CURL_SETOPT'174 > 136 | EREPORT_CURL_SETOPT(curl_ez_handle, CURLOPT_FOLLOWLOCATION, true);175 > | ^~~~~~~~~~~~~~~~~~~176 > gcc -Wall -Wmissing-prototypes -Wpointer-arith -Wdeclaration-after-statement -Werror=vla -Wendif-labels -Wmissing-format-attribute -Wimplicit-fallthrough=3 -Wcast-function-type -Wshadow=compatible-local -Wformat-security -fno-strict-aliasing -fwrapv -fexcess-precision=standard -Wno-format-truncation -Wno-stringop-truncation -g -O2 -std=c11 -Werror -Wno-declaration-after-statement -fPIC -fvisibility=hidden -DEXTVERSION=\"0.14.0\" -I. -I./ -I/nix/store/dj25xabr71j1mmxf628lqsn61qd5qcyk-postgresql-17.11/include/server -I/nix/store/dj25xabr71j1mmxf628lqsn61qd5qcyk-postgresql-17.11/include/internal -D_GNU_SOURCE -I/nix/store/5nl2zr46dic7mxcw6cvbq85wa8c2gngh-libxml2-2.15.1-dev/include/libxml2 -I/nix/store/sl10j863s32x7dv5vw6wfx1nh22f3xh2-lz4-1.10.0-dev/include -I/nix/store/di94mxmhhk390zzzv2gvavfwkgww7q6h-zstd-1.5.7-dev/include -I/nix/store/h5hfqhzcqszmsacj26hh3fngwcal04zs-icu4c-75.1-dev/include -c -o src/errors.o src/errors.c177 > gcc -Wall -Wmissing-prototypes -Wpointer-arith -Wdeclaration-after-statement -Werror=vla -Wendif-labels -Wmissing-format-attribute -Wimplicit-fallthrough=3 -Wcast-function-type -Wshadow=compatible-local -Wformat-security -fno-strict-aliasing -fwrapv -fexcess-precision=standard -Wno-format-truncation -Wno-stringop-truncation -g -O2 -std=c11 -Werror -Wno-declaration-after-statement -fPIC -fvisibility=hidden -DEXTVERSION=\"0.14.0\" -I. -I./ -I/nix/store/dj25xabr71j1mmxf628lqsn61qd5qcyk-postgresql-17.11/include/server -I/nix/store/dj25xabr71j1mmxf628lqsn61qd5qcyk-postgresql-17.11/include/internal -D_GNU_SOURCE -I/nix/store/5nl2zr46dic7mxcw6cvbq85wa8c2gngh-libxml2-2.15.1-dev/include/libxml2 -I/nix/store/sl10j863s32x7dv5vw6wfx1nh22f3xh2-lz4-1.10.0-dev/include -I/nix/store/di94mxmhhk390zzzv2gvavfwkgww7q6h-zstd-1.5.7-dev/include -I/nix/store/h5hfqhzcqszmsacj26hh3fngwcal04zs-icu4c-75.1-dev/include -c -o src/event.o src/event.c178 > In file included from /nix/store/wflnb8fxmq4lqx3ca91hlpv95vrqkv51-curl-8.17.0-dev/include/curl/curl.h:3333,179 > from /nix/store/wflnb8fxmq4lqx3ca91hlpv95vrqkv51-curl-8.17.0-dev/include/curl/multi.h:51,180 > from src/event.h:4,181 > from src/event.c:6:182 > /nix/store/wflnb8fxmq4lqx3ca91hlpv95vrqkv51-curl-8.17.0-dev/include/curl/multi.h:429:23: error: expected identifier or '(' before '__extension__'183 > 429 | CURL_EXTERN CURLMcode curl_multi_setopt(CURLM *multi_handle,184 > | ^~~~~~~~~~~~~~~~~185 > /nix/store/wflnb8fxmq4lqx3ca91hlpv95vrqkv51-curl-8.17.0-dev/include/curl/multi.h:429:23: error: expected identifier or '(' before ')' token186 > 429 | CURL_EXTERN CURLMcode curl_multi_setopt(CURLM *multi_handle,187 > | ^~~~~~~~~~~~~~~~~188 > make: *** [<builtin>: src/event.o] Error 1189 For full logs, run:190 nix log /nix/store/ky294hja2giinx8655lj1d83j4jq5gjj-pg_net-0.14.0.drv191error: Cannot build '/nix/store/jdx62c5jlcjxsbqjaqi25zwfy2ys9jp5-pg_net-0.13.0.drv'.192 Reason: builder failed with exit code 2.193 Output paths:194 /nix/store/z8m2csva6bci9vlabgjm2wqd19ww393d-pg_net-0.13.0195 Last 25 log lines:196 > | ^~~~~~~~~~~~~~197 > src/util.h:6:11: warning: call to 'Wcurl_easy_setopt_err_long' declared with attribute warning: curl_easy_setopt expects a long argument [-Wattribute-warning]198 > 6 | if (curl_easy_setopt(hdl, opt, prm) != CURLE_OK) \199 > | ^~~~~~~~~~~~~~~~200 > src/core.c:108:3: note: in expansion of macro 'CURL_EZ_SETOPT'201 > 108 | CURL_EZ_SETOPT(curl_ez_handle, CURLOPT_TIMEOUT_MS, timeout_milliseconds);202 > | ^~~~~~~~~~~~~~203 > src/util.h:6:11: warning: call to 'Wcurl_easy_setopt_err_long' declared with attribute warning: curl_easy_setopt expects a long argument [-Wattribute-warning]204 > 6 | if (curl_easy_setopt(hdl, opt, prm) != CURLE_OK) \205 > | ^~~~~~~~~~~~~~~~206 > src/core.c:110:3: note: in expansion of macro 'CURL_EZ_SETOPT'207 > 110 | CURL_EZ_SETOPT(curl_ez_handle, CURLOPT_FOLLOWLOCATION, true);208 > | ^~~~~~~~~~~~~~209 > gcc -Wall -Wmissing-prototypes -Wpointer-arith -Wdeclaration-after-statement -Werror=vla -Wendif-labels -Wmissing-format-attribute -Wimplicit-fallthrough=3 -Wcast-function-type -Wshadow=compatible-local -Wformat-security -fno-strict-aliasing -fwrapv -fexcess-precision=standard -Wno-format-truncation -Wno-stringop-truncation -g -O2 -std=c11 -Werror -Wno-declaration-after-statement -fPIC -fvisibility=hidden -DEXTVERSION=\"0.13.0\" -I. -I./ -I/nix/store/dj25xabr71j1mmxf628lqsn61qd5qcyk-postgresql-17.11/include/server -I/nix/store/dj25xabr71j1mmxf628lqsn61qd5qcyk-postgresql-17.11/include/internal -D_GNU_SOURCE -I/nix/store/5nl2zr46dic7mxcw6cvbq85wa8c2gngh-libxml2-2.15.1-dev/include/libxml2 -I/nix/store/sl10j863s32x7dv5vw6wfx1nh22f3xh2-lz4-1.10.0-dev/include -I/nix/store/di94mxmhhk390zzzv2gvavfwkgww7q6h-zstd-1.5.7-dev/include -I/nix/store/h5hfqhzcqszmsacj26hh3fngwcal04zs-icu4c-75.1-dev/include -c -o src/event.o src/event.c210 > In file included from /nix/store/wflnb8fxmq4lqx3ca91hlpv95vrqkv51-curl-8.17.0-dev/include/curl/curl.h:3333,211 > from /nix/store/wflnb8fxmq4lqx3ca91hlpv95vrqkv51-curl-8.17.0-dev/include/curl/multi.h:51,212 > from src/event.h:4,213 > from src/event.c:6:214 > /nix/store/wflnb8fxmq4lqx3ca91hlpv95vrqkv51-curl-8.17.0-dev/include/curl/multi.h:429:23: error: expected identifier or '(' before '__extension__'215 > 429 | CURL_EXTERN CURLMcode curl_multi_setopt(CURLM *multi_handle,216 > | ^~~~~~~~~~~~~~~~~217 > /nix/store/wflnb8fxmq4lqx3ca91hlpv95vrqkv51-curl-8.17.0-dev/include/curl/multi.h:429:23: error: expected identifier or '(' before ')' token218 > 429 | CURL_EXTERN CURLMcode curl_multi_setopt(CURLM *multi_handle,219 > | ^~~~~~~~~~~~~~~~~220 > make: *** [<builtin>: src/event.o] Error 1221 For full logs, run:222 nix log /nix/store/jdx62c5jlcjxsbqjaqi25zwfy2ys9jp5-pg_net-0.13.0.drv223error: Cannot build '/nix/store/5v6a4ssacxc4snck5dzagkmqhcsh2swz-pg_net-0.19.5.drv'.224 Reason: builder failed with exit code 2.225 Output paths:226 /nix/store/xcsw4jyz7w5071r5drjiify20gjvij99-pg_net-0.19.5227 Last 22 log lines:228 > Running phase: unpackPhase229 > unpacking source archive /nix/store/5zgdqy3bz93jyn79pizxc1hks0cdcadw-source230 > source root is source231 > Running phase: patchPhase232 > Running phase: updateAutotoolsGnuConfigScriptsPhase233 > Running phase: configurePhase234 > no configure script, doing nothing235 > Running phase: buildPhase236 > gcc -Wall -Wmissing-prototypes -Wpointer-arith -Wdeclaration-after-statement -Werror=vla -Wendif-labels -Wmissing-format-attribute -Wimplicit-fallthrough=3 -Wcast-function-type -Wformat-security -fno-strict-aliasing -fwrapv -fexcess-precision=standard -Wno-deprecated-non-prototype -Wno-format-truncation -Wno-stringop-truncation -g -O2 -std=gnu17 -std=c11 -Wextra -Wall -Werror -Wno-declaration-after-statement -Wno-vla -Wno-long-long -Wmissing-variable-declarations -fPIC -DEXTVERSION=\"0.19.5\" -I. -I./ -I/nix/store/804f042cyc4dca4vwl2fmh1rhfy0sij9-postgresql-15.19/include/server -I/nix/store/804f042cyc4dca4vwl2fmh1rhfy0sij9-postgresql-15.19/include/internal -D_GNU_SOURCE -I/nix/store/5nl2zr46dic7mxcw6cvbq85wa8c2gngh-libxml2-2.15.1-dev/include/libxml2 -I/nix/store/sl10j863s32x7dv5vw6wfx1nh22f3xh2-lz4-1.10.0-dev/include -I/nix/store/di94mxmhhk390zzzv2gvavfwkgww7q6h-zstd-1.5.7-dev/include -I/nix/store/h5hfqhzcqszmsacj26hh3fngwcal04zs-icu4c-75.1-dev/include -c -o src/core.o src/core.c237 > gcc -Wall -Wmissing-prototypes -Wpointer-arith -Wdeclaration-after-statement -Werror=vla -Wendif-labels -Wmissing-format-attribute -Wimplicit-fallthrough=3 -Wcast-function-type -Wformat-security -fno-strict-aliasing -fwrapv -fexcess-precision=standard -Wno-deprecated-non-prototype -Wno-format-truncation -Wno-stringop-truncation -g -O2 -std=gnu17 -std=c11 -Wextra -Wall -Werror -Wno-declaration-after-statement -Wno-vla -Wno-long-long -Wmissing-variable-declarations -fPIC -DEXTVERSION=\"0.19.5\" -I. -I./ -I/nix/store/804f042cyc4dca4vwl2fmh1rhfy0sij9-postgresql-15.19/include/server -I/nix/store/804f042cyc4dca4vwl2fmh1rhfy0sij9-postgresql-15.19/include/internal -D_GNU_SOURCE -I/nix/store/5nl2zr46dic7mxcw6cvbq85wa8c2gngh-libxml2-2.15.1-dev/include/libxml2 -I/nix/store/sl10j863s32x7dv5vw6wfx1nh22f3xh2-lz4-1.10.0-dev/include -I/nix/store/di94mxmhhk390zzzv2gvavfwkgww7q6h-zstd-1.5.7-dev/include -I/nix/store/h5hfqhzcqszmsacj26hh3fngwcal04zs-icu4c-75.1-dev/include -c -o src/errors.o src/errors.c238 > gcc -Wall -Wmissing-prototypes -Wpointer-arith -Wdeclaration-after-statement -Werror=vla -Wendif-labels -Wmissing-format-attribute -Wimplicit-fallthrough=3 -Wcast-function-type -Wformat-security -fno-strict-aliasing -fwrapv -fexcess-precision=standard -Wno-deprecated-non-prototype -Wno-format-truncation -Wno-stringop-truncation -g -O2 -std=gnu17 -std=c11 -Wextra -Wall -Werror -Wno-declaration-after-statement -Wno-vla -Wno-long-long -Wmissing-variable-declarations -fPIC -DEXTVERSION=\"0.19.5\" -I. -I./ -I/nix/store/804f042cyc4dca4vwl2fmh1rhfy0sij9-postgresql-15.19/include/server -I/nix/store/804f042cyc4dca4vwl2fmh1rhfy0sij9-postgresql-15.19/include/internal -D_GNU_SOURCE -I/nix/store/5nl2zr46dic7mxcw6cvbq85wa8c2gngh-libxml2-2.15.1-dev/include/libxml2 -I/nix/store/sl10j863s32x7dv5vw6wfx1nh22f3xh2-lz4-1.10.0-dev/include -I/nix/store/di94mxmhhk390zzzv2gvavfwkgww7q6h-zstd-1.5.7-dev/include -I/nix/store/h5hfqhzcqszmsacj26hh3fngwcal04zs-icu4c-75.1-dev/include -c -o src/event.o src/event.c239 > In file included from /nix/store/wflnb8fxmq4lqx3ca91hlpv95vrqkv51-curl-8.17.0-dev/include/curl/curl.h:3333,240 > from /nix/store/wflnb8fxmq4lqx3ca91hlpv95vrqkv51-curl-8.17.0-dev/include/curl/multi.h:51,241 > from src/event.h:4,242 > from src/event.c:6:243 > /nix/store/wflnb8fxmq4lqx3ca91hlpv95vrqkv51-curl-8.17.0-dev/include/curl/multi.h:429:23: error: expected identifier or '(' before '__extension__'244 > 429 | CURL_EXTERN CURLMcode curl_multi_setopt(CURLM *multi_handle,245 > | ^~~~~~~~~~~~~~~~~246 > /nix/store/wflnb8fxmq4lqx3ca91hlpv95vrqkv51-curl-8.17.0-dev/include/curl/multi.h:429:23: error: expected identifier or '(' before ')' token247 > 429 | CURL_EXTERN CURLMcode curl_multi_setopt(CURLM *multi_handle,248 > | ^~~~~~~~~~~~~~~~~249 > make: *** [<builtin>: src/event.o] Error 1250 For full logs, run:251 nix log /nix/store/5v6a4ssacxc4snck5dzagkmqhcsh2swz-pg_net-0.19.5.drv252error: Cannot build '/nix/store/h3jfznl8xhwm8wvvxg23yj74srzz3vii-pg_net-0.19.5.drv'.253 Reason: builder failed with exit code 2.254 Output paths:255 /nix/store/yc457kag2jhvws0021nbq7nsws86glnl-pg_net-0.19.5256 Last 22 log lines:257 > Running phase: unpackPhase258 > unpacking source archive /nix/store/5zgdqy3bz93jyn79pizxc1hks0cdcadw-source259 > source root is source260 > Running phase: patchPhase261 > Running phase: updateAutotoolsGnuConfigScriptsPhase262 > Running phase: configurePhase263 > no configure script, doing nothing264 > Running phase: buildPhase265 > gcc -Wall -Wmissing-prototypes -Wpointer-arith -Wdeclaration-after-statement -Werror=vla -Wendif-labels -Wmissing-format-attribute -Wimplicit-fallthrough=3 -Wcast-function-type -Wshadow=compatible-local -Wformat-security -fno-strict-aliasing -fwrapv -fexcess-precision=standard -Wno-format-truncation -Wno-stringop-truncation -g -O2 -std=c11 -Wextra -Wall -Werror -Wno-declaration-after-statement -Wno-vla -Wno-long-long -Wmissing-variable-declarations -fPIC -fvisibility=hidden -DEXTVERSION=\"0.19.5\" -I. -I./ -I/nix/store/dj25xabr71j1mmxf628lqsn61qd5qcyk-postgresql-17.11/include/server -I/nix/store/dj25xabr71j1mmxf628lqsn61qd5qcyk-postgresql-17.11/include/internal -D_GNU_SOURCE -I/nix/store/5nl2zr46dic7mxcw6cvbq85wa8c2gngh-libxml2-2.15.1-dev/include/libxml2 -I/nix/store/sl10j863s32x7dv5vw6wfx1nh22f3xh2-lz4-1.10.0-dev/include -I/nix/store/di94mxmhhk390zzzv2gvavfwkgww7q6h-zstd-1.5.7-dev/include -I/nix/store/h5hfqhzcqszmsacj26hh3fngwcal04zs-icu4c-75.1-dev/include -c -o src/core.o src/core.c266 > gcc -Wall -Wmissing-prototypes -Wpointer-arith -Wdeclaration-after-statement -Werror=vla -Wendif-labels -Wmissing-format-attribute -Wimplicit-fallthrough=3 -Wcast-function-type -Wshadow=compatible-local -Wformat-security -fno-strict-aliasing -fwrapv -fexcess-precision=standard -Wno-format-truncation -Wno-stringop-truncation -g -O2 -std=c11 -Wextra -Wall -Werror -Wno-declaration-after-statement -Wno-vla -Wno-long-long -Wmissing-variable-declarations -fPIC -fvisibility=hidden -DEXTVERSION=\"0.19.5\" -I. -I./ -I/nix/store/dj25xabr71j1mmxf628lqsn61qd5qcyk-postgresql-17.11/include/server -I/nix/store/dj25xabr71j1mmxf628lqsn61qd5qcyk-postgresql-17.11/include/internal -D_GNU_SOURCE -I/nix/store/5nl2zr46dic7mxcw6cvbq85wa8c2gngh-libxml2-2.15.1-dev/include/libxml2 -I/nix/store/sl10j863s32x7dv5vw6wfx1nh22f3xh2-lz4-1.10.0-dev/include -I/nix/store/di94mxmhhk390zzzv2gvavfwkgww7q6h-zstd-1.5.7-dev/include -I/nix/store/h5hfqhzcqszmsacj26hh3fngwcal04zs-icu4c-75.1-dev/include -c -o src/errors.o src/errors.c267 > gcc -Wall -Wmissing-prototypes -Wpointer-arith -Wdeclaration-after-statement -Werror=vla -Wendif-labels -Wmissing-format-attribute -Wimplicit-fallthrough=3 -Wcast-function-type -Wshadow=compatible-local -Wformat-security -fno-strict-aliasing -fwrapv -fexcess-precision=standard -Wno-format-truncation -Wno-stringop-truncation -g -O2 -std=c11 -Wextra -Wall -Werror -Wno-declaration-after-statement -Wno-vla -Wno-long-long -Wmissing-variable-declarations -fPIC -fvisibility=hidden -DEXTVERSION=\"0.19.5\" -I. -I./ -I/nix/store/dj25xabr71j1mmxf628lqsn61qd5qcyk-postgresql-17.11/include/server -I/nix/store/dj25xabr71j1mmxf628lqsn61qd5qcyk-postgresql-17.11/include/internal -D_GNU_SOURCE -I/nix/store/5nl2zr46dic7mxcw6cvbq85wa8c2gngh-libxml2-2.15.1-dev/include/libxml2 -I/nix/store/sl10j863s32x7dv5vw6wfx1nh22f3xh2-lz4-1.10.0-dev/include -I/nix/store/di94mxmhhk390zzzv2gvavfwkgww7q6h-zstd-1.5.7-dev/include -I/nix/store/h5hfqhzcqszmsacj26hh3fngwcal04zs-icu4c-75.1-dev/include -c -o src/event.o src/event.c268 > In file included from /nix/store/wflnb8fxmq4lqx3ca91hlpv95vrqkv51-curl-8.17.0-dev/include/curl/curl.h:3333,269 > from /nix/store/wflnb8fxmq4lqx3ca91hlpv95vrqkv51-curl-8.17.0-dev/include/curl/multi.h:51,270 > from src/event.h:4,271 > from src/event.c:6:272 > /nix/store/wflnb8fxmq4lqx3ca91hlpv95vrqkv51-curl-8.17.0-dev/include/curl/multi.h:429:23: error: expected identifier or '(' before '__extension__'273 > 429 | CURL_EXTERN CURLMcode curl_multi_setopt(CURLM *multi_handle,274 > | ^~~~~~~~~~~~~~~~~275 > /nix/store/wflnb8fxmq4lqx3ca91hlpv95vrqkv51-curl-8.17.0-dev/include/curl/multi.h:429:23: error: expected identifier or '(' before ')' token276 > 429 | CURL_EXTERN CURLMcode curl_multi_setopt(CURLM *multi_handle,277 > | ^~~~~~~~~~~~~~~~~278 > make: *** [<builtin>: src/event.o] Error 1279 For full logs, run:280 nix log /nix/store/h3jfznl8xhwm8wvvxg23yj74srzz3vii-pg_net-0.19.5.drv281error: Cannot build '/nix/store/jvalwdcdi2ci9kcx1q2zx6hyla1sa738-pg_net-0.20.0.drv'.282 Reason: builder failed with exit code 2.283 Output paths:284 /nix/store/rqjwkm6vikims9d8b7f0a6x4n2qbkq4s-pg_net-0.20.0285 Last 22 log lines:286 > Running phase: unpackPhase287 > unpacking source archive /nix/store/3783i7yhcfqnyv5ndli22gcr11ap151m-source288 > source root is source289 > Running phase: patchPhase290 > Running phase: updateAutotoolsGnuConfigScriptsPhase291 > Running phase: configurePhase292 > no configure script, doing nothing293 > Running phase: buildPhase294 > gcc -Wall -Wmissing-prototypes -Wpointer-arith -Wdeclaration-after-statement -Werror=vla -Wendif-labels -Wmissing-format-attribute -Wimplicit-fallthrough=3 -Wcast-function-type -Wshadow=compatible-local -Wformat-security -fno-strict-aliasing -fwrapv -fexcess-precision=standard -Wno-format-truncation -Wno-stringop-truncation -g -O2 -std=c11 -Wextra -Wall -Werror -Wno-declaration-after-statement -Wno-vla -Wno-long-long -Wmissing-variable-declarations -fPIC -fvisibility=hidden -DEXTVERSION=\"0.20.0\" -I. -I./ -I/nix/store/qmc7y6nc0qxg50ywm46x4iaqq5knz702-postgresql-17_22/include/server -I/nix/store/qmc7y6nc0qxg50ywm46x4iaqq5knz702-postgresql-17_22/include/internal -D_GNU_SOURCE -I/nix/store/5nl2zr46dic7mxcw6cvbq85wa8c2gngh-libxml2-2.15.1-dev/include/libxml2 -I/nix/store/sl10j863s32x7dv5vw6wfx1nh22f3xh2-lz4-1.10.0-dev/include -I/nix/store/di94mxmhhk390zzzv2gvavfwkgww7q6h-zstd-1.5.7-dev/include -I/nix/store/h5hfqhzcqszmsacj26hh3fngwcal04zs-icu4c-75.1-dev/include -c -o src/core.o src/core.c295 > gcc -Wall -Wmissing-prototypes -Wpointer-arith -Wdeclaration-after-statement -Werror=vla -Wendif-labels -Wmissing-format-attribute -Wimplicit-fallthrough=3 -Wcast-function-type -Wshadow=compatible-local -Wformat-security -fno-strict-aliasing -fwrapv -fexcess-precision=standard -Wno-format-truncation -Wno-stringop-truncation -g -O2 -std=c11 -Wextra -Wall -Werror -Wno-declaration-after-statement -Wno-vla -Wno-long-long -Wmissing-variable-declarations -fPIC -fvisibility=hidden -DEXTVERSION=\"0.20.0\" -I. -I./ -I/nix/store/qmc7y6nc0qxg50ywm46x4iaqq5knz702-postgresql-17_22/include/server -I/nix/store/qmc7y6nc0qxg50ywm46x4iaqq5knz702-postgresql-17_22/include/internal -D_GNU_SOURCE -I/nix/store/5nl2zr46dic7mxcw6cvbq85wa8c2gngh-libxml2-2.15.1-dev/include/libxml2 -I/nix/store/sl10j863s32x7dv5vw6wfx1nh22f3xh2-lz4-1.10.0-dev/include -I/nix/store/di94mxmhhk390zzzv2gvavfwkgww7q6h-zstd-1.5.7-dev/include -I/nix/store/h5hfqhzcqszmsacj26hh3fngwcal04zs-icu4c-75.1-dev/include -c -o src/errors.o src/errors.c296 > gcc -Wall -Wmissing-prototypes -Wpointer-arith -Wdeclaration-after-statement -Werror=vla -Wendif-labels -Wmissing-format-attribute -Wimplicit-fallthrough=3 -Wcast-function-type -Wshadow=compatible-local -Wformat-security -fno-strict-aliasing -fwrapv -fexcess-precision=standard -Wno-format-truncation -Wno-stringop-truncation -g -O2 -std=c11 -Wextra -Wall -Werror -Wno-declaration-after-statement -Wno-vla -Wno-long-long -Wmissing-variable-declarations -fPIC -fvisibility=hidden -DEXTVERSION=\"0.20.0\" -I. -I./ -I/nix/store/qmc7y6nc0qxg50ywm46x4iaqq5knz702-postgresql-17_22/include/server -I/nix/store/qmc7y6nc0qxg50ywm46x4iaqq5knz702-postgresql-17_22/include/internal -D_GNU_SOURCE -I/nix/store/5nl2zr46dic7mxcw6cvbq85wa8c2gngh-libxml2-2.15.1-dev/include/libxml2 -I/nix/store/sl10j863s32x7dv5vw6wfx1nh22f3xh2-lz4-1.10.0-dev/include -I/nix/store/di94mxmhhk390zzzv2gvavfwkgww7q6h-zstd-1.5.7-dev/include -I/nix/store/h5hfqhzcqszmsacj26hh3fngwcal04zs-icu4c-75.1-dev/include -c -o src/event.o src/event.c297 > In file included from /nix/store/wflnb8fxmq4lqx3ca91hlpv95vrqkv51-curl-8.17.0-dev/include/curl/curl.h:3333,298 > from /nix/store/wflnb8fxmq4lqx3ca91hlpv95vrqkv51-curl-8.17.0-dev/include/curl/multi.h:51,299 > from src/event.h:4,300 > from src/event.c:6:301 > /nix/store/wflnb8fxmq4lqx3ca91hlpv95vrqkv51-curl-8.17.0-dev/include/curl/multi.h:429:23: error: expected identifier or '(' before '__extension__'302 > 429 | CURL_EXTERN CURLMcode curl_multi_setopt(CURLM *multi_handle,303 > | ^~~~~~~~~~~~~~~~~304 > /nix/store/wflnb8fxmq4lqx3ca91hlpv95vrqkv51-curl-8.17.0-dev/include/curl/multi.h:429:23: error: expected identifier or '(' before ')' token305 > 429 | CURL_EXTERN CURLMcode curl_multi_setopt(CURLM *multi_handle,306 > | ^~~~~~~~~~~~~~~~~307 > make: *** [<builtin>: src/event.o] Error 1308 For full logs, run:309 nix log /nix/store/jvalwdcdi2ci9kcx1q2zx6hyla1sa738-pg_net-0.20.0.drv310error: Cannot build '/nix/store/hfwkzpr1kplwaywhvayqm6j4gsva8n5n-pg_net-0.20.0.drv'.311 Reason: builder failed with exit code 2.312 Output paths:313 /nix/store/scsfkgabhfzpzf64a6cgvkx2zglb6vji-pg_net-0.20.0314 Last 22 log lines:315 > Running phase: unpackPhase316 > unpacking source archive /nix/store/3783i7yhcfqnyv5ndli22gcr11ap151m-source317 > source root is source318 > Running phase: patchPhase319 > Running phase: updateAutotoolsGnuConfigScriptsPhase320 > Running phase: configurePhase321 > no configure script, doing nothing322 > Running phase: buildPhase323 > gcc -Wall -Wmissing-prototypes -Wpointer-arith -Wdeclaration-after-statement -Werror=vla -Wendif-labels -Wmissing-format-attribute -Wimplicit-fallthrough=3 -Wcast-function-type -Wformat-security -fno-strict-aliasing -fwrapv -fexcess-precision=standard -Wno-deprecated-non-prototype -Wno-format-truncation -Wno-stringop-truncation -g -O2 -std=gnu17 -std=c11 -Wextra -Wall -Werror -Wno-declaration-after-statement -Wno-vla -Wno-long-long -Wmissing-variable-declarations -fPIC -DEXTVERSION=\"0.20.0\" -I. -I./ -I/nix/store/804f042cyc4dca4vwl2fmh1rhfy0sij9-postgresql-15.19/include/server -I/nix/store/804f042cyc4dca4vwl2fmh1rhfy0sij9-postgresql-15.19/include/internal -D_GNU_SOURCE -I/nix/store/5nl2zr46dic7mxcw6cvbq85wa8c2gngh-libxml2-2.15.1-dev/include/libxml2 -I/nix/store/sl10j863s32x7dv5vw6wfx1nh22f3xh2-lz4-1.10.0-dev/include -I/nix/store/di94mxmhhk390zzzv2gvavfwkgww7q6h-zstd-1.5.7-dev/include -I/nix/store/h5hfqhzcqszmsacj26hh3fngwcal04zs-icu4c-75.1-dev/include -c -o src/core.o src/core.c324 > gcc -Wall -Wmissing-prototypes -Wpointer-arith -Wdeclaration-after-statement -Werror=vla -Wendif-labels -Wmissing-format-attribute -Wimplicit-fallthrough=3 -Wcast-function-type -Wformat-security -fno-strict-aliasing -fwrapv -fexcess-precision=standard -Wno-deprecated-non-prototype -Wno-format-truncation -Wno-stringop-truncation -g -O2 -std=gnu17 -std=c11 -Wextra -Wall -Werror -Wno-declaration-after-statement -Wno-vla -Wno-long-long -Wmissing-variable-declarations -fPIC -DEXTVERSION=\"0.20.0\" -I. -I./ -I/nix/store/804f042cyc4dca4vwl2fmh1rhfy0sij9-postgresql-15.19/include/server -I/nix/store/804f042cyc4dca4vwl2fmh1rhfy0sij9-postgresql-15.19/include/internal -D_GNU_SOURCE -I/nix/store/5nl2zr46dic7mxcw6cvbq85wa8c2gngh-libxml2-2.15.1-dev/include/libxml2 -I/nix/store/sl10j863s32x7dv5vw6wfx1nh22f3xh2-lz4-1.10.0-dev/include -I/nix/store/di94mxmhhk390zzzv2gvavfwkgww7q6h-zstd-1.5.7-dev/include -I/nix/store/h5hfqhzcqszmsacj26hh3fngwcal04zs-icu4c-75.1-dev/include -c -o src/errors.o src/errors.c325 > gcc -Wall -Wmissing-prototypes -Wpointer-arith -Wdeclaration-after-statement -Werror=vla -Wendif-labels -Wmissing-format-attribute -Wimplicit-fallthrough=3 -Wcast-function-type -Wformat-security -fno-strict-aliasing -fwrapv -fexcess-precision=standard -Wno-deprecated-non-prototype -Wno-format-truncation -Wno-stringop-truncation -g -O2 -std=gnu17 -std=c11 -Wextra -Wall -Werror -Wno-declaration-after-statement -Wno-vla -Wno-long-long -Wmissing-variable-declarations -fPIC -DEXTVERSION=\"0.20.0\" -I. -I./ -I/nix/store/804f042cyc4dca4vwl2fmh1rhfy0sij9-postgresql-15.19/include/server -I/nix/store/804f042cyc4dca4vwl2fmh1rhfy0sij9-postgresql-15.19/include/internal -D_GNU_SOURCE -I/nix/store/5nl2zr46dic7mxcw6cvbq85wa8c2gngh-libxml2-2.15.1-dev/include/libxml2 -I/nix/store/sl10j863s32x7dv5vw6wfx1nh22f3xh2-lz4-1.10.0-dev/include -I/nix/store/di94mxmhhk390zzzv2gvavfwkgww7q6h-zstd-1.5.7-dev/include -I/nix/store/h5hfqhzcqszmsacj26hh3fngwcal04zs-icu4c-75.1-dev/include -c -o src/event.o src/event.c326 > In file included from /nix/store/wflnb8fxmq4lqx3ca91hlpv95vrqkv51-curl-8.17.0-dev/include/curl/curl.h:3333,327 > from /nix/store/wflnb8fxmq4lqx3ca91hlpv95vrqkv51-curl-8.17.0-dev/include/curl/multi.h:51,328 > from src/event.h:4,329 > from src/event.c:6:330 > /nix/store/wflnb8fxmq4lqx3ca91hlpv95vrqkv51-curl-8.17.0-dev/include/curl/multi.h:429:23: error: expected identifier or '(' before '__extension__'331 > 429 | CURL_EXTERN CURLMcode curl_multi_setopt(CURLM *multi_handle,332 > | ^~~~~~~~~~~~~~~~~333 > /nix/store/wflnb8fxmq4lqx3ca91hlpv95vrqkv51-curl-8.17.0-dev/include/curl/multi.h:429:23: error: expected identifier or '(' before ')' token334 > 429 | CURL_EXTERN CURLMcode curl_multi_setopt(CURLM *multi_handle,335 > | ^~~~~~~~~~~~~~~~~336 > make: *** [<builtin>: src/event.o] Error 1337 For full logs, run:338 nix log /nix/store/hfwkzpr1kplwaywhvayqm6j4gsva8n5n-pg_net-0.20.0.drv339error: Cannot build '/nix/store/ky7414m088qm5h8xn9z7xzw0k08wgcrh-pg_net-0.20.0.drv'.340 Reason: builder failed with exit code 2.341 Output paths:342 /nix/store/div76hg9lzzwipcrl72qfbl1vaps6bqr-pg_net-0.20.0343 Last 22 log lines:344 > Running phase: unpackPhase345 > unpacking source archive /nix/store/3783i7yhcfqnyv5ndli22gcr11ap151m-source346 > source root is source347 > Running phase: patchPhase348 > Running phase: updateAutotoolsGnuConfigScriptsPhase349 > Running phase: configurePhase350 > no configure script, doing nothing351 > Running phase: buildPhase352 > gcc -Wall -Wmissing-prototypes -Wpointer-arith -Wdeclaration-after-statement -Werror=vla -Wendif-labels -Wmissing-format-attribute -Wimplicit-fallthrough=3 -Wcast-function-type -Wshadow=compatible-local -Wformat-security -fno-strict-aliasing -fwrapv -fexcess-precision=standard -Wno-format-truncation -Wno-stringop-truncation -g -O2 -std=c11 -Wextra -Wall -Werror -Wno-declaration-after-statement -Wno-vla -Wno-long-long -Wmissing-variable-declarations -fPIC -fvisibility=hidden -DEXTVERSION=\"0.20.0\" -I. -I./ -I/nix/store/dj25xabr71j1mmxf628lqsn61qd5qcyk-postgresql-17.11/include/server -I/nix/store/dj25xabr71j1mmxf628lqsn61qd5qcyk-postgresql-17.11/include/internal -D_GNU_SOURCE -I/nix/store/5nl2zr46dic7mxcw6cvbq85wa8c2gngh-libxml2-2.15.1-dev/include/libxml2 -I/nix/store/sl10j863s32x7dv5vw6wfx1nh22f3xh2-lz4-1.10.0-dev/include -I/nix/store/di94mxmhhk390zzzv2gvavfwkgww7q6h-zstd-1.5.7-dev/include -I/nix/store/h5hfqhzcqszmsacj26hh3fngwcal04zs-icu4c-75.1-dev/include -c -o src/core.o src/core.c353 > gcc -Wall -Wmissing-prototypes -Wpointer-arith -Wdeclaration-after-statement -Werror=vla -Wendif-labels -Wmissing-format-attribute -Wimplicit-fallthrough=3 -Wcast-function-type -Wshadow=compatible-local -Wformat-security -fno-strict-aliasing -fwrapv -fexcess-precision=standard -Wno-format-truncation -Wno-stringop-truncation -g -O2 -std=c11 -Wextra -Wall -Werror -Wno-declaration-after-statement -Wno-vla -Wno-long-long -Wmissing-variable-declarations -fPIC -fvisibility=hidden -DEXTVERSION=\"0.20.0\" -I. -I./ -I/nix/store/dj25xabr71j1mmxf628lqsn61qd5qcyk-postgresql-17.11/include/server -I/nix/store/dj25xabr71j1mmxf628lqsn61qd5qcyk-postgresql-17.11/include/internal -D_GNU_SOURCE -I/nix/store/5nl2zr46dic7mxcw6cvbq85wa8c2gngh-libxml2-2.15.1-dev/include/libxml2 -I/nix/store/sl10j863s32x7dv5vw6wfx1nh22f3xh2-lz4-1.10.0-dev/include -I/nix/store/di94mxmhhk390zzzv2gvavfwkgww7q6h-zstd-1.5.7-dev/include -I/nix/store/h5hfqhzcqszmsacj26hh3fngwcal04zs-icu4c-75.1-dev/include -c -o src/errors.o src/errors.c354 > gcc -Wall -Wmissing-prototypes -Wpointer-arith -Wdeclaration-after-statement -Werror=vla -Wendif-labels -Wmissing-format-attribute -Wimplicit-fallthrough=3 -Wcast-function-type -Wshadow=compatible-local -Wformat-security -fno-strict-aliasing -fwrapv -fexcess-precision=standard -Wno-format-truncation -Wno-stringop-truncation -g -O2 -std=c11 -Wextra -Wall -Werror -Wno-declaration-after-statement -Wno-vla -Wno-long-long -Wmissing-variable-declarations -fPIC -fvisibility=hidden -DEXTVERSION=\"0.20.0\" -I. -I./ -I/nix/store/dj25xabr71j1mmxf628lqsn61qd5qcyk-postgresql-17.11/include/server -I/nix/store/dj25xabr71j1mmxf628lqsn61qd5qcyk-postgresql-17.11/include/internal -D_GNU_SOURCE -I/nix/store/5nl2zr46dic7mxcw6cvbq85wa8c2gngh-libxml2-2.15.1-dev/include/libxml2 -I/nix/store/sl10j863s32x7dv5vw6wfx1nh22f3xh2-lz4-1.10.0-dev/include -I/nix/store/di94mxmhhk390zzzv2gvavfwkgww7q6h-zstd-1.5.7-dev/include -I/nix/store/h5hfqhzcqszmsacj26hh3fngwcal04zs-icu4c-75.1-dev/include -c -o src/event.o src/event.c355 > In file included from /nix/store/wflnb8fxmq4lqx3ca91hlpv95vrqkv51-curl-8.17.0-dev/include/curl/curl.h:3333,356 > from /nix/store/wflnb8fxmq4lqx3ca91hlpv95vrqkv51-curl-8.17.0-dev/include/curl/multi.h:51,357 > from src/event.h:4,358 > from src/event.c:6:359 > /nix/store/wflnb8fxmq4lqx3ca91hlpv95vrqkv51-curl-8.17.0-dev/include/curl/multi.h:429:23: error: expected identifier or '(' before '__extension__'360 > 429 | CURL_EXTERN CURLMcode curl_multi_setopt(CURLM *multi_handle,361 > | ^~~~~~~~~~~~~~~~~362 > /nix/store/wflnb8fxmq4lqx3ca91hlpv95vrqkv51-curl-8.17.0-dev/include/curl/multi.h:429:23: error: expected identifier or '(' before ')' token363 > 429 | CURL_EXTERN CURLMcode curl_multi_setopt(CURLM *multi_handle,364 > | ^~~~~~~~~~~~~~~~~365 > make: *** [<builtin>: src/event.o] Error 1366 For full logs, run:367 nix log /nix/store/ky7414m088qm5h8xn9z7xzw0k08wgcrh-pg_net-0.20.0.drv368error: Cannot build '/nix/store/cqdc5q7n6g9pkxy0cjcvkq185rps4bfd-pg_net.drv'.369 Reason: 4 dependencies failed.370 Output paths:371 /nix/store/4sc9iw7bqgw1y6834l2h4w200hvc8b79-pg_net372error: Cannot build '/nix/store/d5s4s970iizz6a8w5ndnpzyw63w1m1qv-postgresql-and-plugins-17.11.drv'.373 Reason: 1 dependency failed.374 Output paths:375 /nix/store/dlsqc392rqmvj64617g73zcbvclgch0b-postgresql-and-plugins-17.11376error: Cannot build '/nix/store/7hla3p20yajypj5w3hnrx38bc3kq14vq-postgresql-and-plugins-17.11.drv'.377 Reason: 1 dependency failed.378 Output paths:379 /nix/store/j9fc5s30v77k7ycb6icimvdhkb7ss17i-postgresql-and-plugins-17.11380error: Cannot build '/nix/store/v7i610b6q10zpsd2536yvba9pd2xqrr6-pg_net-0.19.5.drv'.381 Reason: builder failed with exit code 2.382 Output paths:383 /nix/store/pzmf3gl6j9iwmkqjfvwvsb11fh4i1rz2-pg_net-0.19.5384 Last 22 log lines:385 > Running phase: unpackPhase386 > unpacking source archive /nix/store/5zgdqy3bz93jyn79pizxc1hks0cdcadw-source387 > source root is source388 > Running phase: patchPhase389 > Running phase: updateAutotoolsGnuConfigScriptsPhase390 > Running phase: configurePhase391 > no configure script, doing nothing392 > Running phase: buildPhase393 > gcc -Wall -Wmissing-prototypes -Wpointer-arith -Wdeclaration-after-statement -Werror=vla -Wendif-labels -Wmissing-format-attribute -Wimplicit-fallthrough=3 -Wcast-function-type -Wshadow=compatible-local -Wformat-security -fno-strict-aliasing -fwrapv -fexcess-precision=standard -Wno-format-truncation -Wno-stringop-truncation -g -O2 -std=c11 -Wextra -Wall -Werror -Wno-declaration-after-statement -Wno-vla -Wno-long-long -Wmissing-variable-declarations -fPIC -fvisibility=hidden -DEXTVERSION=\"0.19.5\" -I. -I./ -I/nix/store/qmc7y6nc0qxg50ywm46x4iaqq5knz702-postgresql-17_22/include/server -I/nix/store/qmc7y6nc0qxg50ywm46x4iaqq5knz702-postgresql-17_22/include/internal -D_GNU_SOURCE -I/nix/store/5nl2zr46dic7mxcw6cvbq85wa8c2gngh-libxml2-2.15.1-dev/include/libxml2 -I/nix/store/sl10j863s32x7dv5vw6wfx1nh22f3xh2-lz4-1.10.0-dev/include -I/nix/store/di94mxmhhk390zzzv2gvavfwkgww7q6h-zstd-1.5.7-dev/include -I/nix/store/h5hfqhzcqszmsacj26hh3fngwcal04zs-icu4c-75.1-dev/include -c -o src/core.o src/core.c394 > gcc -Wall -Wmissing-prototypes -Wpointer-arith -Wdeclaration-after-statement -Werror=vla -Wendif-labels -Wmissing-format-attribute -Wimplicit-fallthrough=3 -Wcast-function-type -Wshadow=compatible-local -Wformat-security -fno-strict-aliasing -fwrapv -fexcess-precision=standard -Wno-format-truncation -Wno-stringop-truncation -g -O2 -std=c11 -Wextra -Wall -Werror -Wno-declaration-after-statement -Wno-vla -Wno-long-long -Wmissing-variable-declarations -fPIC -fvisibility=hidden -DEXTVERSION=\"0.19.5\" -I. -I./ -I/nix/store/qmc7y6nc0qxg50ywm46x4iaqq5knz702-postgresql-17_22/include/server -I/nix/store/qmc7y6nc0qxg50ywm46x4iaqq5knz702-postgresql-17_22/include/internal -D_GNU_SOURCE -I/nix/store/5nl2zr46dic7mxcw6cvbq85wa8c2gngh-libxml2-2.15.1-dev/include/libxml2 -I/nix/store/sl10j863s32x7dv5vw6wfx1nh22f3xh2-lz4-1.10.0-dev/include -I/nix/store/di94mxmhhk390zzzv2gvavfwkgww7q6h-zstd-1.5.7-dev/include -I/nix/store/h5hfqhzcqszmsacj26hh3fngwcal04zs-icu4c-75.1-dev/include -c -o src/errors.o src/errors.c395 > gcc -Wall -Wmissing-prototypes -Wpointer-arith -Wdeclaration-after-statement -Werror=vla -Wendif-labels -Wmissing-format-attribute -Wimplicit-fallthrough=3 -Wcast-function-type -Wshadow=compatible-local -Wformat-security -fno-strict-aliasing -fwrapv -fexcess-precision=standard -Wno-format-truncation -Wno-stringop-truncation -g -O2 -std=c11 -Wextra -Wall -Werror -Wno-declaration-after-statement -Wno-vla -Wno-long-long -Wmissing-variable-declarations -fPIC -fvisibility=hidden -DEXTVERSION=\"0.19.5\" -I. -I./ -I/nix/store/qmc7y6nc0qxg50ywm46x4iaqq5knz702-postgresql-17_22/include/server -I/nix/store/qmc7y6nc0qxg50ywm46x4iaqq5knz702-postgresql-17_22/include/internal -D_GNU_SOURCE -I/nix/store/5nl2zr46dic7mxcw6cvbq85wa8c2gngh-libxml2-2.15.1-dev/include/libxml2 -I/nix/store/sl10j863s32x7dv5vw6wfx1nh22f3xh2-lz4-1.10.0-dev/include -I/nix/store/di94mxmhhk390zzzv2gvavfwkgww7q6h-zstd-1.5.7-dev/include -I/nix/store/h5hfqhzcqszmsacj26hh3fngwcal04zs-icu4c-75.1-dev/include -c -o src/event.o src/event.c396 > In file included from /nix/store/wflnb8fxmq4lqx3ca91hlpv95vrqkv51-curl-8.17.0-dev/include/curl/curl.h:3333,397 > from /nix/store/wflnb8fxmq4lqx3ca91hlpv95vrqkv51-curl-8.17.0-dev/include/curl/multi.h:51,398 > from src/event.h:4,399 > from src/event.c:6:400 > /nix/store/wflnb8fxmq4lqx3ca91hlpv95vrqkv51-curl-8.17.0-dev/include/curl/multi.h:429:23: error: expected identifier or '(' before '__extension__'401 > 429 | CURL_EXTERN CURLMcode curl_multi_setopt(CURLM *multi_handle,402 > | ^~~~~~~~~~~~~~~~~403 > /nix/store/wflnb8fxmq4lqx3ca91hlpv95vrqkv51-curl-8.17.0-dev/include/curl/multi.h:429:23: error: expected identifier or '(' before ')' token404 > 429 | CURL_EXTERN CURLMcode curl_multi_setopt(CURLM *multi_handle,405 > | ^~~~~~~~~~~~~~~~~406 > make: *** [<builtin>: src/event.o] Error 1407 For full logs, run:408 nix log /nix/store/v7i610b6q10zpsd2536yvba9pd2xqrr6-pg_net-0.19.5.drv409error: Cannot build '/nix/store/bv2b3hyfiwg59frhybs6cmf9l26byfrs-pg_net-0.13.0.drv'.410 Reason: builder failed with exit code 2.411 Output paths:412 /nix/store/78qw5358gp449syn03ah921j442fw14j-pg_net-0.13.0413 Last 25 log lines:414 > | ^~~~~~~~~~~~~~415 > src/util.h:6:11: warning: call to 'Wcurl_easy_setopt_err_long' declared with attribute warning: curl_easy_setopt expects a long argument [-Wattribute-warning]416 > 6 | if (curl_easy_setopt(hdl, opt, prm) != CURLE_OK) \417 > | ^~~~~~~~~~~~~~~~418 > src/core.c:108:3: note: in expansion of macro 'CURL_EZ_SETOPT'419 > 108 | CURL_EZ_SETOPT(curl_ez_handle, CURLOPT_TIMEOUT_MS, timeout_milliseconds);420 > | ^~~~~~~~~~~~~~421 > src/util.h:6:11: warning: call to 'Wcurl_easy_setopt_err_long' declared with attribute warning: curl_easy_setopt expects a long argument [-Wattribute-warning]422 > 6 | if (curl_easy_setopt(hdl, opt, prm) != CURLE_OK) \423 > | ^~~~~~~~~~~~~~~~424 > src/core.c:110:3: note: in expansion of macro 'CURL_EZ_SETOPT'425 > 110 | CURL_EZ_SETOPT(curl_ez_handle, CURLOPT_FOLLOWLOCATION, true);426 > | ^~~~~~~~~~~~~~427 > gcc -Wall -Wmissing-prototypes -Wpointer-arith -Wdeclaration-after-statement -Werror=vla -Wendif-labels -Wmissing-format-attribute -Wimplicit-fallthrough=3 -Wcast-function-type -Wshadow=compatible-local -Wformat-security -fno-strict-aliasing -fwrapv -fexcess-precision=standard -Wno-format-truncation -Wno-stringop-truncation -g -O2 -std=c11 -Werror -Wno-declaration-after-statement -fPIC -fvisibility=hidden -DEXTVERSION=\"0.13.0\" -I. -I./ -I/nix/store/qmc7y6nc0qxg50ywm46x4iaqq5knz702-postgresql-17_22/include/server -I/nix/store/qmc7y6nc0qxg50ywm46x4iaqq5knz702-postgresql-17_22/include/internal -D_GNU_SOURCE -I/nix/store/5nl2zr46dic7mxcw6cvbq85wa8c2gngh-libxml2-2.15.1-dev/include/libxml2 -I/nix/store/sl10j863s32x7dv5vw6wfx1nh22f3xh2-lz4-1.10.0-dev/include -I/nix/store/di94mxmhhk390zzzv2gvavfwkgww7q6h-zstd-1.5.7-dev/include -I/nix/store/h5hfqhzcqszmsacj26hh3fngwcal04zs-icu4c-75.1-dev/include -c -o src/event.o src/event.c428 > In file included from /nix/store/wflnb8fxmq4lqx3ca91hlpv95vrqkv51-curl-8.17.0-dev/include/curl/curl.h:3333,429 > from /nix/store/wflnb8fxmq4lqx3ca91hlpv95vrqkv51-curl-8.17.0-dev/include/curl/multi.h:51,430 > from src/event.h:4,431 > from src/event.c:6:432 > /nix/store/wflnb8fxmq4lqx3ca91hlpv95vrqkv51-curl-8.17.0-dev/include/curl/multi.h:429:23: error: expected identifier or '(' before '__extension__'433 > 429 | CURL_EXTERN CURLMcode curl_multi_setopt(CURLM *multi_handle,434 > | ^~~~~~~~~~~~~~~~~435 > /nix/store/wflnb8fxmq4lqx3ca91hlpv95vrqkv51-curl-8.17.0-dev/include/curl/multi.h:429:23: error: expected identifier or '(' before ')' token436 > 429 | CURL_EXTERN CURLMcode curl_multi_setopt(CURLM *multi_handle,437 > | ^~~~~~~~~~~~~~~~~438 > make: *** [<builtin>: src/event.o] Error 1439 For full logs, run:440 nix log /nix/store/bv2b3hyfiwg59frhybs6cmf9l26byfrs-pg_net-0.13.0.drv441error: Cannot build '/nix/store/zd0hg58y5nwnnwfzy7sd19l7dzx4zvv5-pg_net.drv'.442 Reason: 4 dependencies failed.443 Output paths:444 /nix/store/5j8is0c6fp325l5akxcq6digg430r2fy-pg_net445error: Cannot build '/nix/store/m7073j3kxn6vxs53jdm448q51cxiimys-postgresql-and-plugins-17_22.drv'.446 Reason: 1 dependency failed.447 Output paths:448 /nix/store/z04smpdjsr0zxxl7phxyvwwh4ycfq6c5-postgresql-and-plugins-17_22449error: Cannot build '/nix/store/q8qv7gf9izi4my9mjapggg0fx2dhzlwc-postgresql-and-plugins-17_22.drv'.450 Reason: 1 dependency failed.451 Output paths:452 /nix/store/y845ymwkrl6d1g0swpxgxwk72nyclj1s-postgresql-and-plugins-17_22453error: Cannot build '/nix/store/ggfg6al5fkdp0r1jsc3iabgz0p7g6l1m-pg_net-0.7.drv'.454 Reason: builder failed with exit code 2.455 Output paths:456 /nix/store/pkfapf0li10b8b6nrhwm8880g4d2i8y5-pg_net-0.7457 Last 25 log lines:458 > | ^~~~~~~~~~~~~~459 > src/util.h:6:11: warning: call to 'Wcurl_easy_setopt_err_long' declared with attribute warning: curl_easy_setopt expects a long argument [-Wattribute-warning]460 > 6 | if (curl_easy_setopt(hdl, opt, prm) != CURLE_OK) \461 > | ^~~~~~~~~~~~~~~~462 > src/core.c:108:3: note: in expansion of macro 'CURL_EZ_SETOPT'463 > 108 | CURL_EZ_SETOPT(curl_ez_handle, CURLOPT_TIMEOUT_MS, timeout_milliseconds);464 > | ^~~~~~~~~~~~~~465 > src/util.h:6:11: warning: call to 'Wcurl_easy_setopt_err_long' declared with attribute warning: curl_easy_setopt expects a long argument [-Wattribute-warning]466 > 6 | if (curl_easy_setopt(hdl, opt, prm) != CURLE_OK) \467 > | ^~~~~~~~~~~~~~~~468 > src/core.c:110:3: note: in expansion of macro 'CURL_EZ_SETOPT'469 > 110 | CURL_EZ_SETOPT(curl_ez_handle, CURLOPT_FOLLOWLOCATION, true);470 > | ^~~~~~~~~~~~~~471 > gcc -Wall -Wmissing-prototypes -Wpointer-arith -Wdeclaration-after-statement -Werror=vla -Wendif-labels -Wmissing-format-attribute -Wimplicit-fallthrough=3 -Wcast-function-type -Wformat-security -fno-strict-aliasing -fwrapv -fexcess-precision=standard -Wno-deprecated-non-prototype -Wno-format-truncation -Wno-stringop-truncation -g -O2 -std=gnu17 -std=c11 -Werror -Wno-declaration-after-statement -fPIC -DEXTVERSION=\"0.13.0\" -I. -I./ -I/nix/store/804f042cyc4dca4vwl2fmh1rhfy0sij9-postgresql-15.19/include/server -I/nix/store/804f042cyc4dca4vwl2fmh1rhfy0sij9-postgresql-15.19/include/internal -D_GNU_SOURCE -I/nix/store/5nl2zr46dic7mxcw6cvbq85wa8c2gngh-libxml2-2.15.1-dev/include/libxml2 -I/nix/store/sl10j863s32x7dv5vw6wfx1nh22f3xh2-lz4-1.10.0-dev/include -I/nix/store/di94mxmhhk390zzzv2gvavfwkgww7q6h-zstd-1.5.7-dev/include -I/nix/store/h5hfqhzcqszmsacj26hh3fngwcal04zs-icu4c-75.1-dev/include -c -o src/event.o src/event.c472 > In file included from /nix/store/wflnb8fxmq4lqx3ca91hlpv95vrqkv51-curl-8.17.0-dev/include/curl/curl.h:3333,473 > from /nix/store/wflnb8fxmq4lqx3ca91hlpv95vrqkv51-curl-8.17.0-dev/include/curl/multi.h:51,474 > from src/event.h:4,475 > from src/event.c:6:476 > /nix/store/wflnb8fxmq4lqx3ca91hlpv95vrqkv51-curl-8.17.0-dev/include/curl/multi.h:429:23: error: expected identifier or '(' before '__extension__'477 > 429 | CURL_EXTERN CURLMcode curl_multi_setopt(CURLM *multi_handle,478 > | ^~~~~~~~~~~~~~~~~479 > /nix/store/wflnb8fxmq4lqx3ca91hlpv95vrqkv51-curl-8.17.0-dev/include/curl/multi.h:429:23: error: expected identifier or '(' before ')' token480 > 429 | CURL_EXTERN CURLMcode curl_multi_setopt(CURLM *multi_handle,481 > | ^~~~~~~~~~~~~~~~~482 > make: *** [<builtin>: src/event.o] Error 1483 For full logs, run:484 nix log /nix/store/ggfg6al5fkdp0r1jsc3iabgz0p7g6l1m-pg_net-0.7.drv485error: Cannot build '/nix/store/94hi7qqfg86lfxqnyqizx334my0yjbh3-pg_net.drv'.486 Reason: 5 dependencies failed.487 Output paths:488 /nix/store/88g5knkc68im4z0plvckvdf0ag9pl97y-pg_net489error: Cannot build '/nix/store/a5gfyj0k47cxv70v4a1zhhk1998vd290-postgresql-and-plugins-15.19.drv'.490 Reason: 1 dependency failed.491 Output paths:492 /nix/store/zn5pxdcd7zf2nviqxmbqb3whv0b89njc-postgresql-and-plugins-15.19493error: Cannot build '/nix/store/69zc44dp9979jf4p9hcpgfdf1wgpw40l-postgresql-and-plugins-15.19.drv'.494 Reason: 1 dependency failed.495 Output paths:496 /nix/store/hhm9gzfpx0h3lp8ld4wvl64kwnddl1yd-postgresql-and-plugins-15.19497error: Cannot build '/nix/store/78dxmxknxafy8xgdswvqh5976pnyfmj3-start-postgres-server-test.drv'.498 Reason: 3 dependencies failed.499 Output paths:500 /nix/store/xvccic04hgvhpa1l6icvkhrc2zgw17k4-start-postgres-server-test501error: Cannot build '/nix/store/44kjn34pf0m8jpv21pzvmg6ga88dnns8-postgres-15-check-harness.drv'.502 Reason: 2 dependencies failed.503 Output paths:504 /nix/store/443azn3q3rpmkj6qfb08rhxic5mm4pn4-postgres-15-check-harness505error: Cannot build '/nix/store/i6jq4167z79adj5i91r8dlgxp6bi5yal-run-check-harness-psql-15.drv'.506 Reason: 1 dependency failed.507 Output paths:508 /nix/store/kbdsdf2kjlrmbn4m3216m61qz1q7pi1m-run-check-harness-psql-15