setup
checks.x86_64-linux.ext-timescaledb
· build #133
· raw
1these 57 derivations will be built:2 /nix/store/43hrszb68idmxn0cyb83axyaiv1rlrh9-pg_stat_monitor.drv3 /nix/store/5ym865yyw3zws7gm6xnncdb2715wa2h4-supabase_vault.drv4 /nix/store/6xiqjskc06w7z35k5pacs4276hqawiww-timescaledb.drv5 /nix/store/76skdlc74q1hgpkqqj7zk9fsm4wh4hl5-pgrouting.drv6 /nix/store/5v6a4ssacxc4snck5dzagkmqhcsh2swz-pg_net-0.19.5.drv7 /nix/store/7b5ar71808xp6cc9vi64vcr3gxhaq9w2-pg_net-0.14.0.drv8 /nix/store/82vkrfmb1h23wpf7jvwwb1r82vfiqb7w-pg_net-0.8.0.drv9 /nix/store/fs82kzwwqc58qma6aiyaljkngq7g3y4z-pg_net-0.20.3.drv10 /nix/store/ggfg6al5fkdp0r1jsc3iabgz0p7g6l1m-pg_net-0.7.drv11 /nix/store/hfwkzpr1kplwaywhvayqm6j4gsva8n5n-pg_net-0.20.0.drv12 /nix/store/nf025wlsx99h5f5yjmkj9wrj54ifbzad-pg_net-0.7.1.drv13 /nix/store/ymx9gp4jhvd7qpjvk95vw2m6ycb0jal7-pg_net-0.13.0.drv14 /nix/store/94hi7qqfg86lfxqnyqizx334my0yjbh3-pg_net.drv15 /nix/store/a1v4diwd4c9632zv93sjh9ab3b042mnr-pg_hashids.drv16 /nix/store/aimjdqqfyl4laxlkpc6gfnyvlsbxlvcv-pg_repack.drv17 /nix/store/az25v409jh9k6133nsy8i8brvfc21nw5-pg_graphql.drv18 /nix/store/b8z393jnpighs0xp0wn572slxhxhwnxp-pg_partman.drv19 /nix/store/cqki7rv2w3vxrsajqy279mhm5wa88fjp-wal2json.drv20 /nix/store/h5q13dsfp2bfp3ydgj9vdnx6fmnyfl2z-hypopg.drv21 /nix/store/ixv7i4skcbnzgym04khdnvkqa513ld45-plan_filter.drv22 /nix/store/j06p7y4xc647bfzs8ba58rf9h0ilbz44-pgmq.drv23 /nix/store/jrggalwa5kfhzqhcip8f5g1f584pazw5-plpgsql_check.drv24 /nix/store/l4slq9wyfag2892w5zrycrzy3z7kpv2p-pgaudit.drv25 /nix/store/lzgjq8v4l4vm5lwyxkllg0ii0n1vvam6-http.drv26 /nix/store/pjhzv6b54gh758msf91ibg3aggs5v63y-safeupdate.drv27 /nix/store/pwyqyi1k7a59b2jnwr875426synr7qmi-pg_cron.drv28 /nix/store/qfh9m6hmvdh3axd43qraz43rrjs2pjzr-pgsodium.drv29 /nix/store/qvw78yhywxdh6c8gky9qmdaxwka0hkyg-pgroonga.drv30 /nix/store/rcl303fv0rxrbkgjcwqi92h8hlsksl86-plv8.drv31 /nix/store/v38577cf27cjada1fbai6jc2gqc1yqg9-pg_jsonschema.drv32 /nix/store/w76pb8iwp6gmij6ng0xyxbdwpyp31gjx-vector.drv33 /nix/store/w8w3j8l9i3fwp8lvrddpz6szlbsz1b80-wrappers.drv34 /nix/store/wby05b23yks4smfxxdngav8mxnv4pvvi-index_advisor.drv35 /nix/store/x1gi2mwklg858vqaswbqasg3gnzfclyk-pgtap.drv36 /nix/store/ypgp6sck1rcalskz253f3a3g2vg8dqxn-postgis.drv37 /nix/store/zpy0anvh5rgr1fnrs39j7db1j07adpip-rum.drv38 /nix/store/a5gfyj0k47cxv70v4a1zhhk1998vd290-postgresql-and-plugins-15.19.drv39 /nix/store/69zc44dp9979jf4p9hcpgfdf1wgpw40l-postgresql-and-plugins-15.19.drv40 /nix/store/sn90bhb87fs1r7szfvpnhakcf5cbqipi-system-path.drv41 /nix/store/rnjj94ch4qaxpyhgvk900hq1rp2ji4cx-dbus-1.drv42 /nix/store/bj8k3q4xx5yxsjpcz0k6pjkann65ifyp-X-Restart-Triggers-dbus.drv43 /nix/store/ljfzjxqwx4kxjwxjjlnpaqdzh0xqd7xr-unit-dbus.service.drv44 /nix/store/jphjq6s3xb6lm1r9a0yllq3wvcijkikd-user-units.drv45 /nix/store/yr25cab0bgg2gdcjr0fkk052aqw4ag84-postgresql-init.drv46 /nix/store/18idp8l89ga0vbjdvp5y33m42h8ypb3n-unit-postgresql.service.drv47 /nix/store/9dhmhlajdjqsz58msmq42lwanwgk4c0z-supabase-db-init.drv48 /nix/store/9189fi92i7805xz024zxxwljw2xfqplf-unit-supabase-db-init.service.drv49 /nix/store/ks9rz4w18q5w6apnl8bszi42p6fqb7w9-unit-dbus.service.drv50 /nix/store/w29pxvjbvdmyac5wz16l2kakq9n2w4dn-system-units.drv51 /nix/store/5i64fsbcnqkbbwyscs590q4x0kckm8vz-etc.drv52 /nix/store/f3zaq5gia1p450hfwx1a5ka9b2crwvpc-activate.drv53 /nix/store/056yh3sa4kfnqb7kkbx5cf1k5x1szkz1-nixos-system-server-test.drv54 /nix/store/mal9f66fdfa5nqg9ikwdw69j48pjqfvh-closure-info.drv55 /nix/store/79y01hwpxmrf27k59nswmpv2imm7ccp0-run-nixos-vm.drv56 /nix/store/5si6clmwn84vh1b1iji0zxwzn8hgsqlc-nixos-vm.drv57 /nix/store/2qlwmxaxzqs3wpc9k1azzzb8839vw9f4-nixos-test-driver-timescaledb.drv58 /nix/store/byhisi3dzm4cgi372sr88abykpy6q9ii-vm-test-run-timescaledb.drv59these 49 paths will be fetched (304.5 MiB download, 1.4 GiB unpacked):60 /nix/store/pc5dj3mqbky9j88mhl9v6xjbx0q834jh-gdal-3.8.561 /nix/store/addibh318db5yxinwy8546y4l50h752j-pgaudit-1.6.162 /nix/store/cd41zl0bs426c7z4lmr666ycl9dmmybh-pgaudit-1.7.063 /nix/store/cslxh5r6pfb44i056x3rsdnn6m72yhzk-pgaudit-1.7.164 /nix/store/8sn9mcj1dl7493ia6dgqr7dk6k345v36-pgroonga-3.0.765 /nix/store/5k4368w675sgqd6fpxf8gp7chjk08j8g-pgroonga-3.2.566 /nix/store/09i48zwx3h04ax1h7rfrrdw4fzd2i8pj-pgrouting-3.4.167 /nix/store/z9gcwl92rxi2ab4mckkpjxfgnbr3nnia-pgsodium-3.0.468 /nix/store/l4b4xsxxiqpn4pwwns89y4255wh2jii9-pgsodium-3.1.569 /nix/store/assmprqh03pjzdxgyivvsi191h5zxm9l-pgsodium-3.1.670 /nix/store/xin42rjakyjh2rndzlb2prf55ayn5fc3-pgsodium-3.1.771 /nix/store/5v2wmpbf55lhh8j5zdx0k6k2pi51lgny-pgsodium-3.1.872 /nix/store/l8lf1zklikyr97rnff38d8584vw8b43f-pgtap-1.3.173 /nix/store/b2jcp56jc84mbr9iwccdimphbzb3fsf7-plpgsql_check-2.274 /nix/store/zk6yzlkx47z6wc38rydxx8wjhkwx87nl-plpgsql_check-2.775 /nix/store/p3mp4krgm398nd48za0amjc5zwwgjsip-plpgsql_check-2.876 /nix/store/55z1jd1xiw410x3716xi54k7ncvc6278-plv8-3.1.477 /nix/store/g5ck6ih86l3ic3ixpkvz81mng62krw8w-postgis-3.3.278 /nix/store/l2rxnjwwmjxr8d80z549fkb1p7z2iwbi-rum-1.379 /nix/store/7ifylarp5igsk3wpkxyscmr5khpgxh0d-sfcgal-2.2.080 /nix/store/2s3j6b063cjk3lpl97wzfrgdnpxpismg-supabase_vault-0.3.181 /nix/store/bjdirzmp9zqha717va1h7qi0pc0llhl8-timescaledb-2.16.182 /nix/store/7z4lnnwasjc5ckf03ka1zxp6lkwcgjjw-timescaledb-2.9.183 /nix/store/p7km1d2pimq5g2cp0nbk358v6rvvf8xx-vector-0.4.084 /nix/store/nc39b3mnv97xqvw3nlrqidmmnmwf1v4w-vector-0.5.185 /nix/store/4iv3z6p9pwq6fzm93m99fjd8ys8l7shw-vector-0.6.086 /nix/store/bzdrz47dwwl4b74r6q6b2zaqlvvxl7yx-vector-0.6.287 /nix/store/iqmhjwddxkyadi9q6l8h2qn3rax63zr3-vector-0.7.088 /nix/store/xakinwps0rpc7kkcl2ll6mfmhnwkm7az-vector-0.7.489 /nix/store/1bsy8n42glczbkpznbznfznb0fxvfv3m-vector-0.8.090 /nix/store/7cklm7mvkqshfvklp8pvvgvy20n6f8sc-vector-0.8.291 /nix/store/n19730h9wyrfcnj4x8gjvhaknc95i895-wal2json-2.692 /nix/store/pbxj5bz7s4bhwylxbjzyjh02y5rybfyr-wrappers-0.3.093 /nix/store/n2n10ww41kzpmbp6l06n7hh7g29fdz83-wrappers-0.4.194 /nix/store/k33zl01mjhqjzjwrvdny4avm9g9qp496-wrappers-0.4.295 /nix/store/0ny88s7hix1m40srp6x9268w6y2al75z-wrappers-0.4.396 /nix/store/jcnwsjsm9gj9as3ws5aa7h925kjyr5hv-wrappers-0.4.497 /nix/store/b4ykcbp3mfwsdgwmrpm7qyibqfvhq1xr-wrappers-0.4.598 /nix/store/xjxsjj1nj61lb12cr3i9r5wprmpfjrh6-wrappers-0.4.699 /nix/store/rq4ycpi3amjv916572zv5x0khq5wvdjd-wrappers-0.5.0100 /nix/store/ss8rk4ak5hsj1k6awkhcxzrilpz73h27-wrappers-0.5.3101 /nix/store/ipqn16y4b5i9cnmx1vc8z9jys1z28lg5-wrappers-0.5.4102 /nix/store/hqfhk0h4rj0vqh1vkm561waxly6cc7w1-wrappers-0.5.5103 /nix/store/r89q9xp7rn48w6mhasmc15bc7msaah6z-wrappers-0.5.6104 /nix/store/ws55h1zcbaf95aqcx1cax86jqa9lr3c6-wrappers-0.5.7105 /nix/store/d6knx45df8lnnb5i12flnkkbpb3vhagh-wrappers-0.6.0106 /nix/store/nv1r7alrkp4mnq6j6l2w641dmqsac8cl-wrappers-0.6.1107 /nix/store/an7kvlc76daf1cq5qygcnccm1hv74dc1-wrappers-0.6.2108 /nix/store/36nx0n9iavpzspp1r2kn3db434z9hd44-wrappers-0.6.3109error: Cannot build '/nix/store/7b5ar71808xp6cc9vi64vcr3gxhaq9w2-pg_net-0.14.0.drv'.110 Reason: builder failed with exit code 2.111 Output paths:112 /nix/store/2vyqm50vp9dxrrm1lidjzvr6difmnnqc-pg_net-0.14.0113 Last 25 log lines:114 > src/errors.h:6:11: warning: call to 'Wcurl_easy_setopt_err_long' declared with attribute warning: curl_easy_setopt expects a long argument [-Wattribute-warning]115 > 6 | if (curl_easy_setopt(hdl, opt, prm) != CURLE_OK) \116 > | ^~~~~~~~~~~~~~~~117 > src/core.c:134:3: note: in expansion of macro 'EREPORT_CURL_SETOPT'118 > 134 | EREPORT_CURL_SETOPT(curl_ez_handle, CURLOPT_TIMEOUT_MS, cdata->timeout_milliseconds);119 > | ^~~~~~~~~~~~~~~~~~~120 > src/errors.h:6:11: warning: call to 'Wcurl_easy_setopt_err_long' declared with attribute warning: curl_easy_setopt expects a long argument [-Wattribute-warning]121 > 6 | if (curl_easy_setopt(hdl, opt, prm) != CURLE_OK) \122 > | ^~~~~~~~~~~~~~~~123 > src/core.c:136:3: note: in expansion of macro 'EREPORT_CURL_SETOPT'124 > 136 | EREPORT_CURL_SETOPT(curl_ez_handle, CURLOPT_FOLLOWLOCATION, true);125 > | ^~~~~~~~~~~~~~~~~~~126 > gcc -Wall -Wmissing-prototypes -Wpointer-arith -Wdeclaration-after-statement -Werror=vla -Wendif-labels -Wmissing-format-attribute -Wimplicit-fallthrough=3 -Wcast-function-type -Wformat-security -fno-strict-aliasing -fwrapv -fexcess-precision=standard -Wno-deprecated-non-prototype -Wno-format-truncation -Wno-stringop-truncation -g -O2 -std=gnu17 -std=c11 -Werror -Wno-declaration-after-statement -fPIC -DEXTVERSION=\"0.14.0\" -I. -I./ -I/nix/store/804f042cyc4dca4vwl2fmh1rhfy0sij9-postgresql-15.19/include/server -I/nix/store/804f042cyc4dca4vwl2fmh1rhfy0sij9-postgresql-15.19/include/internal -D_GNU_SOURCE -I/nix/store/5nl2zr46dic7mxcw6cvbq85wa8c2gngh-libxml2-2.15.1-dev/include/libxml2 -I/nix/store/sl10j863s32x7dv5vw6wfx1nh22f3xh2-lz4-1.10.0-dev/include -I/nix/store/di94mxmhhk390zzzv2gvavfwkgww7q6h-zstd-1.5.7-dev/include -I/nix/store/h5hfqhzcqszmsacj26hh3fngwcal04zs-icu4c-75.1-dev/include -c -o src/errors.o src/errors.c127 > gcc -Wall -Wmissing-prototypes -Wpointer-arith -Wdeclaration-after-statement -Werror=vla -Wendif-labels -Wmissing-format-attribute -Wimplicit-fallthrough=3 -Wcast-function-type -Wformat-security -fno-strict-aliasing -fwrapv -fexcess-precision=standard -Wno-deprecated-non-prototype -Wno-format-truncation -Wno-stringop-truncation -g -O2 -std=gnu17 -std=c11 -Werror -Wno-declaration-after-statement -fPIC -DEXTVERSION=\"0.14.0\" -I. -I./ -I/nix/store/804f042cyc4dca4vwl2fmh1rhfy0sij9-postgresql-15.19/include/server -I/nix/store/804f042cyc4dca4vwl2fmh1rhfy0sij9-postgresql-15.19/include/internal -D_GNU_SOURCE -I/nix/store/5nl2zr46dic7mxcw6cvbq85wa8c2gngh-libxml2-2.15.1-dev/include/libxml2 -I/nix/store/sl10j863s32x7dv5vw6wfx1nh22f3xh2-lz4-1.10.0-dev/include -I/nix/store/di94mxmhhk390zzzv2gvavfwkgww7q6h-zstd-1.5.7-dev/include -I/nix/store/h5hfqhzcqszmsacj26hh3fngwcal04zs-icu4c-75.1-dev/include -c -o src/event.o src/event.c128 > In file included from /nix/store/wflnb8fxmq4lqx3ca91hlpv95vrqkv51-curl-8.17.0-dev/include/curl/curl.h:3333,129 > from /nix/store/wflnb8fxmq4lqx3ca91hlpv95vrqkv51-curl-8.17.0-dev/include/curl/multi.h:51,130 > from src/event.h:4,131 > from src/event.c:6:132 > /nix/store/wflnb8fxmq4lqx3ca91hlpv95vrqkv51-curl-8.17.0-dev/include/curl/multi.h:429:23: error: expected identifier or '(' before '__extension__'133 > 429 | CURL_EXTERN CURLMcode curl_multi_setopt(CURLM *multi_handle,134 > | ^~~~~~~~~~~~~~~~~135 > /nix/store/wflnb8fxmq4lqx3ca91hlpv95vrqkv51-curl-8.17.0-dev/include/curl/multi.h:429:23: error: expected identifier or '(' before ')' token136 > 429 | CURL_EXTERN CURLMcode curl_multi_setopt(CURLM *multi_handle,137 > | ^~~~~~~~~~~~~~~~~138 > make: *** [<builtin>: src/event.o] Error 1139 For full logs, run:140 nix log /nix/store/7b5ar71808xp6cc9vi64vcr3gxhaq9w2-pg_net-0.14.0.drv141error: Cannot build '/nix/store/ymx9gp4jhvd7qpjvk95vw2m6ycb0jal7-pg_net-0.13.0.drv'.142 Reason: builder failed with exit code 2.143 Output paths:144 /nix/store/pxjg6rykpbbhl7xmwasvyb94bc1v5w3r-pg_net-0.13.0145 Last 25 log lines:146 > | ^~~~~~~~~~~~~~147 > src/util.h:6:11: warning: call to 'Wcurl_easy_setopt_err_long' declared with attribute warning: curl_easy_setopt expects a long argument [-Wattribute-warning]148 > 6 | if (curl_easy_setopt(hdl, opt, prm) != CURLE_OK) \149 > | ^~~~~~~~~~~~~~~~150 > src/core.c:108:3: note: in expansion of macro 'CURL_EZ_SETOPT'151 > 108 | CURL_EZ_SETOPT(curl_ez_handle, CURLOPT_TIMEOUT_MS, timeout_milliseconds);152 > | ^~~~~~~~~~~~~~153 > src/util.h:6:11: warning: call to 'Wcurl_easy_setopt_err_long' declared with attribute warning: curl_easy_setopt expects a long argument [-Wattribute-warning]154 > 6 | if (curl_easy_setopt(hdl, opt, prm) != CURLE_OK) \155 > | ^~~~~~~~~~~~~~~~156 > src/core.c:110:3: note: in expansion of macro 'CURL_EZ_SETOPT'157 > 110 | CURL_EZ_SETOPT(curl_ez_handle, CURLOPT_FOLLOWLOCATION, true);158 > | ^~~~~~~~~~~~~~159 > gcc -Wall -Wmissing-prototypes -Wpointer-arith -Wdeclaration-after-statement -Werror=vla -Wendif-labels -Wmissing-format-attribute -Wimplicit-fallthrough=3 -Wcast-function-type -Wformat-security -fno-strict-aliasing -fwrapv -fexcess-precision=standard -Wno-deprecated-non-prototype -Wno-format-truncation -Wno-stringop-truncation -g -O2 -std=gnu17 -std=c11 -Werror -Wno-declaration-after-statement -fPIC -DEXTVERSION=\"0.13.0\" -I. -I./ -I/nix/store/804f042cyc4dca4vwl2fmh1rhfy0sij9-postgresql-15.19/include/server -I/nix/store/804f042cyc4dca4vwl2fmh1rhfy0sij9-postgresql-15.19/include/internal -D_GNU_SOURCE -I/nix/store/5nl2zr46dic7mxcw6cvbq85wa8c2gngh-libxml2-2.15.1-dev/include/libxml2 -I/nix/store/sl10j863s32x7dv5vw6wfx1nh22f3xh2-lz4-1.10.0-dev/include -I/nix/store/di94mxmhhk390zzzv2gvavfwkgww7q6h-zstd-1.5.7-dev/include -I/nix/store/h5hfqhzcqszmsacj26hh3fngwcal04zs-icu4c-75.1-dev/include -c -o src/event.o src/event.c160 > In file included from /nix/store/wflnb8fxmq4lqx3ca91hlpv95vrqkv51-curl-8.17.0-dev/include/curl/curl.h:3333,161 > from /nix/store/wflnb8fxmq4lqx3ca91hlpv95vrqkv51-curl-8.17.0-dev/include/curl/multi.h:51,162 > from src/event.h:4,163 > from src/event.c:6:164 > /nix/store/wflnb8fxmq4lqx3ca91hlpv95vrqkv51-curl-8.17.0-dev/include/curl/multi.h:429:23: error: expected identifier or '(' before '__extension__'165 > 429 | CURL_EXTERN CURLMcode curl_multi_setopt(CURLM *multi_handle,166 > | ^~~~~~~~~~~~~~~~~167 > /nix/store/wflnb8fxmq4lqx3ca91hlpv95vrqkv51-curl-8.17.0-dev/include/curl/multi.h:429:23: error: expected identifier or '(' before ')' token168 > 429 | CURL_EXTERN CURLMcode curl_multi_setopt(CURLM *multi_handle,169 > | ^~~~~~~~~~~~~~~~~170 > make: *** [<builtin>: src/event.o] Error 1171 For full logs, run:172 nix log /nix/store/ymx9gp4jhvd7qpjvk95vw2m6ycb0jal7-pg_net-0.13.0.drv173error: Cannot build '/nix/store/hfwkzpr1kplwaywhvayqm6j4gsva8n5n-pg_net-0.20.0.drv'.174 Reason: builder failed with exit code 2.175 Output paths:176 /nix/store/scsfkgabhfzpzf64a6cgvkx2zglb6vji-pg_net-0.20.0177 Last 22 log lines:178 > Running phase: unpackPhase179 > unpacking source archive /nix/store/3783i7yhcfqnyv5ndli22gcr11ap151m-source180 > source root is source181 > Running phase: patchPhase182 > Running phase: updateAutotoolsGnuConfigScriptsPhase183 > Running phase: configurePhase184 > no configure script, doing nothing185 > Running phase: buildPhase186 > gcc -Wall -Wmissing-prototypes -Wpointer-arith -Wdeclaration-after-statement -Werror=vla -Wendif-labels -Wmissing-format-attribute -Wimplicit-fallthrough=3 -Wcast-function-type -Wformat-security -fno-strict-aliasing -fwrapv -fexcess-precision=standard -Wno-deprecated-non-prototype -Wno-format-truncation -Wno-stringop-truncation -g -O2 -std=gnu17 -std=c11 -Wextra -Wall -Werror -Wno-declaration-after-statement -Wno-vla -Wno-long-long -Wmissing-variable-declarations -fPIC -DEXTVERSION=\"0.20.0\" -I. -I./ -I/nix/store/804f042cyc4dca4vwl2fmh1rhfy0sij9-postgresql-15.19/include/server -I/nix/store/804f042cyc4dca4vwl2fmh1rhfy0sij9-postgresql-15.19/include/internal -D_GNU_SOURCE -I/nix/store/5nl2zr46dic7mxcw6cvbq85wa8c2gngh-libxml2-2.15.1-dev/include/libxml2 -I/nix/store/sl10j863s32x7dv5vw6wfx1nh22f3xh2-lz4-1.10.0-dev/include -I/nix/store/di94mxmhhk390zzzv2gvavfwkgww7q6h-zstd-1.5.7-dev/include -I/nix/store/h5hfqhzcqszmsacj26hh3fngwcal04zs-icu4c-75.1-dev/include -c -o src/core.o src/core.c187 > gcc -Wall -Wmissing-prototypes -Wpointer-arith -Wdeclaration-after-statement -Werror=vla -Wendif-labels -Wmissing-format-attribute -Wimplicit-fallthrough=3 -Wcast-function-type -Wformat-security -fno-strict-aliasing -fwrapv -fexcess-precision=standard -Wno-deprecated-non-prototype -Wno-format-truncation -Wno-stringop-truncation -g -O2 -std=gnu17 -std=c11 -Wextra -Wall -Werror -Wno-declaration-after-statement -Wno-vla -Wno-long-long -Wmissing-variable-declarations -fPIC -DEXTVERSION=\"0.20.0\" -I. -I./ -I/nix/store/804f042cyc4dca4vwl2fmh1rhfy0sij9-postgresql-15.19/include/server -I/nix/store/804f042cyc4dca4vwl2fmh1rhfy0sij9-postgresql-15.19/include/internal -D_GNU_SOURCE -I/nix/store/5nl2zr46dic7mxcw6cvbq85wa8c2gngh-libxml2-2.15.1-dev/include/libxml2 -I/nix/store/sl10j863s32x7dv5vw6wfx1nh22f3xh2-lz4-1.10.0-dev/include -I/nix/store/di94mxmhhk390zzzv2gvavfwkgww7q6h-zstd-1.5.7-dev/include -I/nix/store/h5hfqhzcqszmsacj26hh3fngwcal04zs-icu4c-75.1-dev/include -c -o src/errors.o src/errors.c188 > gcc -Wall -Wmissing-prototypes -Wpointer-arith -Wdeclaration-after-statement -Werror=vla -Wendif-labels -Wmissing-format-attribute -Wimplicit-fallthrough=3 -Wcast-function-type -Wformat-security -fno-strict-aliasing -fwrapv -fexcess-precision=standard -Wno-deprecated-non-prototype -Wno-format-truncation -Wno-stringop-truncation -g -O2 -std=gnu17 -std=c11 -Wextra -Wall -Werror -Wno-declaration-after-statement -Wno-vla -Wno-long-long -Wmissing-variable-declarations -fPIC -DEXTVERSION=\"0.20.0\" -I. -I./ -I/nix/store/804f042cyc4dca4vwl2fmh1rhfy0sij9-postgresql-15.19/include/server -I/nix/store/804f042cyc4dca4vwl2fmh1rhfy0sij9-postgresql-15.19/include/internal -D_GNU_SOURCE -I/nix/store/5nl2zr46dic7mxcw6cvbq85wa8c2gngh-libxml2-2.15.1-dev/include/libxml2 -I/nix/store/sl10j863s32x7dv5vw6wfx1nh22f3xh2-lz4-1.10.0-dev/include -I/nix/store/di94mxmhhk390zzzv2gvavfwkgww7q6h-zstd-1.5.7-dev/include -I/nix/store/h5hfqhzcqszmsacj26hh3fngwcal04zs-icu4c-75.1-dev/include -c -o src/event.o src/event.c189 > In file included from /nix/store/wflnb8fxmq4lqx3ca91hlpv95vrqkv51-curl-8.17.0-dev/include/curl/curl.h:3333,190 > from /nix/store/wflnb8fxmq4lqx3ca91hlpv95vrqkv51-curl-8.17.0-dev/include/curl/multi.h:51,191 > from src/event.h:4,192 > from src/event.c:6:193 > /nix/store/wflnb8fxmq4lqx3ca91hlpv95vrqkv51-curl-8.17.0-dev/include/curl/multi.h:429:23: error: expected identifier or '(' before '__extension__'194 > 429 | CURL_EXTERN CURLMcode curl_multi_setopt(CURLM *multi_handle,195 > | ^~~~~~~~~~~~~~~~~196 > /nix/store/wflnb8fxmq4lqx3ca91hlpv95vrqkv51-curl-8.17.0-dev/include/curl/multi.h:429:23: error: expected identifier or '(' before ')' token197 > 429 | CURL_EXTERN CURLMcode curl_multi_setopt(CURLM *multi_handle,198 > | ^~~~~~~~~~~~~~~~~199 > make: *** [<builtin>: src/event.o] Error 1200 For full logs, run:201 nix log /nix/store/hfwkzpr1kplwaywhvayqm6j4gsva8n5n-pg_net-0.20.0.drv202error: Cannot build '/nix/store/5v6a4ssacxc4snck5dzagkmqhcsh2swz-pg_net-0.19.5.drv'.203 Reason: builder failed with exit code 2.204 Output paths:205 /nix/store/xcsw4jyz7w5071r5drjiify20gjvij99-pg_net-0.19.5206 Last 22 log lines:207 > Running phase: unpackPhase208 > unpacking source archive /nix/store/5zgdqy3bz93jyn79pizxc1hks0cdcadw-source209 > source root is source210 > Running phase: patchPhase211 > Running phase: updateAutotoolsGnuConfigScriptsPhase212 > Running phase: configurePhase213 > no configure script, doing nothing214 > Running phase: buildPhase215 > gcc -Wall -Wmissing-prototypes -Wpointer-arith -Wdeclaration-after-statement -Werror=vla -Wendif-labels -Wmissing-format-attribute -Wimplicit-fallthrough=3 -Wcast-function-type -Wformat-security -fno-strict-aliasing -fwrapv -fexcess-precision=standard -Wno-deprecated-non-prototype -Wno-format-truncation -Wno-stringop-truncation -g -O2 -std=gnu17 -std=c11 -Wextra -Wall -Werror -Wno-declaration-after-statement -Wno-vla -Wno-long-long -Wmissing-variable-declarations -fPIC -DEXTVERSION=\"0.19.5\" -I. -I./ -I/nix/store/804f042cyc4dca4vwl2fmh1rhfy0sij9-postgresql-15.19/include/server -I/nix/store/804f042cyc4dca4vwl2fmh1rhfy0sij9-postgresql-15.19/include/internal -D_GNU_SOURCE -I/nix/store/5nl2zr46dic7mxcw6cvbq85wa8c2gngh-libxml2-2.15.1-dev/include/libxml2 -I/nix/store/sl10j863s32x7dv5vw6wfx1nh22f3xh2-lz4-1.10.0-dev/include -I/nix/store/di94mxmhhk390zzzv2gvavfwkgww7q6h-zstd-1.5.7-dev/include -I/nix/store/h5hfqhzcqszmsacj26hh3fngwcal04zs-icu4c-75.1-dev/include -c -o src/core.o src/core.c216 > gcc -Wall -Wmissing-prototypes -Wpointer-arith -Wdeclaration-after-statement -Werror=vla -Wendif-labels -Wmissing-format-attribute -Wimplicit-fallthrough=3 -Wcast-function-type -Wformat-security -fno-strict-aliasing -fwrapv -fexcess-precision=standard -Wno-deprecated-non-prototype -Wno-format-truncation -Wno-stringop-truncation -g -O2 -std=gnu17 -std=c11 -Wextra -Wall -Werror -Wno-declaration-after-statement -Wno-vla -Wno-long-long -Wmissing-variable-declarations -fPIC -DEXTVERSION=\"0.19.5\" -I. -I./ -I/nix/store/804f042cyc4dca4vwl2fmh1rhfy0sij9-postgresql-15.19/include/server -I/nix/store/804f042cyc4dca4vwl2fmh1rhfy0sij9-postgresql-15.19/include/internal -D_GNU_SOURCE -I/nix/store/5nl2zr46dic7mxcw6cvbq85wa8c2gngh-libxml2-2.15.1-dev/include/libxml2 -I/nix/store/sl10j863s32x7dv5vw6wfx1nh22f3xh2-lz4-1.10.0-dev/include -I/nix/store/di94mxmhhk390zzzv2gvavfwkgww7q6h-zstd-1.5.7-dev/include -I/nix/store/h5hfqhzcqszmsacj26hh3fngwcal04zs-icu4c-75.1-dev/include -c -o src/errors.o src/errors.c217 > gcc -Wall -Wmissing-prototypes -Wpointer-arith -Wdeclaration-after-statement -Werror=vla -Wendif-labels -Wmissing-format-attribute -Wimplicit-fallthrough=3 -Wcast-function-type -Wformat-security -fno-strict-aliasing -fwrapv -fexcess-precision=standard -Wno-deprecated-non-prototype -Wno-format-truncation -Wno-stringop-truncation -g -O2 -std=gnu17 -std=c11 -Wextra -Wall -Werror -Wno-declaration-after-statement -Wno-vla -Wno-long-long -Wmissing-variable-declarations -fPIC -DEXTVERSION=\"0.19.5\" -I. -I./ -I/nix/store/804f042cyc4dca4vwl2fmh1rhfy0sij9-postgresql-15.19/include/server -I/nix/store/804f042cyc4dca4vwl2fmh1rhfy0sij9-postgresql-15.19/include/internal -D_GNU_SOURCE -I/nix/store/5nl2zr46dic7mxcw6cvbq85wa8c2gngh-libxml2-2.15.1-dev/include/libxml2 -I/nix/store/sl10j863s32x7dv5vw6wfx1nh22f3xh2-lz4-1.10.0-dev/include -I/nix/store/di94mxmhhk390zzzv2gvavfwkgww7q6h-zstd-1.5.7-dev/include -I/nix/store/h5hfqhzcqszmsacj26hh3fngwcal04zs-icu4c-75.1-dev/include -c -o src/event.o src/event.c218 > In file included from /nix/store/wflnb8fxmq4lqx3ca91hlpv95vrqkv51-curl-8.17.0-dev/include/curl/curl.h:3333,219 > from /nix/store/wflnb8fxmq4lqx3ca91hlpv95vrqkv51-curl-8.17.0-dev/include/curl/multi.h:51,220 > from src/event.h:4,221 > from src/event.c:6:222 > /nix/store/wflnb8fxmq4lqx3ca91hlpv95vrqkv51-curl-8.17.0-dev/include/curl/multi.h:429:23: error: expected identifier or '(' before '__extension__'223 > 429 | CURL_EXTERN CURLMcode curl_multi_setopt(CURLM *multi_handle,224 > | ^~~~~~~~~~~~~~~~~225 > /nix/store/wflnb8fxmq4lqx3ca91hlpv95vrqkv51-curl-8.17.0-dev/include/curl/multi.h:429:23: error: expected identifier or '(' before ')' token226 > 429 | CURL_EXTERN CURLMcode curl_multi_setopt(CURLM *multi_handle,227 > | ^~~~~~~~~~~~~~~~~228 > make: *** [<builtin>: src/event.o] Error 1229 For full logs, run:230 nix log /nix/store/5v6a4ssacxc4snck5dzagkmqhcsh2swz-pg_net-0.19.5.drv231error: Cannot build '/nix/store/ggfg6al5fkdp0r1jsc3iabgz0p7g6l1m-pg_net-0.7.drv'.232 Reason: builder failed with exit code 2.233 Output paths:234 /nix/store/pkfapf0li10b8b6nrhwm8880g4d2i8y5-pg_net-0.7235 Last 25 log lines:236 > | ^~~~~~~~~~~~~~237 > src/util.h:6:11: warning: call to 'Wcurl_easy_setopt_err_long' declared with attribute warning: curl_easy_setopt expects a long argument [-Wattribute-warning]238 > 6 | if (curl_easy_setopt(hdl, opt, prm) != CURLE_OK) \239 > | ^~~~~~~~~~~~~~~~240 > src/core.c:108:3: note: in expansion of macro 'CURL_EZ_SETOPT'241 > 108 | CURL_EZ_SETOPT(curl_ez_handle, CURLOPT_TIMEOUT_MS, timeout_milliseconds);242 > | ^~~~~~~~~~~~~~243 > src/util.h:6:11: warning: call to 'Wcurl_easy_setopt_err_long' declared with attribute warning: curl_easy_setopt expects a long argument [-Wattribute-warning]244 > 6 | if (curl_easy_setopt(hdl, opt, prm) != CURLE_OK) \245 > | ^~~~~~~~~~~~~~~~246 > src/core.c:110:3: note: in expansion of macro 'CURL_EZ_SETOPT'247 > 110 | CURL_EZ_SETOPT(curl_ez_handle, CURLOPT_FOLLOWLOCATION, true);248 > | ^~~~~~~~~~~~~~249 > gcc -Wall -Wmissing-prototypes -Wpointer-arith -Wdeclaration-after-statement -Werror=vla -Wendif-labels -Wmissing-format-attribute -Wimplicit-fallthrough=3 -Wcast-function-type -Wformat-security -fno-strict-aliasing -fwrapv -fexcess-precision=standard -Wno-deprecated-non-prototype -Wno-format-truncation -Wno-stringop-truncation -g -O2 -std=gnu17 -std=c11 -Werror -Wno-declaration-after-statement -fPIC -DEXTVERSION=\"0.13.0\" -I. -I./ -I/nix/store/804f042cyc4dca4vwl2fmh1rhfy0sij9-postgresql-15.19/include/server -I/nix/store/804f042cyc4dca4vwl2fmh1rhfy0sij9-postgresql-15.19/include/internal -D_GNU_SOURCE -I/nix/store/5nl2zr46dic7mxcw6cvbq85wa8c2gngh-libxml2-2.15.1-dev/include/libxml2 -I/nix/store/sl10j863s32x7dv5vw6wfx1nh22f3xh2-lz4-1.10.0-dev/include -I/nix/store/di94mxmhhk390zzzv2gvavfwkgww7q6h-zstd-1.5.7-dev/include -I/nix/store/h5hfqhzcqszmsacj26hh3fngwcal04zs-icu4c-75.1-dev/include -c -o src/event.o src/event.c250 > In file included from /nix/store/wflnb8fxmq4lqx3ca91hlpv95vrqkv51-curl-8.17.0-dev/include/curl/curl.h:3333,251 > from /nix/store/wflnb8fxmq4lqx3ca91hlpv95vrqkv51-curl-8.17.0-dev/include/curl/multi.h:51,252 > from src/event.h:4,253 > from src/event.c:6:254 > /nix/store/wflnb8fxmq4lqx3ca91hlpv95vrqkv51-curl-8.17.0-dev/include/curl/multi.h:429:23: error: expected identifier or '(' before '__extension__'255 > 429 | CURL_EXTERN CURLMcode curl_multi_setopt(CURLM *multi_handle,256 > | ^~~~~~~~~~~~~~~~~257 > /nix/store/wflnb8fxmq4lqx3ca91hlpv95vrqkv51-curl-8.17.0-dev/include/curl/multi.h:429:23: error: expected identifier or '(' before ')' token258 > 429 | CURL_EXTERN CURLMcode curl_multi_setopt(CURLM *multi_handle,259 > | ^~~~~~~~~~~~~~~~~260 > make: *** [<builtin>: src/event.o] Error 1261 For full logs, run:262 nix log /nix/store/ggfg6al5fkdp0r1jsc3iabgz0p7g6l1m-pg_net-0.7.drv263error: Cannot build '/nix/store/94hi7qqfg86lfxqnyqizx334my0yjbh3-pg_net.drv'.264 Reason: 5 dependencies failed.265 Output paths:266 /nix/store/88g5knkc68im4z0plvckvdf0ag9pl97y-pg_net267error: Cannot build '/nix/store/a5gfyj0k47cxv70v4a1zhhk1998vd290-postgresql-and-plugins-15.19.drv'.268 Reason: 1 dependency failed.269 Output paths:270 /nix/store/zn5pxdcd7zf2nviqxmbqb3whv0b89njc-postgresql-and-plugins-15.19271error: Cannot build '/nix/store/69zc44dp9979jf4p9hcpgfdf1wgpw40l-postgresql-and-plugins-15.19.drv'.272 Reason: 1 dependency failed.273 Output paths:274 /nix/store/hhm9gzfpx0h3lp8ld4wvl64kwnddl1yd-postgresql-and-plugins-15.19275error: Cannot build '/nix/store/yr25cab0bgg2gdcjr0fkk052aqw4ag84-postgresql-init.drv'.276 Reason: 1 dependency failed.277 Output paths:278 /nix/store/7nv58lyapj4mqdczihsi6cfmcydjazv0-postgresql-init279error: Cannot build '/nix/store/9dhmhlajdjqsz58msmq42lwanwgk4c0z-supabase-db-init.drv'.280 Reason: 1 dependency failed.281 Output paths:282 /nix/store/04kjr2y1f7hkywc7dmww3n56f9awljyv-supabase-db-init283error: Cannot build '/nix/store/sn90bhb87fs1r7szfvpnhakcf5cbqipi-system-path.drv'.284 Reason: 1 dependency failed.285 Output paths:286 /nix/store/d1l9p7cxy6frga61c961vbakykybwla0-system-path287error: Cannot build '/nix/store/rnjj94ch4qaxpyhgvk900hq1rp2ji4cx-dbus-1.drv'.288 Reason: 1 dependency failed.289 Output paths:290 /nix/store/9an5r6jm2y6kpbk4r0b8sibw0vkf19vj-dbus-1291error: Cannot build '/nix/store/18idp8l89ga0vbjdvp5y33m42h8ypb3n-unit-postgresql.service.drv'.292 Reason: 2 dependencies failed.293 Output paths:294 /nix/store/107kzs2gwas10ryhvr2x3ch174m6f6i3-unit-postgresql.service295error: Cannot build '/nix/store/9189fi92i7805xz024zxxwljw2xfqplf-unit-supabase-db-init.service.drv'.296 Reason: 1 dependency failed.297 Output paths:298 /nix/store/n1bvlic1id0sybb254vs4nzw75kv51jn-unit-supabase-db-init.service299error: Cannot build '/nix/store/bj8k3q4xx5yxsjpcz0k6pjkann65ifyp-X-Restart-Triggers-dbus.drv'.300 Reason: 1 dependency failed.301 Output paths:302 /nix/store/m5s8iv4fvwca77nj8x9gzi2kbkbhkwj5-X-Restart-Triggers-dbus303error: Cannot build '/nix/store/ks9rz4w18q5w6apnl8bszi42p6fqb7w9-unit-dbus.service.drv'.304 Reason: 1 dependency failed.305 Output paths:306 /nix/store/4ivywhvyw3mwb077ypjyzzkgmkm6hdzi-unit-dbus.service307error: Cannot build '/nix/store/ljfzjxqwx4kxjwxjjlnpaqdzh0xqd7xr-unit-dbus.service.drv'.308 Reason: 1 dependency failed.309 Output paths:310 /nix/store/2ah9ks1byg1x3j9kg1x6mbbmykxgl9s1-unit-dbus.service311error: Cannot build '/nix/store/w29pxvjbvdmyac5wz16l2kakq9n2w4dn-system-units.drv'.312 Reason: 3 dependencies failed.313 Output paths:314 /nix/store/2wkv7zmc05vlyn9797agk3w3grgyiyqp-system-units315error: Cannot build '/nix/store/jphjq6s3xb6lm1r9a0yllq3wvcijkikd-user-units.drv'.316 Reason: 1 dependency failed.317 Output paths:318 /nix/store/9kr2570q5fkwfrvcvd5r7vr4p5n9bn1r-user-units319error: Cannot build '/nix/store/5i64fsbcnqkbbwyscs590q4x0kckm8vz-etc.drv'.320 Reason: 4 dependencies failed.321 Output paths:322 /nix/store/id8grildviwmlw31q8w30fyk3c4cyhlw-etc323error: Cannot build '/nix/store/f3zaq5gia1p450hfwx1a5ka9b2crwvpc-activate.drv'.324 Reason: 1 dependency failed.325 Output paths:326 /nix/store/fs4g4l5vxpi515v6ki5mm5bff92cxjm8-activate327error: Cannot build '/nix/store/056yh3sa4kfnqb7kkbx5cf1k5x1szkz1-nixos-system-server-test.drv'.328 Reason: 3 dependencies failed.329 Output paths:330 /nix/store/9j1nxiajf2bn9rnyj6jdncrj20n6g2i7-nixos-system-server-test331error: Cannot build '/nix/store/mal9f66fdfa5nqg9ikwdw69j48pjqfvh-closure-info.drv'.332 Reason: 1 dependency failed.333 Output paths:334 /nix/store/1llw5abswy76mi1ryxxxxia1jxr9sn8l-closure-info335error: Cannot build '/nix/store/79y01hwpxmrf27k59nswmpv2imm7ccp0-run-nixos-vm.drv'.336 Reason: 2 dependencies failed.337 Output paths:338 /nix/store/r9n3c444navkrck00nck1k8acnbh56xc-run-nixos-vm339error: Cannot build '/nix/store/5si6clmwn84vh1b1iji0zxwzn8hgsqlc-nixos-vm.drv'.340 Reason: 2 dependencies failed.341 Output paths:342 /nix/store/8hnr38iv9a9m4w0c0s8p57lamwkh7jl6-nixos-vm343error: Cannot build '/nix/store/2qlwmxaxzqs3wpc9k1azzzb8839vw9f4-nixos-test-driver-timescaledb.drv'.344 Reason: 1 dependency failed.345 Output paths:346 /nix/store/4b3pbm8s5bv4bzqqw1qrf888gm1c8wpv-nixos-test-driver-timescaledb347error: Cannot build '/nix/store/byhisi3dzm4cgi372sr88abykpy6q9ii-vm-test-run-timescaledb.drv'.348 Reason: 1 dependency failed.349 Output paths:350 /nix/store/4r7p38cwkn3y2bb7fm67pq977c4ma2yx-vm-test-run-timescaledb