setup
checks.x86_64-linux.ext-pgsodium
· build #133
· raw
1these 94 derivations will be built:2 /nix/store/6xiqjskc06w7z35k5pacs4276hqawiww-timescaledb.drv3 /nix/store/5v6a4ssacxc4snck5dzagkmqhcsh2swz-pg_net-0.19.5.drv4 /nix/store/7b5ar71808xp6cc9vi64vcr3gxhaq9w2-pg_net-0.14.0.drv5 /nix/store/ggfg6al5fkdp0r1jsc3iabgz0p7g6l1m-pg_net-0.7.drv6 /nix/store/hfwkzpr1kplwaywhvayqm6j4gsva8n5n-pg_net-0.20.0.drv7 /nix/store/ymx9gp4jhvd7qpjvk95vw2m6ycb0jal7-pg_net-0.13.0.drv8 /nix/store/94hi7qqfg86lfxqnyqizx334my0yjbh3-pg_net.drv9 /nix/store/lzgjq8v4l4vm5lwyxkllg0ii0n1vvam6-http.drv10 /nix/store/pjhzv6b54gh758msf91ibg3aggs5v63y-safeupdate.drv11 /nix/store/rcl303fv0rxrbkgjcwqi92h8hlsksl86-plv8.drv12 /nix/store/w8w3j8l9i3fwp8lvrddpz6szlbsz1b80-wrappers.drv13 /nix/store/ypgp6sck1rcalskz253f3a3g2vg8dqxn-postgis.drv14 /nix/store/zpy0anvh5rgr1fnrs39j7db1j07adpip-rum.drv15 /nix/store/a5gfyj0k47cxv70v4a1zhhk1998vd290-postgresql-and-plugins-15.19.drv16 /nix/store/69zc44dp9979jf4p9hcpgfdf1wgpw40l-postgresql-and-plugins-15.19.drv17 /nix/store/1nyr8hxhdprfgmxj3y07r35vb4vwpcbc-pgrouting.drv18 /nix/store/2z9gqy2kdcqh0l3s21fdvaiwji4bw085-wrappers.drv19 /nix/store/5qbkncy11hxa3hjvxlivyk5jl56cqaca-pgroonga.drv20 /nix/store/67j8ga6fwaypskbxhllbgq14gg17lbgv-plpgsql_check.drv21 /nix/store/a1l87bw0qg8qb986f3iw25zbq2bh1kxl-wal2json.drv22 /nix/store/g8h2i50jjjbj01nf9na2hjc5p8jilfwq-vector.drv23 /nix/store/g9clk05ymhqn7csk59fpd1iksabh2vp2-safeupdate.drv24 /nix/store/h5axh42309k5kr942f64rxkr35s86nhm-pgtap.drv25 /nix/store/izcyq3yalzyqj7np7qbzynzk3k2ly0bi-supabase_vault.drv26 /nix/store/mdaxp5nsyc1yzfzmbyblarpc0sh9wwap-pg_graphql.drv27 /nix/store/q1dbay5va74kwxzxl0mj6q02899srnx1-plan_filter.drv28 /nix/store/r4vfiabbhgs1g8sj39raqak5w0yz6ks3-pgsodium.drv29 /nix/store/vgh7yrjnkl0nxm6bv1ssagw53l2zp28w-rum.drv30 /nix/store/bv2b3hyfiwg59frhybs6cmf9l26byfrs-pg_net-0.13.0.drv31 /nix/store/dxjxg15c0m6vdgy5yswqbm50g4fww2p1-pg_net-0.14.0.drv32 /nix/store/jvalwdcdi2ci9kcx1q2zx6hyla1sa738-pg_net-0.20.0.drv33 /nix/store/v7i610b6q10zpsd2536yvba9pd2xqrr6-pg_net-0.19.5.drv34 /nix/store/zd0hg58y5nwnnwfzy7sd19l7dzx4zvv5-pg_net.drv35 /nix/store/m7073j3kxn6vxs53jdm448q51cxiimys-postgresql-and-plugins-17_22.drv36 /nix/store/q8qv7gf9izi4my9mjapggg0fx2dhzlwc-postgresql-and-plugins-17_22.drv37 /nix/store/ggzwf7y9bbwypxs8a44lg59dd3cbp5k5-system-path.drv38 /nix/store/7mf1lcyklc71a89s4mi3r7w8k39ihvya-dbus-1.drv39 /nix/store/wd8irv2ffhnmkp1bdcqcf4x5nyhapq43-X-Restart-Triggers-dbus.drv40 /nix/store/2i01a9qxfbdjlvkl937aq52x148dm5hk-unit-dbus.service.drv41 /nix/store/6axq4j62rji3faz7rvgyjfccczni7z3n-user-units.drv42 /nix/store/y85ggf9qcv7hsaxx3fyr5a14nf67953g-postgresql-orioledb-init.drv43 /nix/store/6dmfl5hj72ck728kvz45gg2241dk81ci-unit-postgresql.service.drv44 /nix/store/9hia6rkh5qzm30dxyfjihl6251cmnv0l-unit-dbus.service.drv45 /nix/store/7p4sg9x4d75pncaxpl0sa51ja5k2bik8-supabase-orioledb-db-init.drv46 /nix/store/dadjlp1c0v94bsq44xmi8yl99z9dwd3n-unit-supabase-db-init.service.drv47 /nix/store/nnswm02aq5rs1v3j77dlnha5mh5c19z7-system-units.drv48 /nix/store/dys7bm2r3m1f5zv7a66ajhqdsxph4zlw-etc.drv49 /nix/store/0mzm2f6fa46w1xld4wk2fb47gg0spks1-activate.drv50 /nix/store/yr25cab0bgg2gdcjr0fkk052aqw4ag84-postgresql-init.drv51 /nix/store/18idp8l89ga0vbjdvp5y33m42h8ypb3n-unit-postgresql.service.drv52 /nix/store/1qxq6npfmh7zfj0qs2ld3a1fpd0sbr7k-pg_repack.drv53 /nix/store/8rlk8y0giv6av6yxjvain89wy868fxzw-postgis.drv54 /nix/store/h3jfznl8xhwm8wvvxg23yj74srzz3vii-pg_net-0.19.5.drv55 /nix/store/jdx62c5jlcjxsbqjaqi25zwfy2ys9jp5-pg_net-0.13.0.drv56 /nix/store/ky294hja2giinx8655lj1d83j4jq5gjj-pg_net-0.14.0.drv57 /nix/store/ky7414m088qm5h8xn9z7xzw0k08wgcrh-pg_net-0.20.0.drv58 /nix/store/cqdc5q7n6g9pkxy0cjcvkq185rps4bfd-pg_net.drv59 /nix/store/pp6iq08yhjcnrm9cpgfn8bnlskbj452w-pgroonga.drv60 /nix/store/vjn7gz0pab3nkxs3klbqdbi8j68v291p-pgrouting.drv61 /nix/store/xibm7yh8fni2maxnqscqm8mmsswpv9nb-plpgsql_check.drv62 /nix/store/z1c8kqi7q1ixgzsnw9i726rj3jk14b9v-wal2json.drv63 /nix/store/d5s4s970iizz6a8w5ndnpzyw63w1m1qv-postgresql-and-plugins-17.11.drv64 /nix/store/7hla3p20yajypj5w3hnrx38bc3kq14vq-postgresql-and-plugins-17.11.drv65 /nix/store/319yam8jpgm13yfxs5psx2g1j4zd346h-postgresql-migrate.drv66 /nix/store/sn90bhb87fs1r7szfvpnhakcf5cbqipi-system-path.drv67 /nix/store/rnjj94ch4qaxpyhgvk900hq1rp2ji4cx-dbus-1.drv68 /nix/store/bj8k3q4xx5yxsjpcz0k6pjkann65ifyp-X-Restart-Triggers-dbus.drv69 /nix/store/ljfzjxqwx4kxjwxjjlnpaqdzh0xqd7xr-unit-dbus.service.drv70 /nix/store/jphjq6s3xb6lm1r9a0yllq3wvcijkikd-user-units.drv71 /nix/store/9dhmhlajdjqsz58msmq42lwanwgk4c0z-supabase-db-init.drv72 /nix/store/9189fi92i7805xz024zxxwljw2xfqplf-unit-supabase-db-init.service.drv73 /nix/store/ks9rz4w18q5w6apnl8bszi42p6fqb7w9-unit-dbus.service.drv74 /nix/store/w29pxvjbvdmyac5wz16l2kakq9n2w4dn-system-units.drv75 /nix/store/5i64fsbcnqkbbwyscs590q4x0kckm8vz-etc.drv76 /nix/store/f3zaq5gia1p450hfwx1a5ka9b2crwvpc-activate.drv77 /nix/store/flpw9rfcwf20596nm3x5g91lj4wx6gsa-nixos-system-server-test.drv78 /nix/store/rp3411xgkcmbnrvxwgg7kxxlhj217519-system-path.drv79 /nix/store/jwcb2kgwrcwds3m6z7byrg26qackyaxf-dbus-1.drv80 /nix/store/hkbib28lgy3sdk60wwh6fnjx17lrpkd0-X-Restart-Triggers-dbus.drv81 /nix/store/zbb4xyx08cfb7d20vxf6chbzvcw94xva-unit-dbus.service.drv82 /nix/store/6w9n69ddwya8kjxyrz8n8p48cnhhv8m2-user-units.drv83 /nix/store/a0nhwyhawfp54kccbpjcvlkybsc46m66-unit-dbus.service.drv84 /nix/store/vl4z7w7y2dciycqgcm6qp86dpgddrqgg-unit-postgresql.service.drv85 /nix/store/xvpj8kcdwibf0zb3lvh74lg9sn132fb6-unit-postgresql-migrate.service.drv86 /nix/store/bk16kzbxqyyqfg6qlmkplrgfhv7k21kl-system-units.drv87 /nix/store/yigqx2853rhqfbmrfci5bzld6c089mrd-etc.drv88 /nix/store/9i17zb3islwpb2pj7iwsw6d08gv9zdi2-activate.drv89 /nix/store/imr0jfl9r75i4l9br1zkqw4li7qls97p-nixos-system-server-test.drv90 /nix/store/zn5pqckvabyvbj8b760an4hwnbp3x1vx-nixos-system-server-test.drv91 /nix/store/l3g0a20fmxqmkdp4radxq4r3xd5jwzjy-closure-info.drv92 /nix/store/q1smldjprgklvy119fkq6b38a23idjc4-run-nixos-vm.drv93 /nix/store/c0y8vb21y52ps11vi8ajzkqyvl7dd7nz-nixos-vm.drv94 /nix/store/6d0r0imy0668ahjc9kfb0qx03lmlbgxh-nixos-test-driver-pgsodium.drv95 /nix/store/fnxqz04mjag1cm2wz3pzcrc3wv5ivq7a-vm-test-run-pgsodium.drv96error: Cannot build '/nix/store/bv2b3hyfiwg59frhybs6cmf9l26byfrs-pg_net-0.13.0.drv'.97 Reason: builder failed with exit code 2.98 Output paths:99 /nix/store/78qw5358gp449syn03ah921j442fw14j-pg_net-0.13.0100 Last 25 log lines:101 > | ^~~~~~~~~~~~~~102 > src/util.h:6:11: warning: call to 'Wcurl_easy_setopt_err_long' declared with attribute warning: curl_easy_setopt expects a long argument [-Wattribute-warning]103 > 6 | if (curl_easy_setopt(hdl, opt, prm) != CURLE_OK) \104 > | ^~~~~~~~~~~~~~~~105 > src/core.c:108:3: note: in expansion of macro 'CURL_EZ_SETOPT'106 > 108 | CURL_EZ_SETOPT(curl_ez_handle, CURLOPT_TIMEOUT_MS, timeout_milliseconds);107 > | ^~~~~~~~~~~~~~108 > src/util.h:6:11: warning: call to 'Wcurl_easy_setopt_err_long' declared with attribute warning: curl_easy_setopt expects a long argument [-Wattribute-warning]109 > 6 | if (curl_easy_setopt(hdl, opt, prm) != CURLE_OK) \110 > | ^~~~~~~~~~~~~~~~111 > src/core.c:110:3: note: in expansion of macro 'CURL_EZ_SETOPT'112 > 110 | CURL_EZ_SETOPT(curl_ez_handle, CURLOPT_FOLLOWLOCATION, true);113 > | ^~~~~~~~~~~~~~114 > gcc -Wall -Wmissing-prototypes -Wpointer-arith -Wdeclaration-after-statement -Werror=vla -Wendif-labels -Wmissing-format-attribute -Wimplicit-fallthrough=3 -Wcast-function-type -Wshadow=compatible-local -Wformat-security -fno-strict-aliasing -fwrapv -fexcess-precision=standard -Wno-format-truncation -Wno-stringop-truncation -g -O2 -std=c11 -Werror -Wno-declaration-after-statement -fPIC -fvisibility=hidden -DEXTVERSION=\"0.13.0\" -I. -I./ -I/nix/store/qmc7y6nc0qxg50ywm46x4iaqq5knz702-postgresql-17_22/include/server -I/nix/store/qmc7y6nc0qxg50ywm46x4iaqq5knz702-postgresql-17_22/include/internal -D_GNU_SOURCE -I/nix/store/5nl2zr46dic7mxcw6cvbq85wa8c2gngh-libxml2-2.15.1-dev/include/libxml2 -I/nix/store/sl10j863s32x7dv5vw6wfx1nh22f3xh2-lz4-1.10.0-dev/include -I/nix/store/di94mxmhhk390zzzv2gvavfwkgww7q6h-zstd-1.5.7-dev/include -I/nix/store/h5hfqhzcqszmsacj26hh3fngwcal04zs-icu4c-75.1-dev/include -c -o src/event.o src/event.c115 > In file included from /nix/store/wflnb8fxmq4lqx3ca91hlpv95vrqkv51-curl-8.17.0-dev/include/curl/curl.h:3333,116 > from /nix/store/wflnb8fxmq4lqx3ca91hlpv95vrqkv51-curl-8.17.0-dev/include/curl/multi.h:51,117 > from src/event.h:4,118 > from src/event.c:6:119 > /nix/store/wflnb8fxmq4lqx3ca91hlpv95vrqkv51-curl-8.17.0-dev/include/curl/multi.h:429:23: error: expected identifier or '(' before '__extension__'120 > 429 | CURL_EXTERN CURLMcode curl_multi_setopt(CURLM *multi_handle,121 > | ^~~~~~~~~~~~~~~~~122 > /nix/store/wflnb8fxmq4lqx3ca91hlpv95vrqkv51-curl-8.17.0-dev/include/curl/multi.h:429:23: error: expected identifier or '(' before ')' token123 > 429 | CURL_EXTERN CURLMcode curl_multi_setopt(CURLM *multi_handle,124 > | ^~~~~~~~~~~~~~~~~125 > make: *** [<builtin>: src/event.o] Error 1126 For full logs, run:127 nix log /nix/store/bv2b3hyfiwg59frhybs6cmf9l26byfrs-pg_net-0.13.0.drv128error: Cannot build '/nix/store/7b5ar71808xp6cc9vi64vcr3gxhaq9w2-pg_net-0.14.0.drv'.129 Reason: builder failed with exit code 2.130 Output paths:131 /nix/store/2vyqm50vp9dxrrm1lidjzvr6difmnnqc-pg_net-0.14.0132 Last 25 log lines:133 > src/errors.h:6:11: warning: call to 'Wcurl_easy_setopt_err_long' declared with attribute warning: curl_easy_setopt expects a long argument [-Wattribute-warning]134 > 6 | if (curl_easy_setopt(hdl, opt, prm) != CURLE_OK) \135 > | ^~~~~~~~~~~~~~~~136 > src/core.c:134:3: note: in expansion of macro 'EREPORT_CURL_SETOPT'137 > 134 | EREPORT_CURL_SETOPT(curl_ez_handle, CURLOPT_TIMEOUT_MS, cdata->timeout_milliseconds);138 > | ^~~~~~~~~~~~~~~~~~~139 > src/errors.h:6:11: warning: call to 'Wcurl_easy_setopt_err_long' declared with attribute warning: curl_easy_setopt expects a long argument [-Wattribute-warning]140 > 6 | if (curl_easy_setopt(hdl, opt, prm) != CURLE_OK) \141 > | ^~~~~~~~~~~~~~~~142 > src/core.c:136:3: note: in expansion of macro 'EREPORT_CURL_SETOPT'143 > 136 | EREPORT_CURL_SETOPT(curl_ez_handle, CURLOPT_FOLLOWLOCATION, true);144 > | ^~~~~~~~~~~~~~~~~~~145 > gcc -Wall -Wmissing-prototypes -Wpointer-arith -Wdeclaration-after-statement -Werror=vla -Wendif-labels -Wmissing-format-attribute -Wimplicit-fallthrough=3 -Wcast-function-type -Wformat-security -fno-strict-aliasing -fwrapv -fexcess-precision=standard -Wno-deprecated-non-prototype -Wno-format-truncation -Wno-stringop-truncation -g -O2 -std=gnu17 -std=c11 -Werror -Wno-declaration-after-statement -fPIC -DEXTVERSION=\"0.14.0\" -I. -I./ -I/nix/store/804f042cyc4dca4vwl2fmh1rhfy0sij9-postgresql-15.19/include/server -I/nix/store/804f042cyc4dca4vwl2fmh1rhfy0sij9-postgresql-15.19/include/internal -D_GNU_SOURCE -I/nix/store/5nl2zr46dic7mxcw6cvbq85wa8c2gngh-libxml2-2.15.1-dev/include/libxml2 -I/nix/store/sl10j863s32x7dv5vw6wfx1nh22f3xh2-lz4-1.10.0-dev/include -I/nix/store/di94mxmhhk390zzzv2gvavfwkgww7q6h-zstd-1.5.7-dev/include -I/nix/store/h5hfqhzcqszmsacj26hh3fngwcal04zs-icu4c-75.1-dev/include -c -o src/errors.o src/errors.c146 > gcc -Wall -Wmissing-prototypes -Wpointer-arith -Wdeclaration-after-statement -Werror=vla -Wendif-labels -Wmissing-format-attribute -Wimplicit-fallthrough=3 -Wcast-function-type -Wformat-security -fno-strict-aliasing -fwrapv -fexcess-precision=standard -Wno-deprecated-non-prototype -Wno-format-truncation -Wno-stringop-truncation -g -O2 -std=gnu17 -std=c11 -Werror -Wno-declaration-after-statement -fPIC -DEXTVERSION=\"0.14.0\" -I. -I./ -I/nix/store/804f042cyc4dca4vwl2fmh1rhfy0sij9-postgresql-15.19/include/server -I/nix/store/804f042cyc4dca4vwl2fmh1rhfy0sij9-postgresql-15.19/include/internal -D_GNU_SOURCE -I/nix/store/5nl2zr46dic7mxcw6cvbq85wa8c2gngh-libxml2-2.15.1-dev/include/libxml2 -I/nix/store/sl10j863s32x7dv5vw6wfx1nh22f3xh2-lz4-1.10.0-dev/include -I/nix/store/di94mxmhhk390zzzv2gvavfwkgww7q6h-zstd-1.5.7-dev/include -I/nix/store/h5hfqhzcqszmsacj26hh3fngwcal04zs-icu4c-75.1-dev/include -c -o src/event.o src/event.c147 > In file included from /nix/store/wflnb8fxmq4lqx3ca91hlpv95vrqkv51-curl-8.17.0-dev/include/curl/curl.h:3333,148 > from /nix/store/wflnb8fxmq4lqx3ca91hlpv95vrqkv51-curl-8.17.0-dev/include/curl/multi.h:51,149 > from src/event.h:4,150 > from src/event.c:6:151 > /nix/store/wflnb8fxmq4lqx3ca91hlpv95vrqkv51-curl-8.17.0-dev/include/curl/multi.h:429:23: error: expected identifier or '(' before '__extension__'152 > 429 | CURL_EXTERN CURLMcode curl_multi_setopt(CURLM *multi_handle,153 > | ^~~~~~~~~~~~~~~~~154 > /nix/store/wflnb8fxmq4lqx3ca91hlpv95vrqkv51-curl-8.17.0-dev/include/curl/multi.h:429:23: error: expected identifier or '(' before ')' token155 > 429 | CURL_EXTERN CURLMcode curl_multi_setopt(CURLM *multi_handle,156 > | ^~~~~~~~~~~~~~~~~157 > make: *** [<builtin>: src/event.o] Error 1158 For full logs, run:159 nix log /nix/store/7b5ar71808xp6cc9vi64vcr3gxhaq9w2-pg_net-0.14.0.drv160error: Cannot build '/nix/store/dxjxg15c0m6vdgy5yswqbm50g4fww2p1-pg_net-0.14.0.drv'.161 Reason: builder failed with exit code 2.162 Output paths:163 /nix/store/xqh65xhxx9wcmpgwvzh7kkpf9zs0y72x-pg_net-0.14.0164 Last 25 log lines:165 > src/errors.h:6:11: warning: call to 'Wcurl_easy_setopt_err_long' declared with attribute warning: curl_easy_setopt expects a long argument [-Wattribute-warning]166 > 6 | if (curl_easy_setopt(hdl, opt, prm) != CURLE_OK) \167 > | ^~~~~~~~~~~~~~~~168 > src/core.c:134:3: note: in expansion of macro 'EREPORT_CURL_SETOPT'169 > 134 | EREPORT_CURL_SETOPT(curl_ez_handle, CURLOPT_TIMEOUT_MS, cdata->timeout_milliseconds);170 > | ^~~~~~~~~~~~~~~~~~~171 > src/errors.h:6:11: warning: call to 'Wcurl_easy_setopt_err_long' declared with attribute warning: curl_easy_setopt expects a long argument [-Wattribute-warning]172 > 6 | if (curl_easy_setopt(hdl, opt, prm) != CURLE_OK) \173 > | ^~~~~~~~~~~~~~~~174 > src/core.c:136:3: note: in expansion of macro 'EREPORT_CURL_SETOPT'175 > 136 | EREPORT_CURL_SETOPT(curl_ez_handle, CURLOPT_FOLLOWLOCATION, true);176 > | ^~~~~~~~~~~~~~~~~~~177 > gcc -Wall -Wmissing-prototypes -Wpointer-arith -Wdeclaration-after-statement -Werror=vla -Wendif-labels -Wmissing-format-attribute -Wimplicit-fallthrough=3 -Wcast-function-type -Wshadow=compatible-local -Wformat-security -fno-strict-aliasing -fwrapv -fexcess-precision=standard -Wno-format-truncation -Wno-stringop-truncation -g -O2 -std=c11 -Werror -Wno-declaration-after-statement -fPIC -fvisibility=hidden -DEXTVERSION=\"0.14.0\" -I. -I./ -I/nix/store/qmc7y6nc0qxg50ywm46x4iaqq5knz702-postgresql-17_22/include/server -I/nix/store/qmc7y6nc0qxg50ywm46x4iaqq5knz702-postgresql-17_22/include/internal -D_GNU_SOURCE -I/nix/store/5nl2zr46dic7mxcw6cvbq85wa8c2gngh-libxml2-2.15.1-dev/include/libxml2 -I/nix/store/sl10j863s32x7dv5vw6wfx1nh22f3xh2-lz4-1.10.0-dev/include -I/nix/store/di94mxmhhk390zzzv2gvavfwkgww7q6h-zstd-1.5.7-dev/include -I/nix/store/h5hfqhzcqszmsacj26hh3fngwcal04zs-icu4c-75.1-dev/include -c -o src/errors.o src/errors.c178 > gcc -Wall -Wmissing-prototypes -Wpointer-arith -Wdeclaration-after-statement -Werror=vla -Wendif-labels -Wmissing-format-attribute -Wimplicit-fallthrough=3 -Wcast-function-type -Wshadow=compatible-local -Wformat-security -fno-strict-aliasing -fwrapv -fexcess-precision=standard -Wno-format-truncation -Wno-stringop-truncation -g -O2 -std=c11 -Werror -Wno-declaration-after-statement -fPIC -fvisibility=hidden -DEXTVERSION=\"0.14.0\" -I. -I./ -I/nix/store/qmc7y6nc0qxg50ywm46x4iaqq5knz702-postgresql-17_22/include/server -I/nix/store/qmc7y6nc0qxg50ywm46x4iaqq5knz702-postgresql-17_22/include/internal -D_GNU_SOURCE -I/nix/store/5nl2zr46dic7mxcw6cvbq85wa8c2gngh-libxml2-2.15.1-dev/include/libxml2 -I/nix/store/sl10j863s32x7dv5vw6wfx1nh22f3xh2-lz4-1.10.0-dev/include -I/nix/store/di94mxmhhk390zzzv2gvavfwkgww7q6h-zstd-1.5.7-dev/include -I/nix/store/h5hfqhzcqszmsacj26hh3fngwcal04zs-icu4c-75.1-dev/include -c -o src/event.o src/event.c179 > In file included from /nix/store/wflnb8fxmq4lqx3ca91hlpv95vrqkv51-curl-8.17.0-dev/include/curl/curl.h:3333,180 > from /nix/store/wflnb8fxmq4lqx3ca91hlpv95vrqkv51-curl-8.17.0-dev/include/curl/multi.h:51,181 > from src/event.h:4,182 > from src/event.c:6:183 > /nix/store/wflnb8fxmq4lqx3ca91hlpv95vrqkv51-curl-8.17.0-dev/include/curl/multi.h:429:23: error: expected identifier or '(' before '__extension__'184 > 429 | CURL_EXTERN CURLMcode curl_multi_setopt(CURLM *multi_handle,185 > | ^~~~~~~~~~~~~~~~~186 > /nix/store/wflnb8fxmq4lqx3ca91hlpv95vrqkv51-curl-8.17.0-dev/include/curl/multi.h:429:23: error: expected identifier or '(' before ')' token187 > 429 | CURL_EXTERN CURLMcode curl_multi_setopt(CURLM *multi_handle,188 > | ^~~~~~~~~~~~~~~~~189 > make: *** [<builtin>: src/event.o] Error 1190 For full logs, run:191 nix log /nix/store/dxjxg15c0m6vdgy5yswqbm50g4fww2p1-pg_net-0.14.0.drv192error: Cannot build '/nix/store/ky294hja2giinx8655lj1d83j4jq5gjj-pg_net-0.14.0.drv'.193 Reason: builder failed with exit code 2.194 Output paths:195 /nix/store/da6kcjzl896sjpnd8rrkfzykfm8chlaz-pg_net-0.14.0196 Last 25 log lines:197 > src/errors.h:6:11: warning: call to 'Wcurl_easy_setopt_err_long' declared with attribute warning: curl_easy_setopt expects a long argument [-Wattribute-warning]198 > 6 | if (curl_easy_setopt(hdl, opt, prm) != CURLE_OK) \199 > | ^~~~~~~~~~~~~~~~200 > src/core.c:134:3: note: in expansion of macro 'EREPORT_CURL_SETOPT'201 > 134 | EREPORT_CURL_SETOPT(curl_ez_handle, CURLOPT_TIMEOUT_MS, cdata->timeout_milliseconds);202 > | ^~~~~~~~~~~~~~~~~~~203 > src/errors.h:6:11: warning: call to 'Wcurl_easy_setopt_err_long' declared with attribute warning: curl_easy_setopt expects a long argument [-Wattribute-warning]204 > 6 | if (curl_easy_setopt(hdl, opt, prm) != CURLE_OK) \205 > | ^~~~~~~~~~~~~~~~206 > src/core.c:136:3: note: in expansion of macro 'EREPORT_CURL_SETOPT'207 > 136 | EREPORT_CURL_SETOPT(curl_ez_handle, CURLOPT_FOLLOWLOCATION, true);208 > | ^~~~~~~~~~~~~~~~~~~209 > gcc -Wall -Wmissing-prototypes -Wpointer-arith -Wdeclaration-after-statement -Werror=vla -Wendif-labels -Wmissing-format-attribute -Wimplicit-fallthrough=3 -Wcast-function-type -Wshadow=compatible-local -Wformat-security -fno-strict-aliasing -fwrapv -fexcess-precision=standard -Wno-format-truncation -Wno-stringop-truncation -g -O2 -std=c11 -Werror -Wno-declaration-after-statement -fPIC -fvisibility=hidden -DEXTVERSION=\"0.14.0\" -I. -I./ -I/nix/store/dj25xabr71j1mmxf628lqsn61qd5qcyk-postgresql-17.11/include/server -I/nix/store/dj25xabr71j1mmxf628lqsn61qd5qcyk-postgresql-17.11/include/internal -D_GNU_SOURCE -I/nix/store/5nl2zr46dic7mxcw6cvbq85wa8c2gngh-libxml2-2.15.1-dev/include/libxml2 -I/nix/store/sl10j863s32x7dv5vw6wfx1nh22f3xh2-lz4-1.10.0-dev/include -I/nix/store/di94mxmhhk390zzzv2gvavfwkgww7q6h-zstd-1.5.7-dev/include -I/nix/store/h5hfqhzcqszmsacj26hh3fngwcal04zs-icu4c-75.1-dev/include -c -o src/errors.o src/errors.c210 > gcc -Wall -Wmissing-prototypes -Wpointer-arith -Wdeclaration-after-statement -Werror=vla -Wendif-labels -Wmissing-format-attribute -Wimplicit-fallthrough=3 -Wcast-function-type -Wshadow=compatible-local -Wformat-security -fno-strict-aliasing -fwrapv -fexcess-precision=standard -Wno-format-truncation -Wno-stringop-truncation -g -O2 -std=c11 -Werror -Wno-declaration-after-statement -fPIC -fvisibility=hidden -DEXTVERSION=\"0.14.0\" -I. -I./ -I/nix/store/dj25xabr71j1mmxf628lqsn61qd5qcyk-postgresql-17.11/include/server -I/nix/store/dj25xabr71j1mmxf628lqsn61qd5qcyk-postgresql-17.11/include/internal -D_GNU_SOURCE -I/nix/store/5nl2zr46dic7mxcw6cvbq85wa8c2gngh-libxml2-2.15.1-dev/include/libxml2 -I/nix/store/sl10j863s32x7dv5vw6wfx1nh22f3xh2-lz4-1.10.0-dev/include -I/nix/store/di94mxmhhk390zzzv2gvavfwkgww7q6h-zstd-1.5.7-dev/include -I/nix/store/h5hfqhzcqszmsacj26hh3fngwcal04zs-icu4c-75.1-dev/include -c -o src/event.o src/event.c211 > In file included from /nix/store/wflnb8fxmq4lqx3ca91hlpv95vrqkv51-curl-8.17.0-dev/include/curl/curl.h:3333,212 > from /nix/store/wflnb8fxmq4lqx3ca91hlpv95vrqkv51-curl-8.17.0-dev/include/curl/multi.h:51,213 > from src/event.h:4,214 > from src/event.c:6:215 > /nix/store/wflnb8fxmq4lqx3ca91hlpv95vrqkv51-curl-8.17.0-dev/include/curl/multi.h:429:23: error: expected identifier or '(' before '__extension__'216 > 429 | CURL_EXTERN CURLMcode curl_multi_setopt(CURLM *multi_handle,217 > | ^~~~~~~~~~~~~~~~~218 > /nix/store/wflnb8fxmq4lqx3ca91hlpv95vrqkv51-curl-8.17.0-dev/include/curl/multi.h:429:23: error: expected identifier or '(' before ')' token219 > 429 | CURL_EXTERN CURLMcode curl_multi_setopt(CURLM *multi_handle,220 > | ^~~~~~~~~~~~~~~~~221 > make: *** [<builtin>: src/event.o] Error 1222 For full logs, run:223 nix log /nix/store/ky294hja2giinx8655lj1d83j4jq5gjj-pg_net-0.14.0.drv224error: Cannot build '/nix/store/ggfg6al5fkdp0r1jsc3iabgz0p7g6l1m-pg_net-0.7.drv'.225 Reason: builder failed with exit code 2.226 Output paths:227 /nix/store/pkfapf0li10b8b6nrhwm8880g4d2i8y5-pg_net-0.7228 Last 25 log lines:229 > | ^~~~~~~~~~~~~~230 > src/util.h:6:11: warning: call to 'Wcurl_easy_setopt_err_long' declared with attribute warning: curl_easy_setopt expects a long argument [-Wattribute-warning]231 > 6 | if (curl_easy_setopt(hdl, opt, prm) != CURLE_OK) \232 > | ^~~~~~~~~~~~~~~~233 > src/core.c:108:3: note: in expansion of macro 'CURL_EZ_SETOPT'234 > 108 | CURL_EZ_SETOPT(curl_ez_handle, CURLOPT_TIMEOUT_MS, timeout_milliseconds);235 > | ^~~~~~~~~~~~~~236 > src/util.h:6:11: warning: call to 'Wcurl_easy_setopt_err_long' declared with attribute warning: curl_easy_setopt expects a long argument [-Wattribute-warning]237 > 6 | if (curl_easy_setopt(hdl, opt, prm) != CURLE_OK) \238 > | ^~~~~~~~~~~~~~~~239 > src/core.c:110:3: note: in expansion of macro 'CURL_EZ_SETOPT'240 > 110 | CURL_EZ_SETOPT(curl_ez_handle, CURLOPT_FOLLOWLOCATION, true);241 > | ^~~~~~~~~~~~~~242 > gcc -Wall -Wmissing-prototypes -Wpointer-arith -Wdeclaration-after-statement -Werror=vla -Wendif-labels -Wmissing-format-attribute -Wimplicit-fallthrough=3 -Wcast-function-type -Wformat-security -fno-strict-aliasing -fwrapv -fexcess-precision=standard -Wno-deprecated-non-prototype -Wno-format-truncation -Wno-stringop-truncation -g -O2 -std=gnu17 -std=c11 -Werror -Wno-declaration-after-statement -fPIC -DEXTVERSION=\"0.13.0\" -I. -I./ -I/nix/store/804f042cyc4dca4vwl2fmh1rhfy0sij9-postgresql-15.19/include/server -I/nix/store/804f042cyc4dca4vwl2fmh1rhfy0sij9-postgresql-15.19/include/internal -D_GNU_SOURCE -I/nix/store/5nl2zr46dic7mxcw6cvbq85wa8c2gngh-libxml2-2.15.1-dev/include/libxml2 -I/nix/store/sl10j863s32x7dv5vw6wfx1nh22f3xh2-lz4-1.10.0-dev/include -I/nix/store/di94mxmhhk390zzzv2gvavfwkgww7q6h-zstd-1.5.7-dev/include -I/nix/store/h5hfqhzcqszmsacj26hh3fngwcal04zs-icu4c-75.1-dev/include -c -o src/event.o src/event.c243 > In file included from /nix/store/wflnb8fxmq4lqx3ca91hlpv95vrqkv51-curl-8.17.0-dev/include/curl/curl.h:3333,244 > from /nix/store/wflnb8fxmq4lqx3ca91hlpv95vrqkv51-curl-8.17.0-dev/include/curl/multi.h:51,245 > from src/event.h:4,246 > from src/event.c:6:247 > /nix/store/wflnb8fxmq4lqx3ca91hlpv95vrqkv51-curl-8.17.0-dev/include/curl/multi.h:429:23: error: expected identifier or '(' before '__extension__'248 > 429 | CURL_EXTERN CURLMcode curl_multi_setopt(CURLM *multi_handle,249 > | ^~~~~~~~~~~~~~~~~250 > /nix/store/wflnb8fxmq4lqx3ca91hlpv95vrqkv51-curl-8.17.0-dev/include/curl/multi.h:429:23: error: expected identifier or '(' before ')' token251 > 429 | CURL_EXTERN CURLMcode curl_multi_setopt(CURLM *multi_handle,252 > | ^~~~~~~~~~~~~~~~~253 > make: *** [<builtin>: src/event.o] Error 1254 For full logs, run:255 nix log /nix/store/ggfg6al5fkdp0r1jsc3iabgz0p7g6l1m-pg_net-0.7.drv256error: Cannot build '/nix/store/jvalwdcdi2ci9kcx1q2zx6hyla1sa738-pg_net-0.20.0.drv'.257 Reason: builder failed with exit code 2.258 Output paths:259 /nix/store/rqjwkm6vikims9d8b7f0a6x4n2qbkq4s-pg_net-0.20.0260 Last 22 log lines:261 > Running phase: unpackPhase262 > unpacking source archive /nix/store/3783i7yhcfqnyv5ndli22gcr11ap151m-source263 > source root is source264 > Running phase: patchPhase265 > Running phase: updateAutotoolsGnuConfigScriptsPhase266 > Running phase: configurePhase267 > no configure script, doing nothing268 > Running phase: buildPhase269 > gcc -Wall -Wmissing-prototypes -Wpointer-arith -Wdeclaration-after-statement -Werror=vla -Wendif-labels -Wmissing-format-attribute -Wimplicit-fallthrough=3 -Wcast-function-type -Wshadow=compatible-local -Wformat-security -fno-strict-aliasing -fwrapv -fexcess-precision=standard -Wno-format-truncation -Wno-stringop-truncation -g -O2 -std=c11 -Wextra -Wall -Werror -Wno-declaration-after-statement -Wno-vla -Wno-long-long -Wmissing-variable-declarations -fPIC -fvisibility=hidden -DEXTVERSION=\"0.20.0\" -I. -I./ -I/nix/store/qmc7y6nc0qxg50ywm46x4iaqq5knz702-postgresql-17_22/include/server -I/nix/store/qmc7y6nc0qxg50ywm46x4iaqq5knz702-postgresql-17_22/include/internal -D_GNU_SOURCE -I/nix/store/5nl2zr46dic7mxcw6cvbq85wa8c2gngh-libxml2-2.15.1-dev/include/libxml2 -I/nix/store/sl10j863s32x7dv5vw6wfx1nh22f3xh2-lz4-1.10.0-dev/include -I/nix/store/di94mxmhhk390zzzv2gvavfwkgww7q6h-zstd-1.5.7-dev/include -I/nix/store/h5hfqhzcqszmsacj26hh3fngwcal04zs-icu4c-75.1-dev/include -c -o src/core.o src/core.c270 > gcc -Wall -Wmissing-prototypes -Wpointer-arith -Wdeclaration-after-statement -Werror=vla -Wendif-labels -Wmissing-format-attribute -Wimplicit-fallthrough=3 -Wcast-function-type -Wshadow=compatible-local -Wformat-security -fno-strict-aliasing -fwrapv -fexcess-precision=standard -Wno-format-truncation -Wno-stringop-truncation -g -O2 -std=c11 -Wextra -Wall -Werror -Wno-declaration-after-statement -Wno-vla -Wno-long-long -Wmissing-variable-declarations -fPIC -fvisibility=hidden -DEXTVERSION=\"0.20.0\" -I. -I./ -I/nix/store/qmc7y6nc0qxg50ywm46x4iaqq5knz702-postgresql-17_22/include/server -I/nix/store/qmc7y6nc0qxg50ywm46x4iaqq5knz702-postgresql-17_22/include/internal -D_GNU_SOURCE -I/nix/store/5nl2zr46dic7mxcw6cvbq85wa8c2gngh-libxml2-2.15.1-dev/include/libxml2 -I/nix/store/sl10j863s32x7dv5vw6wfx1nh22f3xh2-lz4-1.10.0-dev/include -I/nix/store/di94mxmhhk390zzzv2gvavfwkgww7q6h-zstd-1.5.7-dev/include -I/nix/store/h5hfqhzcqszmsacj26hh3fngwcal04zs-icu4c-75.1-dev/include -c -o src/errors.o src/errors.c271 > gcc -Wall -Wmissing-prototypes -Wpointer-arith -Wdeclaration-after-statement -Werror=vla -Wendif-labels -Wmissing-format-attribute -Wimplicit-fallthrough=3 -Wcast-function-type -Wshadow=compatible-local -Wformat-security -fno-strict-aliasing -fwrapv -fexcess-precision=standard -Wno-format-truncation -Wno-stringop-truncation -g -O2 -std=c11 -Wextra -Wall -Werror -Wno-declaration-after-statement -Wno-vla -Wno-long-long -Wmissing-variable-declarations -fPIC -fvisibility=hidden -DEXTVERSION=\"0.20.0\" -I. -I./ -I/nix/store/qmc7y6nc0qxg50ywm46x4iaqq5knz702-postgresql-17_22/include/server -I/nix/store/qmc7y6nc0qxg50ywm46x4iaqq5knz702-postgresql-17_22/include/internal -D_GNU_SOURCE -I/nix/store/5nl2zr46dic7mxcw6cvbq85wa8c2gngh-libxml2-2.15.1-dev/include/libxml2 -I/nix/store/sl10j863s32x7dv5vw6wfx1nh22f3xh2-lz4-1.10.0-dev/include -I/nix/store/di94mxmhhk390zzzv2gvavfwkgww7q6h-zstd-1.5.7-dev/include -I/nix/store/h5hfqhzcqszmsacj26hh3fngwcal04zs-icu4c-75.1-dev/include -c -o src/event.o src/event.c272 > In file included from /nix/store/wflnb8fxmq4lqx3ca91hlpv95vrqkv51-curl-8.17.0-dev/include/curl/curl.h:3333,273 > from /nix/store/wflnb8fxmq4lqx3ca91hlpv95vrqkv51-curl-8.17.0-dev/include/curl/multi.h:51,274 > from src/event.h:4,275 > from src/event.c:6:276 > /nix/store/wflnb8fxmq4lqx3ca91hlpv95vrqkv51-curl-8.17.0-dev/include/curl/multi.h:429:23: error: expected identifier or '(' before '__extension__'277 > 429 | CURL_EXTERN CURLMcode curl_multi_setopt(CURLM *multi_handle,278 > | ^~~~~~~~~~~~~~~~~279 > /nix/store/wflnb8fxmq4lqx3ca91hlpv95vrqkv51-curl-8.17.0-dev/include/curl/multi.h:429:23: error: expected identifier or '(' before ')' token280 > 429 | CURL_EXTERN CURLMcode curl_multi_setopt(CURLM *multi_handle,281 > | ^~~~~~~~~~~~~~~~~282 > make: *** [<builtin>: src/event.o] Error 1283 For full logs, run:284 nix log /nix/store/jvalwdcdi2ci9kcx1q2zx6hyla1sa738-pg_net-0.20.0.drv285error: Cannot build '/nix/store/jdx62c5jlcjxsbqjaqi25zwfy2ys9jp5-pg_net-0.13.0.drv'.286 Reason: builder failed with exit code 2.287 Output paths:288 /nix/store/z8m2csva6bci9vlabgjm2wqd19ww393d-pg_net-0.13.0289 Last 25 log lines:290 > | ^~~~~~~~~~~~~~291 > src/util.h:6:11: warning: call to 'Wcurl_easy_setopt_err_long' declared with attribute warning: curl_easy_setopt expects a long argument [-Wattribute-warning]292 > 6 | if (curl_easy_setopt(hdl, opt, prm) != CURLE_OK) \293 > | ^~~~~~~~~~~~~~~~294 > src/core.c:108:3: note: in expansion of macro 'CURL_EZ_SETOPT'295 > 108 | CURL_EZ_SETOPT(curl_ez_handle, CURLOPT_TIMEOUT_MS, timeout_milliseconds);296 > | ^~~~~~~~~~~~~~297 > src/util.h:6:11: warning: call to 'Wcurl_easy_setopt_err_long' declared with attribute warning: curl_easy_setopt expects a long argument [-Wattribute-warning]298 > 6 | if (curl_easy_setopt(hdl, opt, prm) != CURLE_OK) \299 > | ^~~~~~~~~~~~~~~~300 > src/core.c:110:3: note: in expansion of macro 'CURL_EZ_SETOPT'301 > 110 | CURL_EZ_SETOPT(curl_ez_handle, CURLOPT_FOLLOWLOCATION, true);302 > | ^~~~~~~~~~~~~~303 > gcc -Wall -Wmissing-prototypes -Wpointer-arith -Wdeclaration-after-statement -Werror=vla -Wendif-labels -Wmissing-format-attribute -Wimplicit-fallthrough=3 -Wcast-function-type -Wshadow=compatible-local -Wformat-security -fno-strict-aliasing -fwrapv -fexcess-precision=standard -Wno-format-truncation -Wno-stringop-truncation -g -O2 -std=c11 -Werror -Wno-declaration-after-statement -fPIC -fvisibility=hidden -DEXTVERSION=\"0.13.0\" -I. -I./ -I/nix/store/dj25xabr71j1mmxf628lqsn61qd5qcyk-postgresql-17.11/include/server -I/nix/store/dj25xabr71j1mmxf628lqsn61qd5qcyk-postgresql-17.11/include/internal -D_GNU_SOURCE -I/nix/store/5nl2zr46dic7mxcw6cvbq85wa8c2gngh-libxml2-2.15.1-dev/include/libxml2 -I/nix/store/sl10j863s32x7dv5vw6wfx1nh22f3xh2-lz4-1.10.0-dev/include -I/nix/store/di94mxmhhk390zzzv2gvavfwkgww7q6h-zstd-1.5.7-dev/include -I/nix/store/h5hfqhzcqszmsacj26hh3fngwcal04zs-icu4c-75.1-dev/include -c -o src/event.o src/event.c304 > In file included from /nix/store/wflnb8fxmq4lqx3ca91hlpv95vrqkv51-curl-8.17.0-dev/include/curl/curl.h:3333,305 > from /nix/store/wflnb8fxmq4lqx3ca91hlpv95vrqkv51-curl-8.17.0-dev/include/curl/multi.h:51,306 > from src/event.h:4,307 > from src/event.c:6:308 > /nix/store/wflnb8fxmq4lqx3ca91hlpv95vrqkv51-curl-8.17.0-dev/include/curl/multi.h:429:23: error: expected identifier or '(' before '__extension__'309 > 429 | CURL_EXTERN CURLMcode curl_multi_setopt(CURLM *multi_handle,310 > | ^~~~~~~~~~~~~~~~~311 > /nix/store/wflnb8fxmq4lqx3ca91hlpv95vrqkv51-curl-8.17.0-dev/include/curl/multi.h:429:23: error: expected identifier or '(' before ')' token312 > 429 | CURL_EXTERN CURLMcode curl_multi_setopt(CURLM *multi_handle,313 > | ^~~~~~~~~~~~~~~~~314 > make: *** [<builtin>: src/event.o] Error 1315 For full logs, run:316 nix log /nix/store/jdx62c5jlcjxsbqjaqi25zwfy2ys9jp5-pg_net-0.13.0.drv317error: Cannot build '/nix/store/ymx9gp4jhvd7qpjvk95vw2m6ycb0jal7-pg_net-0.13.0.drv'.318 Reason: builder failed with exit code 2.319 Output paths:320 /nix/store/pxjg6rykpbbhl7xmwasvyb94bc1v5w3r-pg_net-0.13.0321 Last 25 log lines:322 > | ^~~~~~~~~~~~~~323 > src/util.h:6:11: warning: call to 'Wcurl_easy_setopt_err_long' declared with attribute warning: curl_easy_setopt expects a long argument [-Wattribute-warning]324 > 6 | if (curl_easy_setopt(hdl, opt, prm) != CURLE_OK) \325 > | ^~~~~~~~~~~~~~~~326 > src/core.c:108:3: note: in expansion of macro 'CURL_EZ_SETOPT'327 > 108 | CURL_EZ_SETOPT(curl_ez_handle, CURLOPT_TIMEOUT_MS, timeout_milliseconds);328 > | ^~~~~~~~~~~~~~329 > src/util.h:6:11: warning: call to 'Wcurl_easy_setopt_err_long' declared with attribute warning: curl_easy_setopt expects a long argument [-Wattribute-warning]330 > 6 | if (curl_easy_setopt(hdl, opt, prm) != CURLE_OK) \331 > | ^~~~~~~~~~~~~~~~332 > src/core.c:110:3: note: in expansion of macro 'CURL_EZ_SETOPT'333 > 110 | CURL_EZ_SETOPT(curl_ez_handle, CURLOPT_FOLLOWLOCATION, true);334 > | ^~~~~~~~~~~~~~335 > gcc -Wall -Wmissing-prototypes -Wpointer-arith -Wdeclaration-after-statement -Werror=vla -Wendif-labels -Wmissing-format-attribute -Wimplicit-fallthrough=3 -Wcast-function-type -Wformat-security -fno-strict-aliasing -fwrapv -fexcess-precision=standard -Wno-deprecated-non-prototype -Wno-format-truncation -Wno-stringop-truncation -g -O2 -std=gnu17 -std=c11 -Werror -Wno-declaration-after-statement -fPIC -DEXTVERSION=\"0.13.0\" -I. -I./ -I/nix/store/804f042cyc4dca4vwl2fmh1rhfy0sij9-postgresql-15.19/include/server -I/nix/store/804f042cyc4dca4vwl2fmh1rhfy0sij9-postgresql-15.19/include/internal -D_GNU_SOURCE -I/nix/store/5nl2zr46dic7mxcw6cvbq85wa8c2gngh-libxml2-2.15.1-dev/include/libxml2 -I/nix/store/sl10j863s32x7dv5vw6wfx1nh22f3xh2-lz4-1.10.0-dev/include -I/nix/store/di94mxmhhk390zzzv2gvavfwkgww7q6h-zstd-1.5.7-dev/include -I/nix/store/h5hfqhzcqszmsacj26hh3fngwcal04zs-icu4c-75.1-dev/include -c -o src/event.o src/event.c336 > In file included from /nix/store/wflnb8fxmq4lqx3ca91hlpv95vrqkv51-curl-8.17.0-dev/include/curl/curl.h:3333,337 > from /nix/store/wflnb8fxmq4lqx3ca91hlpv95vrqkv51-curl-8.17.0-dev/include/curl/multi.h:51,338 > from src/event.h:4,339 > from src/event.c:6:340 > /nix/store/wflnb8fxmq4lqx3ca91hlpv95vrqkv51-curl-8.17.0-dev/include/curl/multi.h:429:23: error: expected identifier or '(' before '__extension__'341 > 429 | CURL_EXTERN CURLMcode curl_multi_setopt(CURLM *multi_handle,342 > | ^~~~~~~~~~~~~~~~~343 > /nix/store/wflnb8fxmq4lqx3ca91hlpv95vrqkv51-curl-8.17.0-dev/include/curl/multi.h:429:23: error: expected identifier or '(' before ')' token344 > 429 | CURL_EXTERN CURLMcode curl_multi_setopt(CURLM *multi_handle,345 > | ^~~~~~~~~~~~~~~~~346 > make: *** [<builtin>: src/event.o] Error 1347 For full logs, run:348 nix log /nix/store/ymx9gp4jhvd7qpjvk95vw2m6ycb0jal7-pg_net-0.13.0.drv349error: Cannot build '/nix/store/h3jfznl8xhwm8wvvxg23yj74srzz3vii-pg_net-0.19.5.drv'.350 Reason: builder failed with exit code 2.351 Output paths:352 /nix/store/yc457kag2jhvws0021nbq7nsws86glnl-pg_net-0.19.5353 Last 22 log lines:354 > Running phase: unpackPhase355 > unpacking source archive /nix/store/5zgdqy3bz93jyn79pizxc1hks0cdcadw-source356 > source root is source357 > Running phase: patchPhase358 > Running phase: updateAutotoolsGnuConfigScriptsPhase359 > Running phase: configurePhase360 > no configure script, doing nothing361 > Running phase: buildPhase362 > gcc -Wall -Wmissing-prototypes -Wpointer-arith -Wdeclaration-after-statement -Werror=vla -Wendif-labels -Wmissing-format-attribute -Wimplicit-fallthrough=3 -Wcast-function-type -Wshadow=compatible-local -Wformat-security -fno-strict-aliasing -fwrapv -fexcess-precision=standard -Wno-format-truncation -Wno-stringop-truncation -g -O2 -std=c11 -Wextra -Wall -Werror -Wno-declaration-after-statement -Wno-vla -Wno-long-long -Wmissing-variable-declarations -fPIC -fvisibility=hidden -DEXTVERSION=\"0.19.5\" -I. -I./ -I/nix/store/dj25xabr71j1mmxf628lqsn61qd5qcyk-postgresql-17.11/include/server -I/nix/store/dj25xabr71j1mmxf628lqsn61qd5qcyk-postgresql-17.11/include/internal -D_GNU_SOURCE -I/nix/store/5nl2zr46dic7mxcw6cvbq85wa8c2gngh-libxml2-2.15.1-dev/include/libxml2 -I/nix/store/sl10j863s32x7dv5vw6wfx1nh22f3xh2-lz4-1.10.0-dev/include -I/nix/store/di94mxmhhk390zzzv2gvavfwkgww7q6h-zstd-1.5.7-dev/include -I/nix/store/h5hfqhzcqszmsacj26hh3fngwcal04zs-icu4c-75.1-dev/include -c -o src/core.o src/core.c363 > gcc -Wall -Wmissing-prototypes -Wpointer-arith -Wdeclaration-after-statement -Werror=vla -Wendif-labels -Wmissing-format-attribute -Wimplicit-fallthrough=3 -Wcast-function-type -Wshadow=compatible-local -Wformat-security -fno-strict-aliasing -fwrapv -fexcess-precision=standard -Wno-format-truncation -Wno-stringop-truncation -g -O2 -std=c11 -Wextra -Wall -Werror -Wno-declaration-after-statement -Wno-vla -Wno-long-long -Wmissing-variable-declarations -fPIC -fvisibility=hidden -DEXTVERSION=\"0.19.5\" -I. -I./ -I/nix/store/dj25xabr71j1mmxf628lqsn61qd5qcyk-postgresql-17.11/include/server -I/nix/store/dj25xabr71j1mmxf628lqsn61qd5qcyk-postgresql-17.11/include/internal -D_GNU_SOURCE -I/nix/store/5nl2zr46dic7mxcw6cvbq85wa8c2gngh-libxml2-2.15.1-dev/include/libxml2 -I/nix/store/sl10j863s32x7dv5vw6wfx1nh22f3xh2-lz4-1.10.0-dev/include -I/nix/store/di94mxmhhk390zzzv2gvavfwkgww7q6h-zstd-1.5.7-dev/include -I/nix/store/h5hfqhzcqszmsacj26hh3fngwcal04zs-icu4c-75.1-dev/include -c -o src/errors.o src/errors.c364 > gcc -Wall -Wmissing-prototypes -Wpointer-arith -Wdeclaration-after-statement -Werror=vla -Wendif-labels -Wmissing-format-attribute -Wimplicit-fallthrough=3 -Wcast-function-type -Wshadow=compatible-local -Wformat-security -fno-strict-aliasing -fwrapv -fexcess-precision=standard -Wno-format-truncation -Wno-stringop-truncation -g -O2 -std=c11 -Wextra -Wall -Werror -Wno-declaration-after-statement -Wno-vla -Wno-long-long -Wmissing-variable-declarations -fPIC -fvisibility=hidden -DEXTVERSION=\"0.19.5\" -I. -I./ -I/nix/store/dj25xabr71j1mmxf628lqsn61qd5qcyk-postgresql-17.11/include/server -I/nix/store/dj25xabr71j1mmxf628lqsn61qd5qcyk-postgresql-17.11/include/internal -D_GNU_SOURCE -I/nix/store/5nl2zr46dic7mxcw6cvbq85wa8c2gngh-libxml2-2.15.1-dev/include/libxml2 -I/nix/store/sl10j863s32x7dv5vw6wfx1nh22f3xh2-lz4-1.10.0-dev/include -I/nix/store/di94mxmhhk390zzzv2gvavfwkgww7q6h-zstd-1.5.7-dev/include -I/nix/store/h5hfqhzcqszmsacj26hh3fngwcal04zs-icu4c-75.1-dev/include -c -o src/event.o src/event.c365 > In file included from /nix/store/wflnb8fxmq4lqx3ca91hlpv95vrqkv51-curl-8.17.0-dev/include/curl/curl.h:3333,366 > from /nix/store/wflnb8fxmq4lqx3ca91hlpv95vrqkv51-curl-8.17.0-dev/include/curl/multi.h:51,367 > from src/event.h:4,368 > from src/event.c:6:369 > /nix/store/wflnb8fxmq4lqx3ca91hlpv95vrqkv51-curl-8.17.0-dev/include/curl/multi.h:429:23: error: expected identifier or '(' before '__extension__'370 > 429 | CURL_EXTERN CURLMcode curl_multi_setopt(CURLM *multi_handle,371 > | ^~~~~~~~~~~~~~~~~372 > /nix/store/wflnb8fxmq4lqx3ca91hlpv95vrqkv51-curl-8.17.0-dev/include/curl/multi.h:429:23: error: expected identifier or '(' before ')' token373 > 429 | CURL_EXTERN CURLMcode curl_multi_setopt(CURLM *multi_handle,374 > | ^~~~~~~~~~~~~~~~~375 > make: *** [<builtin>: src/event.o] Error 1376 For full logs, run:377 nix log /nix/store/h3jfznl8xhwm8wvvxg23yj74srzz3vii-pg_net-0.19.5.drv378error: Cannot build '/nix/store/ky7414m088qm5h8xn9z7xzw0k08wgcrh-pg_net-0.20.0.drv'.379 Reason: builder failed with exit code 2.380 Output paths:381 /nix/store/div76hg9lzzwipcrl72qfbl1vaps6bqr-pg_net-0.20.0382 Last 22 log lines:383 > Running phase: unpackPhase384 > unpacking source archive /nix/store/3783i7yhcfqnyv5ndli22gcr11ap151m-source385 > source root is source386 > Running phase: patchPhase387 > Running phase: updateAutotoolsGnuConfigScriptsPhase388 > Running phase: configurePhase389 > no configure script, doing nothing390 > Running phase: buildPhase391 > gcc -Wall -Wmissing-prototypes -Wpointer-arith -Wdeclaration-after-statement -Werror=vla -Wendif-labels -Wmissing-format-attribute -Wimplicit-fallthrough=3 -Wcast-function-type -Wshadow=compatible-local -Wformat-security -fno-strict-aliasing -fwrapv -fexcess-precision=standard -Wno-format-truncation -Wno-stringop-truncation -g -O2 -std=c11 -Wextra -Wall -Werror -Wno-declaration-after-statement -Wno-vla -Wno-long-long -Wmissing-variable-declarations -fPIC -fvisibility=hidden -DEXTVERSION=\"0.20.0\" -I. -I./ -I/nix/store/dj25xabr71j1mmxf628lqsn61qd5qcyk-postgresql-17.11/include/server -I/nix/store/dj25xabr71j1mmxf628lqsn61qd5qcyk-postgresql-17.11/include/internal -D_GNU_SOURCE -I/nix/store/5nl2zr46dic7mxcw6cvbq85wa8c2gngh-libxml2-2.15.1-dev/include/libxml2 -I/nix/store/sl10j863s32x7dv5vw6wfx1nh22f3xh2-lz4-1.10.0-dev/include -I/nix/store/di94mxmhhk390zzzv2gvavfwkgww7q6h-zstd-1.5.7-dev/include -I/nix/store/h5hfqhzcqszmsacj26hh3fngwcal04zs-icu4c-75.1-dev/include -c -o src/core.o src/core.c392 > gcc -Wall -Wmissing-prototypes -Wpointer-arith -Wdeclaration-after-statement -Werror=vla -Wendif-labels -Wmissing-format-attribute -Wimplicit-fallthrough=3 -Wcast-function-type -Wshadow=compatible-local -Wformat-security -fno-strict-aliasing -fwrapv -fexcess-precision=standard -Wno-format-truncation -Wno-stringop-truncation -g -O2 -std=c11 -Wextra -Wall -Werror -Wno-declaration-after-statement -Wno-vla -Wno-long-long -Wmissing-variable-declarations -fPIC -fvisibility=hidden -DEXTVERSION=\"0.20.0\" -I. -I./ -I/nix/store/dj25xabr71j1mmxf628lqsn61qd5qcyk-postgresql-17.11/include/server -I/nix/store/dj25xabr71j1mmxf628lqsn61qd5qcyk-postgresql-17.11/include/internal -D_GNU_SOURCE -I/nix/store/5nl2zr46dic7mxcw6cvbq85wa8c2gngh-libxml2-2.15.1-dev/include/libxml2 -I/nix/store/sl10j863s32x7dv5vw6wfx1nh22f3xh2-lz4-1.10.0-dev/include -I/nix/store/di94mxmhhk390zzzv2gvavfwkgww7q6h-zstd-1.5.7-dev/include -I/nix/store/h5hfqhzcqszmsacj26hh3fngwcal04zs-icu4c-75.1-dev/include -c -o src/errors.o src/errors.c393 > gcc -Wall -Wmissing-prototypes -Wpointer-arith -Wdeclaration-after-statement -Werror=vla -Wendif-labels -Wmissing-format-attribute -Wimplicit-fallthrough=3 -Wcast-function-type -Wshadow=compatible-local -Wformat-security -fno-strict-aliasing -fwrapv -fexcess-precision=standard -Wno-format-truncation -Wno-stringop-truncation -g -O2 -std=c11 -Wextra -Wall -Werror -Wno-declaration-after-statement -Wno-vla -Wno-long-long -Wmissing-variable-declarations -fPIC -fvisibility=hidden -DEXTVERSION=\"0.20.0\" -I. -I./ -I/nix/store/dj25xabr71j1mmxf628lqsn61qd5qcyk-postgresql-17.11/include/server -I/nix/store/dj25xabr71j1mmxf628lqsn61qd5qcyk-postgresql-17.11/include/internal -D_GNU_SOURCE -I/nix/store/5nl2zr46dic7mxcw6cvbq85wa8c2gngh-libxml2-2.15.1-dev/include/libxml2 -I/nix/store/sl10j863s32x7dv5vw6wfx1nh22f3xh2-lz4-1.10.0-dev/include -I/nix/store/di94mxmhhk390zzzv2gvavfwkgww7q6h-zstd-1.5.7-dev/include -I/nix/store/h5hfqhzcqszmsacj26hh3fngwcal04zs-icu4c-75.1-dev/include -c -o src/event.o src/event.c394 > In file included from /nix/store/wflnb8fxmq4lqx3ca91hlpv95vrqkv51-curl-8.17.0-dev/include/curl/curl.h:3333,395 > from /nix/store/wflnb8fxmq4lqx3ca91hlpv95vrqkv51-curl-8.17.0-dev/include/curl/multi.h:51,396 > from src/event.h:4,397 > from src/event.c:6:398 > /nix/store/wflnb8fxmq4lqx3ca91hlpv95vrqkv51-curl-8.17.0-dev/include/curl/multi.h:429:23: error: expected identifier or '(' before '__extension__'399 > 429 | CURL_EXTERN CURLMcode curl_multi_setopt(CURLM *multi_handle,400 > | ^~~~~~~~~~~~~~~~~401 > /nix/store/wflnb8fxmq4lqx3ca91hlpv95vrqkv51-curl-8.17.0-dev/include/curl/multi.h:429:23: error: expected identifier or '(' before ')' token402 > 429 | CURL_EXTERN CURLMcode curl_multi_setopt(CURLM *multi_handle,403 > | ^~~~~~~~~~~~~~~~~404 > make: *** [<builtin>: src/event.o] Error 1405 For full logs, run:406 nix log /nix/store/ky7414m088qm5h8xn9z7xzw0k08wgcrh-pg_net-0.20.0.drv407error: Cannot build '/nix/store/cqdc5q7n6g9pkxy0cjcvkq185rps4bfd-pg_net.drv'.408 Reason: 4 dependencies failed.409 Output paths:410 /nix/store/4sc9iw7bqgw1y6834l2h4w200hvc8b79-pg_net411error: Cannot build '/nix/store/d5s4s970iizz6a8w5ndnpzyw63w1m1qv-postgresql-and-plugins-17.11.drv'.412 Reason: 1 dependency failed.413 Output paths:414 /nix/store/dlsqc392rqmvj64617g73zcbvclgch0b-postgresql-and-plugins-17.11415error: Cannot build '/nix/store/7hla3p20yajypj5w3hnrx38bc3kq14vq-postgresql-and-plugins-17.11.drv'.416 Reason: 1 dependency failed.417 Output paths:418 /nix/store/j9fc5s30v77k7ycb6icimvdhkb7ss17i-postgresql-and-plugins-17.11419error: Cannot build '/nix/store/hfwkzpr1kplwaywhvayqm6j4gsva8n5n-pg_net-0.20.0.drv'.420 Reason: builder failed with exit code 2.421 Output paths:422 /nix/store/scsfkgabhfzpzf64a6cgvkx2zglb6vji-pg_net-0.20.0423 Last 22 log lines:424 > Running phase: unpackPhase425 > unpacking source archive /nix/store/3783i7yhcfqnyv5ndli22gcr11ap151m-source426 > source root is source427 > Running phase: patchPhase428 > Running phase: updateAutotoolsGnuConfigScriptsPhase429 > Running phase: configurePhase430 > no configure script, doing nothing431 > Running phase: buildPhase432 > gcc -Wall -Wmissing-prototypes -Wpointer-arith -Wdeclaration-after-statement -Werror=vla -Wendif-labels -Wmissing-format-attribute -Wimplicit-fallthrough=3 -Wcast-function-type -Wformat-security -fno-strict-aliasing -fwrapv -fexcess-precision=standard -Wno-deprecated-non-prototype -Wno-format-truncation -Wno-stringop-truncation -g -O2 -std=gnu17 -std=c11 -Wextra -Wall -Werror -Wno-declaration-after-statement -Wno-vla -Wno-long-long -Wmissing-variable-declarations -fPIC -DEXTVERSION=\"0.20.0\" -I. -I./ -I/nix/store/804f042cyc4dca4vwl2fmh1rhfy0sij9-postgresql-15.19/include/server -I/nix/store/804f042cyc4dca4vwl2fmh1rhfy0sij9-postgresql-15.19/include/internal -D_GNU_SOURCE -I/nix/store/5nl2zr46dic7mxcw6cvbq85wa8c2gngh-libxml2-2.15.1-dev/include/libxml2 -I/nix/store/sl10j863s32x7dv5vw6wfx1nh22f3xh2-lz4-1.10.0-dev/include -I/nix/store/di94mxmhhk390zzzv2gvavfwkgww7q6h-zstd-1.5.7-dev/include -I/nix/store/h5hfqhzcqszmsacj26hh3fngwcal04zs-icu4c-75.1-dev/include -c -o src/core.o src/core.c433 > gcc -Wall -Wmissing-prototypes -Wpointer-arith -Wdeclaration-after-statement -Werror=vla -Wendif-labels -Wmissing-format-attribute -Wimplicit-fallthrough=3 -Wcast-function-type -Wformat-security -fno-strict-aliasing -fwrapv -fexcess-precision=standard -Wno-deprecated-non-prototype -Wno-format-truncation -Wno-stringop-truncation -g -O2 -std=gnu17 -std=c11 -Wextra -Wall -Werror -Wno-declaration-after-statement -Wno-vla -Wno-long-long -Wmissing-variable-declarations -fPIC -DEXTVERSION=\"0.20.0\" -I. -I./ -I/nix/store/804f042cyc4dca4vwl2fmh1rhfy0sij9-postgresql-15.19/include/server -I/nix/store/804f042cyc4dca4vwl2fmh1rhfy0sij9-postgresql-15.19/include/internal -D_GNU_SOURCE -I/nix/store/5nl2zr46dic7mxcw6cvbq85wa8c2gngh-libxml2-2.15.1-dev/include/libxml2 -I/nix/store/sl10j863s32x7dv5vw6wfx1nh22f3xh2-lz4-1.10.0-dev/include -I/nix/store/di94mxmhhk390zzzv2gvavfwkgww7q6h-zstd-1.5.7-dev/include -I/nix/store/h5hfqhzcqszmsacj26hh3fngwcal04zs-icu4c-75.1-dev/include -c -o src/errors.o src/errors.c434 > gcc -Wall -Wmissing-prototypes -Wpointer-arith -Wdeclaration-after-statement -Werror=vla -Wendif-labels -Wmissing-format-attribute -Wimplicit-fallthrough=3 -Wcast-function-type -Wformat-security -fno-strict-aliasing -fwrapv -fexcess-precision=standard -Wno-deprecated-non-prototype -Wno-format-truncation -Wno-stringop-truncation -g -O2 -std=gnu17 -std=c11 -Wextra -Wall -Werror -Wno-declaration-after-statement -Wno-vla -Wno-long-long -Wmissing-variable-declarations -fPIC -DEXTVERSION=\"0.20.0\" -I. -I./ -I/nix/store/804f042cyc4dca4vwl2fmh1rhfy0sij9-postgresql-15.19/include/server -I/nix/store/804f042cyc4dca4vwl2fmh1rhfy0sij9-postgresql-15.19/include/internal -D_GNU_SOURCE -I/nix/store/5nl2zr46dic7mxcw6cvbq85wa8c2gngh-libxml2-2.15.1-dev/include/libxml2 -I/nix/store/sl10j863s32x7dv5vw6wfx1nh22f3xh2-lz4-1.10.0-dev/include -I/nix/store/di94mxmhhk390zzzv2gvavfwkgww7q6h-zstd-1.5.7-dev/include -I/nix/store/h5hfqhzcqszmsacj26hh3fngwcal04zs-icu4c-75.1-dev/include -c -o src/event.o src/event.c435 > In file included from /nix/store/wflnb8fxmq4lqx3ca91hlpv95vrqkv51-curl-8.17.0-dev/include/curl/curl.h:3333,436 > from /nix/store/wflnb8fxmq4lqx3ca91hlpv95vrqkv51-curl-8.17.0-dev/include/curl/multi.h:51,437 > from src/event.h:4,438 > from src/event.c:6:439 > /nix/store/wflnb8fxmq4lqx3ca91hlpv95vrqkv51-curl-8.17.0-dev/include/curl/multi.h:429:23: error: expected identifier or '(' before '__extension__'440 > 429 | CURL_EXTERN CURLMcode curl_multi_setopt(CURLM *multi_handle,441 > | ^~~~~~~~~~~~~~~~~442 > /nix/store/wflnb8fxmq4lqx3ca91hlpv95vrqkv51-curl-8.17.0-dev/include/curl/multi.h:429:23: error: expected identifier or '(' before ')' token443 > 429 | CURL_EXTERN CURLMcode curl_multi_setopt(CURLM *multi_handle,444 > | ^~~~~~~~~~~~~~~~~445 > make: *** [<builtin>: src/event.o] Error 1446 For full logs, run:447 nix log /nix/store/hfwkzpr1kplwaywhvayqm6j4gsva8n5n-pg_net-0.20.0.drv448error: Cannot build '/nix/store/v7i610b6q10zpsd2536yvba9pd2xqrr6-pg_net-0.19.5.drv'.449 Reason: builder failed with exit code 2.450 Output paths:451 /nix/store/pzmf3gl6j9iwmkqjfvwvsb11fh4i1rz2-pg_net-0.19.5452 Last 22 log lines:453 > Running phase: unpackPhase454 > unpacking source archive /nix/store/5zgdqy3bz93jyn79pizxc1hks0cdcadw-source455 > source root is source456 > Running phase: patchPhase457 > Running phase: updateAutotoolsGnuConfigScriptsPhase458 > Running phase: configurePhase459 > no configure script, doing nothing460 > Running phase: buildPhase461 > gcc -Wall -Wmissing-prototypes -Wpointer-arith -Wdeclaration-after-statement -Werror=vla -Wendif-labels -Wmissing-format-attribute -Wimplicit-fallthrough=3 -Wcast-function-type -Wshadow=compatible-local -Wformat-security -fno-strict-aliasing -fwrapv -fexcess-precision=standard -Wno-format-truncation -Wno-stringop-truncation -g -O2 -std=c11 -Wextra -Wall -Werror -Wno-declaration-after-statement -Wno-vla -Wno-long-long -Wmissing-variable-declarations -fPIC -fvisibility=hidden -DEXTVERSION=\"0.19.5\" -I. -I./ -I/nix/store/qmc7y6nc0qxg50ywm46x4iaqq5knz702-postgresql-17_22/include/server -I/nix/store/qmc7y6nc0qxg50ywm46x4iaqq5knz702-postgresql-17_22/include/internal -D_GNU_SOURCE -I/nix/store/5nl2zr46dic7mxcw6cvbq85wa8c2gngh-libxml2-2.15.1-dev/include/libxml2 -I/nix/store/sl10j863s32x7dv5vw6wfx1nh22f3xh2-lz4-1.10.0-dev/include -I/nix/store/di94mxmhhk390zzzv2gvavfwkgww7q6h-zstd-1.5.7-dev/include -I/nix/store/h5hfqhzcqszmsacj26hh3fngwcal04zs-icu4c-75.1-dev/include -c -o src/core.o src/core.c462 > gcc -Wall -Wmissing-prototypes -Wpointer-arith -Wdeclaration-after-statement -Werror=vla -Wendif-labels -Wmissing-format-attribute -Wimplicit-fallthrough=3 -Wcast-function-type -Wshadow=compatible-local -Wformat-security -fno-strict-aliasing -fwrapv -fexcess-precision=standard -Wno-format-truncation -Wno-stringop-truncation -g -O2 -std=c11 -Wextra -Wall -Werror -Wno-declaration-after-statement -Wno-vla -Wno-long-long -Wmissing-variable-declarations -fPIC -fvisibility=hidden -DEXTVERSION=\"0.19.5\" -I. -I./ -I/nix/store/qmc7y6nc0qxg50ywm46x4iaqq5knz702-postgresql-17_22/include/server -I/nix/store/qmc7y6nc0qxg50ywm46x4iaqq5knz702-postgresql-17_22/include/internal -D_GNU_SOURCE -I/nix/store/5nl2zr46dic7mxcw6cvbq85wa8c2gngh-libxml2-2.15.1-dev/include/libxml2 -I/nix/store/sl10j863s32x7dv5vw6wfx1nh22f3xh2-lz4-1.10.0-dev/include -I/nix/store/di94mxmhhk390zzzv2gvavfwkgww7q6h-zstd-1.5.7-dev/include -I/nix/store/h5hfqhzcqszmsacj26hh3fngwcal04zs-icu4c-75.1-dev/include -c -o src/errors.o src/errors.c463 > gcc -Wall -Wmissing-prototypes -Wpointer-arith -Wdeclaration-after-statement -Werror=vla -Wendif-labels -Wmissing-format-attribute -Wimplicit-fallthrough=3 -Wcast-function-type -Wshadow=compatible-local -Wformat-security -fno-strict-aliasing -fwrapv -fexcess-precision=standard -Wno-format-truncation -Wno-stringop-truncation -g -O2 -std=c11 -Wextra -Wall -Werror -Wno-declaration-after-statement -Wno-vla -Wno-long-long -Wmissing-variable-declarations -fPIC -fvisibility=hidden -DEXTVERSION=\"0.19.5\" -I. -I./ -I/nix/store/qmc7y6nc0qxg50ywm46x4iaqq5knz702-postgresql-17_22/include/server -I/nix/store/qmc7y6nc0qxg50ywm46x4iaqq5knz702-postgresql-17_22/include/internal -D_GNU_SOURCE -I/nix/store/5nl2zr46dic7mxcw6cvbq85wa8c2gngh-libxml2-2.15.1-dev/include/libxml2 -I/nix/store/sl10j863s32x7dv5vw6wfx1nh22f3xh2-lz4-1.10.0-dev/include -I/nix/store/di94mxmhhk390zzzv2gvavfwkgww7q6h-zstd-1.5.7-dev/include -I/nix/store/h5hfqhzcqszmsacj26hh3fngwcal04zs-icu4c-75.1-dev/include -c -o src/event.o src/event.c464 > In file included from /nix/store/wflnb8fxmq4lqx3ca91hlpv95vrqkv51-curl-8.17.0-dev/include/curl/curl.h:3333,465 > from /nix/store/wflnb8fxmq4lqx3ca91hlpv95vrqkv51-curl-8.17.0-dev/include/curl/multi.h:51,466 > from src/event.h:4,467 > from src/event.c:6:468 > /nix/store/wflnb8fxmq4lqx3ca91hlpv95vrqkv51-curl-8.17.0-dev/include/curl/multi.h:429:23: error: expected identifier or '(' before '__extension__'469 > 429 | CURL_EXTERN CURLMcode curl_multi_setopt(CURLM *multi_handle,470 > | ^~~~~~~~~~~~~~~~~471 > /nix/store/wflnb8fxmq4lqx3ca91hlpv95vrqkv51-curl-8.17.0-dev/include/curl/multi.h:429:23: error: expected identifier or '(' before ')' token472 > 429 | CURL_EXTERN CURLMcode curl_multi_setopt(CURLM *multi_handle,473 > | ^~~~~~~~~~~~~~~~~474 > make: *** [<builtin>: src/event.o] Error 1475 For full logs, run:476 nix log /nix/store/v7i610b6q10zpsd2536yvba9pd2xqrr6-pg_net-0.19.5.drv477error: Cannot build '/nix/store/zd0hg58y5nwnnwfzy7sd19l7dzx4zvv5-pg_net.drv'.478 Reason: 4 dependencies failed.479 Output paths:480 /nix/store/5j8is0c6fp325l5akxcq6digg430r2fy-pg_net481error: Cannot build '/nix/store/m7073j3kxn6vxs53jdm448q51cxiimys-postgresql-and-plugins-17_22.drv'.482 Reason: 1 dependency failed.483 Output paths:484 /nix/store/z04smpdjsr0zxxl7phxyvwwh4ycfq6c5-postgresql-and-plugins-17_22485error: Cannot build '/nix/store/q8qv7gf9izi4my9mjapggg0fx2dhzlwc-postgresql-and-plugins-17_22.drv'.486 Reason: 1 dependency failed.487 Output paths:488 /nix/store/y845ymwkrl6d1g0swpxgxwk72nyclj1s-postgresql-and-plugins-17_22489error: Cannot build '/nix/store/y85ggf9qcv7hsaxx3fyr5a14nf67953g-postgresql-orioledb-init.drv'.490 Reason: 1 dependency failed.491 Output paths:492 /nix/store/ljganhrp9i6y9sfsqv77nzm8ylql0ial-postgresql-orioledb-init493error: Cannot build '/nix/store/7p4sg9x4d75pncaxpl0sa51ja5k2bik8-supabase-orioledb-db-init.drv'.494 Reason: 1 dependency failed.495 Output paths:496 /nix/store/584vyxv0pxm2ks5a423n8i4n4jjfbmza-supabase-orioledb-db-init497error: Cannot build '/nix/store/6dmfl5hj72ck728kvz45gg2241dk81ci-unit-postgresql.service.drv'.498 Reason: 2 dependencies failed.499 Output paths:500 /nix/store/4d86ahvbvwk5brsw0hnkci0nq2i5hzbs-unit-postgresql.service501error: Cannot build '/nix/store/dadjlp1c0v94bsq44xmi8yl99z9dwd3n-unit-supabase-db-init.service.drv'.502 Reason: 1 dependency failed.503 Output paths:504 /nix/store/224g1r7756ryqw509vkfqxila6hi91bb-unit-supabase-db-init.service505error: Cannot build '/nix/store/5v6a4ssacxc4snck5dzagkmqhcsh2swz-pg_net-0.19.5.drv'.506 Reason: builder failed with exit code 2.507 Output paths:508 /nix/store/xcsw4jyz7w5071r5drjiify20gjvij99-pg_net-0.19.5509 Last 22 log lines:510 > Running phase: unpackPhase511 > unpacking source archive /nix/store/5zgdqy3bz93jyn79pizxc1hks0cdcadw-source512 > source root is source513 > Running phase: patchPhase514 > Running phase: updateAutotoolsGnuConfigScriptsPhase515 > Running phase: configurePhase516 > no configure script, doing nothing517 > Running phase: buildPhase518 > gcc -Wall -Wmissing-prototypes -Wpointer-arith -Wdeclaration-after-statement -Werror=vla -Wendif-labels -Wmissing-format-attribute -Wimplicit-fallthrough=3 -Wcast-function-type -Wformat-security -fno-strict-aliasing -fwrapv -fexcess-precision=standard -Wno-deprecated-non-prototype -Wno-format-truncation -Wno-stringop-truncation -g -O2 -std=gnu17 -std=c11 -Wextra -Wall -Werror -Wno-declaration-after-statement -Wno-vla -Wno-long-long -Wmissing-variable-declarations -fPIC -DEXTVERSION=\"0.19.5\" -I. -I./ -I/nix/store/804f042cyc4dca4vwl2fmh1rhfy0sij9-postgresql-15.19/include/server -I/nix/store/804f042cyc4dca4vwl2fmh1rhfy0sij9-postgresql-15.19/include/internal -D_GNU_SOURCE -I/nix/store/5nl2zr46dic7mxcw6cvbq85wa8c2gngh-libxml2-2.15.1-dev/include/libxml2 -I/nix/store/sl10j863s32x7dv5vw6wfx1nh22f3xh2-lz4-1.10.0-dev/include -I/nix/store/di94mxmhhk390zzzv2gvavfwkgww7q6h-zstd-1.5.7-dev/include -I/nix/store/h5hfqhzcqszmsacj26hh3fngwcal04zs-icu4c-75.1-dev/include -c -o src/core.o src/core.c519 > gcc -Wall -Wmissing-prototypes -Wpointer-arith -Wdeclaration-after-statement -Werror=vla -Wendif-labels -Wmissing-format-attribute -Wimplicit-fallthrough=3 -Wcast-function-type -Wformat-security -fno-strict-aliasing -fwrapv -fexcess-precision=standard -Wno-deprecated-non-prototype -Wno-format-truncation -Wno-stringop-truncation -g -O2 -std=gnu17 -std=c11 -Wextra -Wall -Werror -Wno-declaration-after-statement -Wno-vla -Wno-long-long -Wmissing-variable-declarations -fPIC -DEXTVERSION=\"0.19.5\" -I. -I./ -I/nix/store/804f042cyc4dca4vwl2fmh1rhfy0sij9-postgresql-15.19/include/server -I/nix/store/804f042cyc4dca4vwl2fmh1rhfy0sij9-postgresql-15.19/include/internal -D_GNU_SOURCE -I/nix/store/5nl2zr46dic7mxcw6cvbq85wa8c2gngh-libxml2-2.15.1-dev/include/libxml2 -I/nix/store/sl10j863s32x7dv5vw6wfx1nh22f3xh2-lz4-1.10.0-dev/include -I/nix/store/di94mxmhhk390zzzv2gvavfwkgww7q6h-zstd-1.5.7-dev/include -I/nix/store/h5hfqhzcqszmsacj26hh3fngwcal04zs-icu4c-75.1-dev/include -c -o src/errors.o src/errors.c520 > gcc -Wall -Wmissing-prototypes -Wpointer-arith -Wdeclaration-after-statement -Werror=vla -Wendif-labels -Wmissing-format-attribute -Wimplicit-fallthrough=3 -Wcast-function-type -Wformat-security -fno-strict-aliasing -fwrapv -fexcess-precision=standard -Wno-deprecated-non-prototype -Wno-format-truncation -Wno-stringop-truncation -g -O2 -std=gnu17 -std=c11 -Wextra -Wall -Werror -Wno-declaration-after-statement -Wno-vla -Wno-long-long -Wmissing-variable-declarations -fPIC -DEXTVERSION=\"0.19.5\" -I. -I./ -I/nix/store/804f042cyc4dca4vwl2fmh1rhfy0sij9-postgresql-15.19/include/server -I/nix/store/804f042cyc4dca4vwl2fmh1rhfy0sij9-postgresql-15.19/include/internal -D_GNU_SOURCE -I/nix/store/5nl2zr46dic7mxcw6cvbq85wa8c2gngh-libxml2-2.15.1-dev/include/libxml2 -I/nix/store/sl10j863s32x7dv5vw6wfx1nh22f3xh2-lz4-1.10.0-dev/include -I/nix/store/di94mxmhhk390zzzv2gvavfwkgww7q6h-zstd-1.5.7-dev/include -I/nix/store/h5hfqhzcqszmsacj26hh3fngwcal04zs-icu4c-75.1-dev/include -c -o src/event.o src/event.c521 > In file included from /nix/store/wflnb8fxmq4lqx3ca91hlpv95vrqkv51-curl-8.17.0-dev/include/curl/curl.h:3333,522 > from /nix/store/wflnb8fxmq4lqx3ca91hlpv95vrqkv51-curl-8.17.0-dev/include/curl/multi.h:51,523 > from src/event.h:4,524 > from src/event.c:6:525 > /nix/store/wflnb8fxmq4lqx3ca91hlpv95vrqkv51-curl-8.17.0-dev/include/curl/multi.h:429:23: error: expected identifier or '(' before '__extension__'526 > 429 | CURL_EXTERN CURLMcode curl_multi_setopt(CURLM *multi_handle,527 > | ^~~~~~~~~~~~~~~~~528 > /nix/store/wflnb8fxmq4lqx3ca91hlpv95vrqkv51-curl-8.17.0-dev/include/curl/multi.h:429:23: error: expected identifier or '(' before ')' token529 > 429 | CURL_EXTERN CURLMcode curl_multi_setopt(CURLM *multi_handle,530 > | ^~~~~~~~~~~~~~~~~531 > make: *** [<builtin>: src/event.o] Error 1532 For full logs, run:533 nix log /nix/store/5v6a4ssacxc4snck5dzagkmqhcsh2swz-pg_net-0.19.5.drv534error: Cannot build '/nix/store/94hi7qqfg86lfxqnyqizx334my0yjbh3-pg_net.drv'.535 Reason: 5 dependencies failed.536 Output paths:537 /nix/store/88g5knkc68im4z0plvckvdf0ag9pl97y-pg_net538error: Cannot build '/nix/store/a5gfyj0k47cxv70v4a1zhhk1998vd290-postgresql-and-plugins-15.19.drv'.539 Reason: 1 dependency failed.540 Output paths:541 /nix/store/zn5pxdcd7zf2nviqxmbqb3whv0b89njc-postgresql-and-plugins-15.19542error: Cannot build '/nix/store/69zc44dp9979jf4p9hcpgfdf1wgpw40l-postgresql-and-plugins-15.19.drv'.543 Reason: 1 dependency failed.544 Output paths:545 /nix/store/hhm9gzfpx0h3lp8ld4wvl64kwnddl1yd-postgresql-and-plugins-15.19546error: Cannot build '/nix/store/yr25cab0bgg2gdcjr0fkk052aqw4ag84-postgresql-init.drv'.547 Reason: 1 dependency failed.548 Output paths:549 /nix/store/7nv58lyapj4mqdczihsi6cfmcydjazv0-postgresql-init550error: Cannot build '/nix/store/319yam8jpgm13yfxs5psx2g1j4zd346h-postgresql-migrate.drv'.551 Reason: 2 dependencies failed.552 Output paths:553 /nix/store/rpg8r2qwvwslgphbrd164k6alxbq4zpq-postgresql-migrate554error: Cannot build '/nix/store/9dhmhlajdjqsz58msmq42lwanwgk4c0z-supabase-db-init.drv'.555 Reason: 1 dependency failed.556 Output paths:557 /nix/store/04kjr2y1f7hkywc7dmww3n56f9awljyv-supabase-db-init558error: Cannot build '/nix/store/ggzwf7y9bbwypxs8a44lg59dd3cbp5k5-system-path.drv'.559 Reason: 2 dependencies failed.560 Output paths:561 /nix/store/2jflmsikx3zpi2kl04372bz76n24mmmh-system-path562error: Cannot build '/nix/store/rp3411xgkcmbnrvxwgg7kxxlhj217519-system-path.drv'.563 Reason: 2 dependencies failed.564 Output paths:565 /nix/store/kx4lvchs53hma4qg0i96hchxf6l84a5d-system-path566error: Cannot build '/nix/store/sn90bhb87fs1r7szfvpnhakcf5cbqipi-system-path.drv'.567 Reason: 1 dependency failed.568 Output paths:569 /nix/store/d1l9p7cxy6frga61c961vbakykybwla0-system-path570error: Cannot build '/nix/store/7mf1lcyklc71a89s4mi3r7w8k39ihvya-dbus-1.drv'.571 Reason: 1 dependency failed.572 Output paths:573 /nix/store/kw6ni7kh3277pz2yj4mabcb1y91fj4fm-dbus-1574error: Cannot build '/nix/store/jwcb2kgwrcwds3m6z7byrg26qackyaxf-dbus-1.drv'.575 Reason: 1 dependency failed.576 Output paths:577 /nix/store/fz2sb148fkcajn05ynvjfm5frqpx68m1-dbus-1578error: Cannot build '/nix/store/rnjj94ch4qaxpyhgvk900hq1rp2ji4cx-dbus-1.drv'.579 Reason: 1 dependency failed.580 Output paths:581 /nix/store/9an5r6jm2y6kpbk4r0b8sibw0vkf19vj-dbus-1582error: Cannot build '/nix/store/xvpj8kcdwibf0zb3lvh74lg9sn132fb6-unit-postgresql-migrate.service.drv'.583 Reason: 1 dependency failed.584 Output paths:585 /nix/store/l0w9p74lwhi21rjz4554f0qafxjgl47r-unit-postgresql-migrate.service586error: Cannot build '/nix/store/18idp8l89ga0vbjdvp5y33m42h8ypb3n-unit-postgresql.service.drv'.587 Reason: 2 dependencies failed.588 Output paths:589 /nix/store/107kzs2gwas10ryhvr2x3ch174m6f6i3-unit-postgresql.service590error: Cannot build '/nix/store/vl4z7w7y2dciycqgcm6qp86dpgddrqgg-unit-postgresql.service.drv'.591 Reason: 2 dependencies failed.592 Output paths:593 /nix/store/k5gqg28zclcqsxfm34fyz0vqq6nrhmj9-unit-postgresql.service594error: Cannot build '/nix/store/9189fi92i7805xz024zxxwljw2xfqplf-unit-supabase-db-init.service.drv'.595 Reason: 1 dependency failed.596 Output paths:597 /nix/store/n1bvlic1id0sybb254vs4nzw75kv51jn-unit-supabase-db-init.service598error: Cannot build '/nix/store/bj8k3q4xx5yxsjpcz0k6pjkann65ifyp-X-Restart-Triggers-dbus.drv'.599 Reason: 1 dependency failed.600 Output paths:601 /nix/store/m5s8iv4fvwca77nj8x9gzi2kbkbhkwj5-X-Restart-Triggers-dbus602error: Cannot build '/nix/store/hkbib28lgy3sdk60wwh6fnjx17lrpkd0-X-Restart-Triggers-dbus.drv'.603 Reason: 1 dependency failed.604 Output paths:605 /nix/store/dykpq6m9x904fkf5li1wl1g95ijg9ag2-X-Restart-Triggers-dbus606error: Cannot build '/nix/store/wd8irv2ffhnmkp1bdcqcf4x5nyhapq43-X-Restart-Triggers-dbus.drv'.607 Reason: 1 dependency failed.608 Output paths:609 /nix/store/v0cz3xq1yacg7hy4vw9qbq7krai8szxa-X-Restart-Triggers-dbus610error: Cannot build '/nix/store/2i01a9qxfbdjlvkl937aq52x148dm5hk-unit-dbus.service.drv'.611 Reason: 1 dependency failed.612 Output paths:613 /nix/store/5a52fh7fc53ay515sc03ffina2qnx016-unit-dbus.service614error: Cannot build '/nix/store/9hia6rkh5qzm30dxyfjihl6251cmnv0l-unit-dbus.service.drv'.615 Reason: 1 dependency failed.616 Output paths:617 /nix/store/4rc70981za6xs4ngbzz75kjzm3w511wc-unit-dbus.service618error: Cannot build '/nix/store/a0nhwyhawfp54kccbpjcvlkybsc46m66-unit-dbus.service.drv'.619 Reason: 1 dependency failed.620 Output paths:621 /nix/store/pm59aikr1pgkii8lbjgy9c339k6gkk70-unit-dbus.service622error: Cannot build '/nix/store/ks9rz4w18q5w6apnl8bszi42p6fqb7w9-unit-dbus.service.drv'.623 Reason: 1 dependency failed.624 Output paths:625 /nix/store/4ivywhvyw3mwb077ypjyzzkgmkm6hdzi-unit-dbus.service626error: Cannot build '/nix/store/ljfzjxqwx4kxjwxjjlnpaqdzh0xqd7xr-unit-dbus.service.drv'.627 Reason: 1 dependency failed.628 Output paths:629 /nix/store/2ah9ks1byg1x3j9kg1x6mbbmykxgl9s1-unit-dbus.service630error: Cannot build '/nix/store/zbb4xyx08cfb7d20vxf6chbzvcw94xva-unit-dbus.service.drv'.631 Reason: 1 dependency failed.632 Output paths:633 /nix/store/dykdj7nvn6dhqk3a88l90a3kcvz0x5vp-unit-dbus.service634error: Cannot build '/nix/store/bk16kzbxqyyqfg6qlmkplrgfhv7k21kl-system-units.drv'.635 Reason: 3 dependencies failed.636 Output paths:637 /nix/store/5hc8xp1vv3vx3vl70cngxm69f7xq9v25-system-units638error: Cannot build '/nix/store/nnswm02aq5rs1v3j77dlnha5mh5c19z7-system-units.drv'.639 Reason: 3 dependencies failed.640 Output paths:641 /nix/store/xc89nsmmxclandfqqfs4kks5mh5m9iya-system-units642error: Cannot build '/nix/store/w29pxvjbvdmyac5wz16l2kakq9n2w4dn-system-units.drv'.643 Reason: 3 dependencies failed.644 Output paths:645 /nix/store/2wkv7zmc05vlyn9797agk3w3grgyiyqp-system-units646error: Cannot build '/nix/store/6axq4j62rji3faz7rvgyjfccczni7z3n-user-units.drv'.647 Reason: 1 dependency failed.648 Output paths:649 /nix/store/y2f4sk4ka6ihz6v4q0hbli1bipmxgrlf-user-units650error: Cannot build '/nix/store/6w9n69ddwya8kjxyrz8n8p48cnhhv8m2-user-units.drv'.651 Reason: 1 dependency failed.652 Output paths:653 /nix/store/d63ihld7njm0bz4m9s6bz2bj5bg4kmqm-user-units654error: Cannot build '/nix/store/jphjq6s3xb6lm1r9a0yllq3wvcijkikd-user-units.drv'.655 Reason: 1 dependency failed.656 Output paths:657 /nix/store/9kr2570q5fkwfrvcvd5r7vr4p5n9bn1r-user-units658error: Cannot build '/nix/store/5i64fsbcnqkbbwyscs590q4x0kckm8vz-etc.drv'.659 Reason: 4 dependencies failed.660 Output paths:661 /nix/store/id8grildviwmlw31q8w30fyk3c4cyhlw-etc662error: Cannot build '/nix/store/dys7bm2r3m1f5zv7a66ajhqdsxph4zlw-etc.drv'.663 Reason: 4 dependencies failed.664 Output paths:665 /nix/store/nsbdx81bppdz5a7lyzsbv7s97qh52vlp-etc666error: Cannot build '/nix/store/yigqx2853rhqfbmrfci5bzld6c089mrd-etc.drv'.667 Reason: 4 dependencies failed.668 Output paths:669 /nix/store/j65wr0g6yjn70yxfwvwvm8n6xb4zlp97-etc670error: Cannot build '/nix/store/0mzm2f6fa46w1xld4wk2fb47gg0spks1-activate.drv'.671 Reason: 1 dependency failed.672 Output paths:673 /nix/store/dz71l6nx8zwrr604q4bqkbj3mnb19y78-activate674error: Cannot build '/nix/store/9i17zb3islwpb2pj7iwsw6d08gv9zdi2-activate.drv'.675 Reason: 1 dependency failed.676 Output paths:677 /nix/store/lplwwpzas08vvhnpcpq2wsxa0iwzykyv-activate678error: Cannot build '/nix/store/f3zaq5gia1p450hfwx1a5ka9b2crwvpc-activate.drv'.679 Reason: 1 dependency failed.680 Output paths:681 /nix/store/fs4g4l5vxpi515v6ki5mm5bff92cxjm8-activate682error: Cannot build '/nix/store/flpw9rfcwf20596nm3x5g91lj4wx6gsa-nixos-system-server-test.drv'.683 Reason: 3 dependencies failed.684 Output paths:685 /nix/store/b2y0ydacc3q228q5ng7sx3ahix9jmmrc-nixos-system-server-test686error: Cannot build '/nix/store/imr0jfl9r75i4l9br1zkqw4li7qls97p-nixos-system-server-test.drv'.687 Reason: 3 dependencies failed.688 Output paths:689 /nix/store/fp9xi6s4v3xhr3cvihbgvly7dvjxbr9b-nixos-system-server-test690error: Cannot build '/nix/store/zn5pqckvabyvbj8b760an4hwnbp3x1vx-nixos-system-server-test.drv'.691 Reason: 5 dependencies failed.692 Output paths:693 /nix/store/4a0v768sma96paf065lwj3c0baxbwwmq-nixos-system-server-test694error: Cannot build '/nix/store/l3g0a20fmxqmkdp4radxq4r3xd5jwzjy-closure-info.drv'.695 Reason: 1 dependency failed.696 Output paths:697 /nix/store/zb01z9b1jjvd3kxr2rxhgrayzjbjp6sp-closure-info698error: Cannot build '/nix/store/q1smldjprgklvy119fkq6b38a23idjc4-run-nixos-vm.drv'.699 Reason: 2 dependencies failed.700 Output paths:701 /nix/store/21alg8q3cb7j8dv42jy2rkmk2zixr935-run-nixos-vm702error: Cannot build '/nix/store/c0y8vb21y52ps11vi8ajzkqyvl7dd7nz-nixos-vm.drv'.703 Reason: 2 dependencies failed.704 Output paths:705 /nix/store/hl9ffgp199r4ciynbkr96ykzq247zy1w-nixos-vm706error: Cannot build '/nix/store/6d0r0imy0668ahjc9kfb0qx03lmlbgxh-nixos-test-driver-pgsodium.drv'.707 Reason: 2 dependencies failed.708 Output paths:709 /nix/store/4hziyd6a704plk5v8nr01bc76q19mk32-nixos-test-driver-pgsodium710error: Cannot build '/nix/store/fnxqz04mjag1cm2wz3pzcrc3wv5ivq7a-vm-test-run-pgsodium.drv'.711 Reason: 1 dependency failed.712 Output paths:713 /nix/store/5p958pizak7g5wj7y58zs9p6j7414qkq-vm-test-run-pgsodium