setup
checks.x86_64-linux.ext-pgrouting
· build #133
· raw
1these 135 derivations will be built:2 /nix/store/0ghzb9i3wrf3s927kg39aa01cd1lm0ic-pgtap.drv3 /nix/store/43hrszb68idmxn0cyb83axyaiv1rlrh9-pg_stat_monitor.drv4 /nix/store/6xiqjskc06w7z35k5pacs4276hqawiww-timescaledb.drv5 /nix/store/76skdlc74q1hgpkqqj7zk9fsm4wh4hl5-pgrouting.drv6 /nix/store/5v6a4ssacxc4snck5dzagkmqhcsh2swz-pg_net-0.19.5.drv7 /nix/store/7b5ar71808xp6cc9vi64vcr3gxhaq9w2-pg_net-0.14.0.drv8 /nix/store/82vkrfmb1h23wpf7jvwwb1r82vfiqb7w-pg_net-0.8.0.drv9 /nix/store/fs82kzwwqc58qma6aiyaljkngq7g3y4z-pg_net-0.20.3.drv10 /nix/store/ggfg6al5fkdp0r1jsc3iabgz0p7g6l1m-pg_net-0.7.drv11 /nix/store/hfwkzpr1kplwaywhvayqm6j4gsva8n5n-pg_net-0.20.0.drv12 /nix/store/nf025wlsx99h5f5yjmkj9wrj54ifbzad-pg_net-0.7.1.drv13 /nix/store/ymx9gp4jhvd7qpjvk95vw2m6ycb0jal7-pg_net-0.13.0.drv14 /nix/store/94hi7qqfg86lfxqnyqizx334my0yjbh3-pg_net.drv15 /nix/store/a1v4diwd4c9632zv93sjh9ab3b042mnr-pg_hashids.drv16 /nix/store/aimjdqqfyl4laxlkpc6gfnyvlsbxlvcv-pg_repack.drv17 /nix/store/b8z393jnpighs0xp0wn572slxhxhwnxp-pg_partman.drv18 /nix/store/cqki7rv2w3vxrsajqy279mhm5wa88fjp-wal2json.drv19 /nix/store/h5q13dsfp2bfp3ydgj9vdnx6fmnyfl2z-hypopg.drv20 /nix/store/ixv7i4skcbnzgym04khdnvkqa513ld45-plan_filter.drv21 /nix/store/j06p7y4xc647bfzs8ba58rf9h0ilbz44-pgmq.drv22 /nix/store/jrggalwa5kfhzqhcip8f5g1f584pazw5-plpgsql_check.drv23 /nix/store/lzgjq8v4l4vm5lwyxkllg0ii0n1vvam6-http.drv24 /nix/store/pjhzv6b54gh758msf91ibg3aggs5v63y-safeupdate.drv25 /nix/store/pwyqyi1k7a59b2jnwr875426synr7qmi-pg_cron.drv26 /nix/store/qfh9m6hmvdh3axd43qraz43rrjs2pjzr-pgsodium.drv27 /nix/store/qvw78yhywxdh6c8gky9qmdaxwka0hkyg-pgroonga.drv28 /nix/store/rcl303fv0rxrbkgjcwqi92h8hlsksl86-plv8.drv29 /nix/store/v38577cf27cjada1fbai6jc2gqc1yqg9-pg_jsonschema.drv30 /nix/store/w76pb8iwp6gmij6ng0xyxbdwpyp31gjx-vector.drv31 /nix/store/w8w3j8l9i3fwp8lvrddpz6szlbsz1b80-wrappers.drv32 /nix/store/wby05b23yks4smfxxdngav8mxnv4pvvi-index_advisor.drv33 /nix/store/ypgp6sck1rcalskz253f3a3g2vg8dqxn-postgis.drv34 /nix/store/zpy0anvh5rgr1fnrs39j7db1j07adpip-rum.drv35 /nix/store/a5gfyj0k47cxv70v4a1zhhk1998vd290-postgresql-and-plugins-15.19.drv36 /nix/store/69zc44dp9979jf4p9hcpgfdf1wgpw40l-postgresql-and-plugins-15.19.drv37 /nix/store/1nyr8hxhdprfgmxj3y07r35vb4vwpcbc-pgrouting.drv38 /nix/store/25f3g4qlwjv87pi5nckr9mr5901kwr9v-pg_jsonschema.drv39 /nix/store/2z9gqy2kdcqh0l3s21fdvaiwji4bw085-wrappers.drv40 /nix/store/5qbkncy11hxa3hjvxlivyk5jl56cqaca-pgroonga.drv41 /nix/store/67j8ga6fwaypskbxhllbgq14gg17lbgv-plpgsql_check.drv42 /nix/store/a1l87bw0qg8qb986f3iw25zbq2bh1kxl-wal2json.drv43 /nix/store/yrw0zf2hhdw02ib8y80blp0wyckv5j63-hypopg.drv44 /nix/store/fpx02gfczpp7gcdldgabjzhc7pj2b3yq-index_advisor.drv45 /nix/store/g8h2i50jjjbj01nf9na2hjc5p8jilfwq-vector.drv46 /nix/store/g9clk05ymhqn7csk59fpd1iksabh2vp2-safeupdate.drv47 /nix/store/h5axh42309k5kr942f64rxkr35s86nhm-pgtap.drv48 /nix/store/izcyq3yalzyqj7np7qbzynzk3k2ly0bi-supabase_vault.drv49 /nix/store/mdaxp5nsyc1yzfzmbyblarpc0sh9wwap-pg_graphql.drv50 /nix/store/mh8gnpab20pmx5vf0y4mckhswgh49akd-pgaudit.drv51 /nix/store/nx9fmd9gmal97jp7jj7j58hq3a79wdk5-http.drv52 /nix/store/q1dbay5va74kwxzxl0mj6q02899srnx1-plan_filter.drv53 /nix/store/r4vfiabbhgs1g8sj39raqak5w0yz6ks3-pgsodium.drv54 /nix/store/vav4ka95wh6pa1gfmjwqs55zwsg6rbvv-pg_partman.drv55 /nix/store/vgh7yrjnkl0nxm6bv1ssagw53l2zp28w-rum.drv56 /nix/store/ynlanaj7crkl24nh9bi8j5j1yfy8s729-postgis.drv57 /nix/store/zcn7i7hc0lsa7klrz0i0hqlvl695b524-pg_cron.drv58 /nix/store/8zk04h4lfkvx9n3w77wvzxpr6kns48ff-pg_net-0.20.3.drv59 /nix/store/bv2b3hyfiwg59frhybs6cmf9l26byfrs-pg_net-0.13.0.drv60 /nix/store/dxjxg15c0m6vdgy5yswqbm50g4fww2p1-pg_net-0.14.0.drv61 /nix/store/jvalwdcdi2ci9kcx1q2zx6hyla1sa738-pg_net-0.20.0.drv62 /nix/store/v7i610b6q10zpsd2536yvba9pd2xqrr6-pg_net-0.19.5.drv63 /nix/store/zd0hg58y5nwnnwfzy7sd19l7dzx4zvv5-pg_net.drv64 /nix/store/zfqi9c6lx1cs0kby458nlnhvvhhzml2c-pg_repack.drv65 /nix/store/zqvrbpa8h1rmsal3b4r8jphaqwycja93-pg_tle.drv66 /nix/store/m7073j3kxn6vxs53jdm448q51cxiimys-postgresql-and-plugins-17_22.drv67 /nix/store/q8qv7gf9izi4my9mjapggg0fx2dhzlwc-postgresql-and-plugins-17_22.drv68 /nix/store/ggzwf7y9bbwypxs8a44lg59dd3cbp5k5-system-path.drv69 /nix/store/7mf1lcyklc71a89s4mi3r7w8k39ihvya-dbus-1.drv70 /nix/store/wd8irv2ffhnmkp1bdcqcf4x5nyhapq43-X-Restart-Triggers-dbus.drv71 /nix/store/2i01a9qxfbdjlvkl937aq52x148dm5hk-unit-dbus.service.drv72 /nix/store/6axq4j62rji3faz7rvgyjfccczni7z3n-user-units.drv73 /nix/store/y85ggf9qcv7hsaxx3fyr5a14nf67953g-postgresql-orioledb-init.drv74 /nix/store/6dmfl5hj72ck728kvz45gg2241dk81ci-unit-postgresql.service.drv75 /nix/store/9hia6rkh5qzm30dxyfjihl6251cmnv0l-unit-dbus.service.drv76 /nix/store/7p4sg9x4d75pncaxpl0sa51ja5k2bik8-supabase-orioledb-db-init.drv77 /nix/store/dadjlp1c0v94bsq44xmi8yl99z9dwd3n-unit-supabase-db-init.service.drv78 /nix/store/nnswm02aq5rs1v3j77dlnha5mh5c19z7-system-units.drv79 /nix/store/dys7bm2r3m1f5zv7a66ajhqdsxph4zlw-etc.drv80 /nix/store/0mzm2f6fa46w1xld4wk2fb47gg0spks1-activate.drv81 /nix/store/yr25cab0bgg2gdcjr0fkk052aqw4ag84-postgresql-init.drv82 /nix/store/18idp8l89ga0vbjdvp5y33m42h8ypb3n-unit-postgresql.service.drv83 /nix/store/1h355q36hw8cd3dpsd4ydrb2f3mzpq37-rum.drv84 /nix/store/1qxq6npfmh7zfj0qs2ld3a1fpd0sbr7k-pg_repack.drv85 /nix/store/27vwnz41d4gqgak7jrw25h6myicnpc9g-pg_hashids.drv86 /nix/store/8rlk8y0giv6av6yxjvain89wy868fxzw-postgis.drv87 /nix/store/baf8b2gs6va3sk7kjdxlm4h721szjhmq-pgmq.drv88 /nix/store/h3jfznl8xhwm8wvvxg23yj74srzz3vii-pg_net-0.19.5.drv89 /nix/store/jdx62c5jlcjxsbqjaqi25zwfy2ys9jp5-pg_net-0.13.0.drv90 /nix/store/ky294hja2giinx8655lj1d83j4jq5gjj-pg_net-0.14.0.drv91 /nix/store/ky7414m088qm5h8xn9z7xzw0k08wgcrh-pg_net-0.20.0.drv92 /nix/store/cqdc5q7n6g9pkxy0cjcvkq185rps4bfd-pg_net.drv93 /nix/store/i9c59glkkfckl8igi51prmm5q8q0l9ii-wrappers.drv94 /nix/store/jdxl52i1wbdwgwrddbbq6jk3dy1rsih5-pg_stat_monitor.drv95 /nix/store/kjb0q84944pahkp1dirilg67gg7knp0i-plan_filter.drv96 /nix/store/mp12r50yfdkn8dm3j6icsav4pddpq7ix-pgaudit.drv97 /nix/store/mqhnafzmjc615s8r65m33p2l62pf5kvi-pg_tle.drv98 /nix/store/pp6iq08yhjcnrm9cpgfn8bnlskbj452w-pgroonga.drv99 /nix/store/rqsiiiadw0ryddm9sb0qa26d8c6xzsis-http.drv100 /nix/store/vjn7gz0pab3nkxs3klbqdbi8j68v291p-pgrouting.drv101 /nix/store/xibm7yh8fni2maxnqscqm8mmsswpv9nb-plpgsql_check.drv102 /nix/store/z1c8kqi7q1ixgzsnw9i726rj3jk14b9v-wal2json.drv103 /nix/store/zssagmq5hk8vpnc9iw1q905bpj0jnrfr-vector.drv104 /nix/store/d5s4s970iizz6a8w5ndnpzyw63w1m1qv-postgresql-and-plugins-17.11.drv105 /nix/store/7hla3p20yajypj5w3hnrx38bc3kq14vq-postgresql-and-plugins-17.11.drv106 /nix/store/319yam8jpgm13yfxs5psx2g1j4zd346h-postgresql-migrate.drv107 /nix/store/sn90bhb87fs1r7szfvpnhakcf5cbqipi-system-path.drv108 /nix/store/rnjj94ch4qaxpyhgvk900hq1rp2ji4cx-dbus-1.drv109 /nix/store/bj8k3q4xx5yxsjpcz0k6pjkann65ifyp-X-Restart-Triggers-dbus.drv110 /nix/store/ljfzjxqwx4kxjwxjjlnpaqdzh0xqd7xr-unit-dbus.service.drv111 /nix/store/jphjq6s3xb6lm1r9a0yllq3wvcijkikd-user-units.drv112 /nix/store/9dhmhlajdjqsz58msmq42lwanwgk4c0z-supabase-db-init.drv113 /nix/store/9189fi92i7805xz024zxxwljw2xfqplf-unit-supabase-db-init.service.drv114 /nix/store/ks9rz4w18q5w6apnl8bszi42p6fqb7w9-unit-dbus.service.drv115 /nix/store/w29pxvjbvdmyac5wz16l2kakq9n2w4dn-system-units.drv116 /nix/store/5i64fsbcnqkbbwyscs590q4x0kckm8vz-etc.drv117 /nix/store/f3zaq5gia1p450hfwx1a5ka9b2crwvpc-activate.drv118 /nix/store/flpw9rfcwf20596nm3x5g91lj4wx6gsa-nixos-system-server-test.drv119 /nix/store/rp3411xgkcmbnrvxwgg7kxxlhj217519-system-path.drv120 /nix/store/jwcb2kgwrcwds3m6z7byrg26qackyaxf-dbus-1.drv121 /nix/store/hkbib28lgy3sdk60wwh6fnjx17lrpkd0-X-Restart-Triggers-dbus.drv122 /nix/store/zbb4xyx08cfb7d20vxf6chbzvcw94xva-unit-dbus.service.drv123 /nix/store/6w9n69ddwya8kjxyrz8n8p48cnhhv8m2-user-units.drv124 /nix/store/a0nhwyhawfp54kccbpjcvlkybsc46m66-unit-dbus.service.drv125 /nix/store/vl4z7w7y2dciycqgcm6qp86dpgddrqgg-unit-postgresql.service.drv126 /nix/store/xvpj8kcdwibf0zb3lvh74lg9sn132fb6-unit-postgresql-migrate.service.drv127 /nix/store/bk16kzbxqyyqfg6qlmkplrgfhv7k21kl-system-units.drv128 /nix/store/yigqx2853rhqfbmrfci5bzld6c089mrd-etc.drv129 /nix/store/9i17zb3islwpb2pj7iwsw6d08gv9zdi2-activate.drv130 /nix/store/imr0jfl9r75i4l9br1zkqw4li7qls97p-nixos-system-server-test.drv131 /nix/store/zn5pqckvabyvbj8b760an4hwnbp3x1vx-nixos-system-server-test.drv132 /nix/store/l3g0a20fmxqmkdp4radxq4r3xd5jwzjy-closure-info.drv133 /nix/store/q1smldjprgklvy119fkq6b38a23idjc4-run-nixos-vm.drv134 /nix/store/c0y8vb21y52ps11vi8ajzkqyvl7dd7nz-nixos-vm.drv135 /nix/store/3ngaaqb5yrwkgwk0i7iwl63xngb9m1q8-nixos-test-driver-pgrouting.drv136 /nix/store/qwkwqsjxx1l5y5j91y4f8kzwvwnr5728-vm-test-run-pgrouting.drv137these 94 paths will be fetched (776.1 MiB download, 3.5 GiB unpacked):138 /nix/store/c73wvy3iz85fpg2a9i3b0gwl8n4gcwrl-pg_repack-1.5.0139 /nix/store/b1lf5yx9a9ayz2csv73vm79xi7yj8hbp-pg_repack-1.5.1140 /nix/store/ikpbqpw667jjfjrvbkdya39m197q3zl0-pg_repack-1.5.1141 /nix/store/sdn74bzm21xz2f9w2l4jzlk3kmd4kviz-pg_repack-1.5.2142 /nix/store/y78xmqz8yjxssyk5g1x3qrdfsgmbyn0n-pg_repack-1.5.2143 /nix/store/1py8rr1lnxvm1y3kl3k6vrqc89ga4pkv-pgaudit-17.0144 /nix/store/c3h5qqxj3f661jd41qkws7qdklm8daqm-pgaudit-17.0145 /nix/store/hd3qc5va0av1w0r26ilxvjaj335kjmc8-pgaudit-17.1146 /nix/store/i7q1amsnccv1r3dam5m3hinfgyms6k31-pgaudit-17.1147 /nix/store/6r8rfychwnaxhc6s80drafb8lw2vg7lv-pgroonga-3.2.5148 /nix/store/cxkwj22k0v7k06bw9ljgdzs1frklqi3q-pgroonga-3.2.5149 /nix/store/bmxiqr1pkrcyv982fpjpp4sw4pmhrlkz-pgrouting-3.4.1150 /nix/store/cl3v2hc1cdfvyngjzklmxipfbxm2pcrw-pgrouting-3.4.1151 /nix/store/pw71ikfs0cw5ndx1b3x3pbn7y1wi39am-pgsodium-3.0.4152 /nix/store/j24k690yp9jyjladi76lvllw1wzaqwan-pgsodium-3.1.5153 /nix/store/hnnzrsqml0nil5xriwh5ng60a27lkj6w-pgsodium-3.1.6154 /nix/store/3qm2q68nmim3i60bljczzy26s0lgkwfr-pgsodium-3.1.7155 /nix/store/7049xir17j7vyf6h34qiwz62qh0bynvd-pgsodium-3.1.8156 /nix/store/3vr1kkxiz8x52x8j1h29ylc1w0l1qm07-pgtap-1.3.1157 /nix/store/z35zmdmzh8q22cvhnjrm2yv65nadb626-pgtap-1.3.1158 /nix/store/ad6sm96mja4h2wc7mmbnsr9lk0biwx4f-plpgsql_check-2.7159 /nix/store/yk882rxplwl9d7szypyfbmg7ymv3a3jx-plpgsql_check-2.7160 /nix/store/15sy169848i2q1l48l4fsjf1kwhnblrm-plpgsql_check-2.8161 /nix/store/62x28v1m7p3qp6cv70myrslb222g95dq-plpgsql_check-2.8162 /nix/store/g5ck6ih86l3ic3ixpkvz81mng62krw8w-postgis-3.3.2163 /nix/store/dlk1ad33d0vh9q3171zfqxlixbjz4c7f-postgis-3.3.7164 /nix/store/nrrx8589qpxarqcnxxk7yfssqc2bs45d-postgis-3.3.7165 /nix/store/m64jqg5dmhgqk68zpxc1jg2l8zdq1591-rum-1.3166 /nix/store/ydfs8hxzypxrd1dkvdm5wvp4snllhf9k-rum-1.3167 /nix/store/nanv8c5jrkhq6dcaqgws29ybaar963zp-safeupdate-1.4168 /nix/store/x26gjcpyyj9l2akpzhbc1m3031diwl6y-supabase_vault-0.2.8169 /nix/store/mpc7a5x6ylswpax126jf68w4vmkcynjy-supabase_vault-0.3.1170 /nix/store/8dic511dbfddsswj6zq2fn3wb23aqvrm-vector-0.5.1171 /nix/store/qhad04j8qa3ncr8flbcd9l26q3xxlm8p-vector-0.5.1172 /nix/store/fhb6ygrfmyy3mis40ccqab1g1ifdsg71-vector-0.6.0173 /nix/store/j0isrpx08xfrb02q1r7rfzzszm2ify1n-vector-0.6.0174 /nix/store/545zc19a8pq380pllc153a7d10mb48qa-vector-0.6.2175 /nix/store/b88i29hws1g9k2h0as8yqvvwigjjywqp-vector-0.6.2176 /nix/store/2q0wdsj5gbsxfn496wzsyw3n6m9gh4j8-vector-0.7.0177 /nix/store/lvs2hp1frsyi20fk8wbcrn6fld2xxwg3-vector-0.7.0178 /nix/store/nx3d3vcsmjqnmzyhqfa8wp65wgf41xl7-vector-0.7.4179 /nix/store/pna4jd7vy6k0rs595fqr32105j21859s-vector-0.7.4180 /nix/store/1bsy8n42glczbkpznbznfznb0fxvfv3m-vector-0.8.0181 /nix/store/d4y0adaf5wslnvccjzdzbs71c3rcnx6k-vector-0.8.0182 /nix/store/xywif7hw5h5ba5bnvdvb022dl3c4rghi-vector-0.8.0183 /nix/store/42s9wyq6qykv8g53mfamblzpywpz6x0n-vector-0.8.2184 /nix/store/4mwrnmmmm5krv7hp3fwvanll55gfkmac-vector-0.8.2185 /nix/store/7cklm7mvkqshfvklp8pvvgvy20n6f8sc-vector-0.8.2186 /nix/store/62hr05yh72x91pwbryhgiwwb1vw9jncd-wal2json-2.6187 /nix/store/n19730h9wyrfcnj4x8gjvhaknc95i895-wal2json-2.6188 /nix/store/q40ph33v5z8ibjgv3rwjs1lsgb49y2ax-wal2json-2.6189 /nix/store/pbxj5bz7s4bhwylxbjzyjh02y5rybfyr-wrappers-0.3.0190 /nix/store/n2n10ww41kzpmbp6l06n7hh7g29fdz83-wrappers-0.4.1191 /nix/store/k33zl01mjhqjzjwrvdny4avm9g9qp496-wrappers-0.4.2192 /nix/store/0ny88s7hix1m40srp6x9268w6y2al75z-wrappers-0.4.3193 /nix/store/4qckiynpgxdp32czp3l39gzj479qa2vw-wrappers-0.4.4194 /nix/store/i6pp882w31vpn0hmb02080ay7r0imjq9-wrappers-0.4.4195 /nix/store/jcnwsjsm9gj9as3ws5aa7h925kjyr5hv-wrappers-0.4.4196 /nix/store/9mbppswb56zvld9d1gcjy72d2cp11ysn-wrappers-0.4.5197 /nix/store/aynrlrxq94r9pn1kswsprn31vzyzhk0v-wrappers-0.4.5198 /nix/store/b4ykcbp3mfwsdgwmrpm7qyibqfvhq1xr-wrappers-0.4.5199 /nix/store/0v7fkf0vw37c4f5zr4f4bz2qbhn1cqv1-wrappers-0.4.6200 /nix/store/nx27x8nn1wj883hn2l6gr08m8l5d3z2i-wrappers-0.4.6201 /nix/store/xjxsjj1nj61lb12cr3i9r5wprmpfjrh6-wrappers-0.4.6202 /nix/store/r12xlkig3q1yq8wygr0liqayvz5vrjsn-wrappers-0.5.0203 /nix/store/r44rls58zldj08syhz67sbcl7rpagbkf-wrappers-0.5.0204 /nix/store/rq4ycpi3amjv916572zv5x0khq5wvdjd-wrappers-0.5.0205 /nix/store/79q2wmjs4yvlbdncmdk79685viv3qpmv-wrappers-0.5.3206 /nix/store/lx7c3rzc9vcyhh3dk5sxdcjxjhvlnl0s-wrappers-0.5.3207 /nix/store/ss8rk4ak5hsj1k6awkhcxzrilpz73h27-wrappers-0.5.3208 /nix/store/fpcpk0p0xp411f35nxrzahrq2mwsgfvx-wrappers-0.5.4209 /nix/store/ipqn16y4b5i9cnmx1vc8z9jys1z28lg5-wrappers-0.5.4210 /nix/store/n7dj8dkgh4h26mfx1nzannwrya0kjqhf-wrappers-0.5.4211 /nix/store/chvgw364xjxkgnlrxlmhvyk0gnqljy9f-wrappers-0.5.5212 /nix/store/hhfb45mbbm9d4y14gjrysggjn1cygryd-wrappers-0.5.5213 /nix/store/hqfhk0h4rj0vqh1vkm561waxly6cc7w1-wrappers-0.5.5214 /nix/store/lxcylrr0hj3chx5gbnf1lq4pp49gsm4g-wrappers-0.5.6215 /nix/store/r89q9xp7rn48w6mhasmc15bc7msaah6z-wrappers-0.5.6216 /nix/store/zzfhj6g9mf135i7m18p3h7wvpm19h5zz-wrappers-0.5.6217 /nix/store/hj2wcbblrszjmm89w39x9bigw7i563sw-wrappers-0.5.7218 /nix/store/rpadycy2fl2da1wl8wy0897yfhb2wjfc-wrappers-0.5.7219 /nix/store/ws55h1zcbaf95aqcx1cax86jqa9lr3c6-wrappers-0.5.7220 /nix/store/d6knx45df8lnnb5i12flnkkbpb3vhagh-wrappers-0.6.0221 /nix/store/jf2k5r36x51fcbw987xbwvk47qaaw68z-wrappers-0.6.0222 /nix/store/kqgyk1gz07nfphc66dx8a61gmbdvnkyy-wrappers-0.6.0223 /nix/store/3kl1dhpvskh4jx6nmqwi1bycb673pcwi-wrappers-0.6.1224 /nix/store/3vij4q3rchzcg30l4z6sazhzb4s9sr13-wrappers-0.6.1225 /nix/store/nv1r7alrkp4mnq6j6l2w641dmqsac8cl-wrappers-0.6.1226 /nix/store/an7kvlc76daf1cq5qygcnccm1hv74dc1-wrappers-0.6.2227 /nix/store/dw4b1ffjps5i8aqccdjyjcr6qkvf7865-wrappers-0.6.2228 /nix/store/ns5s2hrc8gvlnmpg4ngzkn90nmx7h7rd-wrappers-0.6.2229 /nix/store/22gbgsj3izxjmqqzv3194j04k1z9xbgg-wrappers-0.6.3230 /nix/store/36nx0n9iavpzspp1r2kn3db434z9hd44-wrappers-0.6.3231 /nix/store/mkylxmc3h6cmd562l020y55q8nmh80nl-wrappers-0.6.3232error: Cannot build '/nix/store/jvalwdcdi2ci9kcx1q2zx6hyla1sa738-pg_net-0.20.0.drv'.233 Reason: builder failed with exit code 2.234 Output paths:235 /nix/store/rqjwkm6vikims9d8b7f0a6x4n2qbkq4s-pg_net-0.20.0236 Last 22 log lines:237 > Running phase: unpackPhase238 > unpacking source archive /nix/store/3783i7yhcfqnyv5ndli22gcr11ap151m-source239 > source root is source240 > Running phase: patchPhase241 > Running phase: updateAutotoolsGnuConfigScriptsPhase242 > Running phase: configurePhase243 > no configure script, doing nothing244 > Running phase: buildPhase245 > gcc -Wall -Wmissing-prototypes -Wpointer-arith -Wdeclaration-after-statement -Werror=vla -Wendif-labels -Wmissing-format-attribute -Wimplicit-fallthrough=3 -Wcast-function-type -Wshadow=compatible-local -Wformat-security -fno-strict-aliasing -fwrapv -fexcess-precision=standard -Wno-format-truncation -Wno-stringop-truncation -g -O2 -std=c11 -Wextra -Wall -Werror -Wno-declaration-after-statement -Wno-vla -Wno-long-long -Wmissing-variable-declarations -fPIC -fvisibility=hidden -DEXTVERSION=\"0.20.0\" -I. -I./ -I/nix/store/qmc7y6nc0qxg50ywm46x4iaqq5knz702-postgresql-17_22/include/server -I/nix/store/qmc7y6nc0qxg50ywm46x4iaqq5knz702-postgresql-17_22/include/internal -D_GNU_SOURCE -I/nix/store/5nl2zr46dic7mxcw6cvbq85wa8c2gngh-libxml2-2.15.1-dev/include/libxml2 -I/nix/store/sl10j863s32x7dv5vw6wfx1nh22f3xh2-lz4-1.10.0-dev/include -I/nix/store/di94mxmhhk390zzzv2gvavfwkgww7q6h-zstd-1.5.7-dev/include -I/nix/store/h5hfqhzcqszmsacj26hh3fngwcal04zs-icu4c-75.1-dev/include -c -o src/core.o src/core.c246 > gcc -Wall -Wmissing-prototypes -Wpointer-arith -Wdeclaration-after-statement -Werror=vla -Wendif-labels -Wmissing-format-attribute -Wimplicit-fallthrough=3 -Wcast-function-type -Wshadow=compatible-local -Wformat-security -fno-strict-aliasing -fwrapv -fexcess-precision=standard -Wno-format-truncation -Wno-stringop-truncation -g -O2 -std=c11 -Wextra -Wall -Werror -Wno-declaration-after-statement -Wno-vla -Wno-long-long -Wmissing-variable-declarations -fPIC -fvisibility=hidden -DEXTVERSION=\"0.20.0\" -I. -I./ -I/nix/store/qmc7y6nc0qxg50ywm46x4iaqq5knz702-postgresql-17_22/include/server -I/nix/store/qmc7y6nc0qxg50ywm46x4iaqq5knz702-postgresql-17_22/include/internal -D_GNU_SOURCE -I/nix/store/5nl2zr46dic7mxcw6cvbq85wa8c2gngh-libxml2-2.15.1-dev/include/libxml2 -I/nix/store/sl10j863s32x7dv5vw6wfx1nh22f3xh2-lz4-1.10.0-dev/include -I/nix/store/di94mxmhhk390zzzv2gvavfwkgww7q6h-zstd-1.5.7-dev/include -I/nix/store/h5hfqhzcqszmsacj26hh3fngwcal04zs-icu4c-75.1-dev/include -c -o src/errors.o src/errors.c247 > gcc -Wall -Wmissing-prototypes -Wpointer-arith -Wdeclaration-after-statement -Werror=vla -Wendif-labels -Wmissing-format-attribute -Wimplicit-fallthrough=3 -Wcast-function-type -Wshadow=compatible-local -Wformat-security -fno-strict-aliasing -fwrapv -fexcess-precision=standard -Wno-format-truncation -Wno-stringop-truncation -g -O2 -std=c11 -Wextra -Wall -Werror -Wno-declaration-after-statement -Wno-vla -Wno-long-long -Wmissing-variable-declarations -fPIC -fvisibility=hidden -DEXTVERSION=\"0.20.0\" -I. -I./ -I/nix/store/qmc7y6nc0qxg50ywm46x4iaqq5knz702-postgresql-17_22/include/server -I/nix/store/qmc7y6nc0qxg50ywm46x4iaqq5knz702-postgresql-17_22/include/internal -D_GNU_SOURCE -I/nix/store/5nl2zr46dic7mxcw6cvbq85wa8c2gngh-libxml2-2.15.1-dev/include/libxml2 -I/nix/store/sl10j863s32x7dv5vw6wfx1nh22f3xh2-lz4-1.10.0-dev/include -I/nix/store/di94mxmhhk390zzzv2gvavfwkgww7q6h-zstd-1.5.7-dev/include -I/nix/store/h5hfqhzcqszmsacj26hh3fngwcal04zs-icu4c-75.1-dev/include -c -o src/event.o src/event.c248 > In file included from /nix/store/wflnb8fxmq4lqx3ca91hlpv95vrqkv51-curl-8.17.0-dev/include/curl/curl.h:3333,249 > from /nix/store/wflnb8fxmq4lqx3ca91hlpv95vrqkv51-curl-8.17.0-dev/include/curl/multi.h:51,250 > from src/event.h:4,251 > from src/event.c:6:252 > /nix/store/wflnb8fxmq4lqx3ca91hlpv95vrqkv51-curl-8.17.0-dev/include/curl/multi.h:429:23: error: expected identifier or '(' before '__extension__'253 > 429 | CURL_EXTERN CURLMcode curl_multi_setopt(CURLM *multi_handle,254 > | ^~~~~~~~~~~~~~~~~255 > /nix/store/wflnb8fxmq4lqx3ca91hlpv95vrqkv51-curl-8.17.0-dev/include/curl/multi.h:429:23: error: expected identifier or '(' before ')' token256 > 429 | CURL_EXTERN CURLMcode curl_multi_setopt(CURLM *multi_handle,257 > | ^~~~~~~~~~~~~~~~~258 > make: *** [<builtin>: src/event.o] Error 1259 For full logs, run:260 nix log /nix/store/jvalwdcdi2ci9kcx1q2zx6hyla1sa738-pg_net-0.20.0.drv261error: Cannot build '/nix/store/jdx62c5jlcjxsbqjaqi25zwfy2ys9jp5-pg_net-0.13.0.drv'.262 Reason: builder failed with exit code 2.263 Output paths:264 /nix/store/z8m2csva6bci9vlabgjm2wqd19ww393d-pg_net-0.13.0265 Last 25 log lines:266 > | ^~~~~~~~~~~~~~267 > src/util.h:6:11: warning: call to 'Wcurl_easy_setopt_err_long' declared with attribute warning: curl_easy_setopt expects a long argument [-Wattribute-warning]268 > 6 | if (curl_easy_setopt(hdl, opt, prm) != CURLE_OK) \269 > | ^~~~~~~~~~~~~~~~270 > src/core.c:108:3: note: in expansion of macro 'CURL_EZ_SETOPT'271 > 108 | CURL_EZ_SETOPT(curl_ez_handle, CURLOPT_TIMEOUT_MS, timeout_milliseconds);272 > | ^~~~~~~~~~~~~~273 > src/util.h:6:11: warning: call to 'Wcurl_easy_setopt_err_long' declared with attribute warning: curl_easy_setopt expects a long argument [-Wattribute-warning]274 > 6 | if (curl_easy_setopt(hdl, opt, prm) != CURLE_OK) \275 > | ^~~~~~~~~~~~~~~~276 > src/core.c:110:3: note: in expansion of macro 'CURL_EZ_SETOPT'277 > 110 | CURL_EZ_SETOPT(curl_ez_handle, CURLOPT_FOLLOWLOCATION, true);278 > | ^~~~~~~~~~~~~~279 > gcc -Wall -Wmissing-prototypes -Wpointer-arith -Wdeclaration-after-statement -Werror=vla -Wendif-labels -Wmissing-format-attribute -Wimplicit-fallthrough=3 -Wcast-function-type -Wshadow=compatible-local -Wformat-security -fno-strict-aliasing -fwrapv -fexcess-precision=standard -Wno-format-truncation -Wno-stringop-truncation -g -O2 -std=c11 -Werror -Wno-declaration-after-statement -fPIC -fvisibility=hidden -DEXTVERSION=\"0.13.0\" -I. -I./ -I/nix/store/dj25xabr71j1mmxf628lqsn61qd5qcyk-postgresql-17.11/include/server -I/nix/store/dj25xabr71j1mmxf628lqsn61qd5qcyk-postgresql-17.11/include/internal -D_GNU_SOURCE -I/nix/store/5nl2zr46dic7mxcw6cvbq85wa8c2gngh-libxml2-2.15.1-dev/include/libxml2 -I/nix/store/sl10j863s32x7dv5vw6wfx1nh22f3xh2-lz4-1.10.0-dev/include -I/nix/store/di94mxmhhk390zzzv2gvavfwkgww7q6h-zstd-1.5.7-dev/include -I/nix/store/h5hfqhzcqszmsacj26hh3fngwcal04zs-icu4c-75.1-dev/include -c -o src/event.o src/event.c280 > In file included from /nix/store/wflnb8fxmq4lqx3ca91hlpv95vrqkv51-curl-8.17.0-dev/include/curl/curl.h:3333,281 > from /nix/store/wflnb8fxmq4lqx3ca91hlpv95vrqkv51-curl-8.17.0-dev/include/curl/multi.h:51,282 > from src/event.h:4,283 > from src/event.c:6:284 > /nix/store/wflnb8fxmq4lqx3ca91hlpv95vrqkv51-curl-8.17.0-dev/include/curl/multi.h:429:23: error: expected identifier or '(' before '__extension__'285 > 429 | CURL_EXTERN CURLMcode curl_multi_setopt(CURLM *multi_handle,286 > | ^~~~~~~~~~~~~~~~~287 > /nix/store/wflnb8fxmq4lqx3ca91hlpv95vrqkv51-curl-8.17.0-dev/include/curl/multi.h:429:23: error: expected identifier or '(' before ')' token288 > 429 | CURL_EXTERN CURLMcode curl_multi_setopt(CURLM *multi_handle,289 > | ^~~~~~~~~~~~~~~~~290 > make: *** [<builtin>: src/event.o] Error 1291 For full logs, run:292 nix log /nix/store/jdx62c5jlcjxsbqjaqi25zwfy2ys9jp5-pg_net-0.13.0.drv293error: Cannot build '/nix/store/ky7414m088qm5h8xn9z7xzw0k08wgcrh-pg_net-0.20.0.drv'.294 Reason: builder failed with exit code 2.295 Output paths:296 /nix/store/div76hg9lzzwipcrl72qfbl1vaps6bqr-pg_net-0.20.0297 Last 22 log lines:298 > Running phase: unpackPhase299 > unpacking source archive /nix/store/3783i7yhcfqnyv5ndli22gcr11ap151m-source300 > source root is source301 > Running phase: patchPhase302 > Running phase: updateAutotoolsGnuConfigScriptsPhase303 > Running phase: configurePhase304 > no configure script, doing nothing305 > Running phase: buildPhase306 > gcc -Wall -Wmissing-prototypes -Wpointer-arith -Wdeclaration-after-statement -Werror=vla -Wendif-labels -Wmissing-format-attribute -Wimplicit-fallthrough=3 -Wcast-function-type -Wshadow=compatible-local -Wformat-security -fno-strict-aliasing -fwrapv -fexcess-precision=standard -Wno-format-truncation -Wno-stringop-truncation -g -O2 -std=c11 -Wextra -Wall -Werror -Wno-declaration-after-statement -Wno-vla -Wno-long-long -Wmissing-variable-declarations -fPIC -fvisibility=hidden -DEXTVERSION=\"0.20.0\" -I. -I./ -I/nix/store/dj25xabr71j1mmxf628lqsn61qd5qcyk-postgresql-17.11/include/server -I/nix/store/dj25xabr71j1mmxf628lqsn61qd5qcyk-postgresql-17.11/include/internal -D_GNU_SOURCE -I/nix/store/5nl2zr46dic7mxcw6cvbq85wa8c2gngh-libxml2-2.15.1-dev/include/libxml2 -I/nix/store/sl10j863s32x7dv5vw6wfx1nh22f3xh2-lz4-1.10.0-dev/include -I/nix/store/di94mxmhhk390zzzv2gvavfwkgww7q6h-zstd-1.5.7-dev/include -I/nix/store/h5hfqhzcqszmsacj26hh3fngwcal04zs-icu4c-75.1-dev/include -c -o src/core.o src/core.c307 > gcc -Wall -Wmissing-prototypes -Wpointer-arith -Wdeclaration-after-statement -Werror=vla -Wendif-labels -Wmissing-format-attribute -Wimplicit-fallthrough=3 -Wcast-function-type -Wshadow=compatible-local -Wformat-security -fno-strict-aliasing -fwrapv -fexcess-precision=standard -Wno-format-truncation -Wno-stringop-truncation -g -O2 -std=c11 -Wextra -Wall -Werror -Wno-declaration-after-statement -Wno-vla -Wno-long-long -Wmissing-variable-declarations -fPIC -fvisibility=hidden -DEXTVERSION=\"0.20.0\" -I. -I./ -I/nix/store/dj25xabr71j1mmxf628lqsn61qd5qcyk-postgresql-17.11/include/server -I/nix/store/dj25xabr71j1mmxf628lqsn61qd5qcyk-postgresql-17.11/include/internal -D_GNU_SOURCE -I/nix/store/5nl2zr46dic7mxcw6cvbq85wa8c2gngh-libxml2-2.15.1-dev/include/libxml2 -I/nix/store/sl10j863s32x7dv5vw6wfx1nh22f3xh2-lz4-1.10.0-dev/include -I/nix/store/di94mxmhhk390zzzv2gvavfwkgww7q6h-zstd-1.5.7-dev/include -I/nix/store/h5hfqhzcqszmsacj26hh3fngwcal04zs-icu4c-75.1-dev/include -c -o src/errors.o src/errors.c308 > gcc -Wall -Wmissing-prototypes -Wpointer-arith -Wdeclaration-after-statement -Werror=vla -Wendif-labels -Wmissing-format-attribute -Wimplicit-fallthrough=3 -Wcast-function-type -Wshadow=compatible-local -Wformat-security -fno-strict-aliasing -fwrapv -fexcess-precision=standard -Wno-format-truncation -Wno-stringop-truncation -g -O2 -std=c11 -Wextra -Wall -Werror -Wno-declaration-after-statement -Wno-vla -Wno-long-long -Wmissing-variable-declarations -fPIC -fvisibility=hidden -DEXTVERSION=\"0.20.0\" -I. -I./ -I/nix/store/dj25xabr71j1mmxf628lqsn61qd5qcyk-postgresql-17.11/include/server -I/nix/store/dj25xabr71j1mmxf628lqsn61qd5qcyk-postgresql-17.11/include/internal -D_GNU_SOURCE -I/nix/store/5nl2zr46dic7mxcw6cvbq85wa8c2gngh-libxml2-2.15.1-dev/include/libxml2 -I/nix/store/sl10j863s32x7dv5vw6wfx1nh22f3xh2-lz4-1.10.0-dev/include -I/nix/store/di94mxmhhk390zzzv2gvavfwkgww7q6h-zstd-1.5.7-dev/include -I/nix/store/h5hfqhzcqszmsacj26hh3fngwcal04zs-icu4c-75.1-dev/include -c -o src/event.o src/event.c309 > In file included from /nix/store/wflnb8fxmq4lqx3ca91hlpv95vrqkv51-curl-8.17.0-dev/include/curl/curl.h:3333,310 > from /nix/store/wflnb8fxmq4lqx3ca91hlpv95vrqkv51-curl-8.17.0-dev/include/curl/multi.h:51,311 > from src/event.h:4,312 > from src/event.c:6:313 > /nix/store/wflnb8fxmq4lqx3ca91hlpv95vrqkv51-curl-8.17.0-dev/include/curl/multi.h:429:23: error: expected identifier or '(' before '__extension__'314 > 429 | CURL_EXTERN CURLMcode curl_multi_setopt(CURLM *multi_handle,315 > | ^~~~~~~~~~~~~~~~~316 > /nix/store/wflnb8fxmq4lqx3ca91hlpv95vrqkv51-curl-8.17.0-dev/include/curl/multi.h:429:23: error: expected identifier or '(' before ')' token317 > 429 | CURL_EXTERN CURLMcode curl_multi_setopt(CURLM *multi_handle,318 > | ^~~~~~~~~~~~~~~~~319 > make: *** [<builtin>: src/event.o] Error 1320 For full logs, run:321 nix log /nix/store/ky7414m088qm5h8xn9z7xzw0k08wgcrh-pg_net-0.20.0.drv322error: Cannot build '/nix/store/ymx9gp4jhvd7qpjvk95vw2m6ycb0jal7-pg_net-0.13.0.drv'.323 Reason: builder failed with exit code 2.324 Output paths:325 /nix/store/pxjg6rykpbbhl7xmwasvyb94bc1v5w3r-pg_net-0.13.0326 Last 25 log lines:327 > | ^~~~~~~~~~~~~~328 > src/util.h:6:11: warning: call to 'Wcurl_easy_setopt_err_long' declared with attribute warning: curl_easy_setopt expects a long argument [-Wattribute-warning]329 > 6 | if (curl_easy_setopt(hdl, opt, prm) != CURLE_OK) \330 > | ^~~~~~~~~~~~~~~~331 > src/core.c:108:3: note: in expansion of macro 'CURL_EZ_SETOPT'332 > 108 | CURL_EZ_SETOPT(curl_ez_handle, CURLOPT_TIMEOUT_MS, timeout_milliseconds);333 > | ^~~~~~~~~~~~~~334 > src/util.h:6:11: warning: call to 'Wcurl_easy_setopt_err_long' declared with attribute warning: curl_easy_setopt expects a long argument [-Wattribute-warning]335 > 6 | if (curl_easy_setopt(hdl, opt, prm) != CURLE_OK) \336 > | ^~~~~~~~~~~~~~~~337 > src/core.c:110:3: note: in expansion of macro 'CURL_EZ_SETOPT'338 > 110 | CURL_EZ_SETOPT(curl_ez_handle, CURLOPT_FOLLOWLOCATION, true);339 > | ^~~~~~~~~~~~~~340 > gcc -Wall -Wmissing-prototypes -Wpointer-arith -Wdeclaration-after-statement -Werror=vla -Wendif-labels -Wmissing-format-attribute -Wimplicit-fallthrough=3 -Wcast-function-type -Wformat-security -fno-strict-aliasing -fwrapv -fexcess-precision=standard -Wno-deprecated-non-prototype -Wno-format-truncation -Wno-stringop-truncation -g -O2 -std=gnu17 -std=c11 -Werror -Wno-declaration-after-statement -fPIC -DEXTVERSION=\"0.13.0\" -I. -I./ -I/nix/store/804f042cyc4dca4vwl2fmh1rhfy0sij9-postgresql-15.19/include/server -I/nix/store/804f042cyc4dca4vwl2fmh1rhfy0sij9-postgresql-15.19/include/internal -D_GNU_SOURCE -I/nix/store/5nl2zr46dic7mxcw6cvbq85wa8c2gngh-libxml2-2.15.1-dev/include/libxml2 -I/nix/store/sl10j863s32x7dv5vw6wfx1nh22f3xh2-lz4-1.10.0-dev/include -I/nix/store/di94mxmhhk390zzzv2gvavfwkgww7q6h-zstd-1.5.7-dev/include -I/nix/store/h5hfqhzcqszmsacj26hh3fngwcal04zs-icu4c-75.1-dev/include -c -o src/event.o src/event.c341 > In file included from /nix/store/wflnb8fxmq4lqx3ca91hlpv95vrqkv51-curl-8.17.0-dev/include/curl/curl.h:3333,342 > from /nix/store/wflnb8fxmq4lqx3ca91hlpv95vrqkv51-curl-8.17.0-dev/include/curl/multi.h:51,343 > from src/event.h:4,344 > from src/event.c:6:345 > /nix/store/wflnb8fxmq4lqx3ca91hlpv95vrqkv51-curl-8.17.0-dev/include/curl/multi.h:429:23: error: expected identifier or '(' before '__extension__'346 > 429 | CURL_EXTERN CURLMcode curl_multi_setopt(CURLM *multi_handle,347 > | ^~~~~~~~~~~~~~~~~348 > /nix/store/wflnb8fxmq4lqx3ca91hlpv95vrqkv51-curl-8.17.0-dev/include/curl/multi.h:429:23: error: expected identifier or '(' before ')' token349 > 429 | CURL_EXTERN CURLMcode curl_multi_setopt(CURLM *multi_handle,350 > | ^~~~~~~~~~~~~~~~~351 > make: *** [<builtin>: src/event.o] Error 1352 For full logs, run:353 nix log /nix/store/ymx9gp4jhvd7qpjvk95vw2m6ycb0jal7-pg_net-0.13.0.drv354error: Cannot build '/nix/store/h3jfznl8xhwm8wvvxg23yj74srzz3vii-pg_net-0.19.5.drv'.355 Reason: builder failed with exit code 2.356 Output paths:357 /nix/store/yc457kag2jhvws0021nbq7nsws86glnl-pg_net-0.19.5358 Last 22 log lines:359 > Running phase: unpackPhase360 > unpacking source archive /nix/store/5zgdqy3bz93jyn79pizxc1hks0cdcadw-source361 > source root is source362 > Running phase: patchPhase363 > Running phase: updateAutotoolsGnuConfigScriptsPhase364 > Running phase: configurePhase365 > no configure script, doing nothing366 > Running phase: buildPhase367 > gcc -Wall -Wmissing-prototypes -Wpointer-arith -Wdeclaration-after-statement -Werror=vla -Wendif-labels -Wmissing-format-attribute -Wimplicit-fallthrough=3 -Wcast-function-type -Wshadow=compatible-local -Wformat-security -fno-strict-aliasing -fwrapv -fexcess-precision=standard -Wno-format-truncation -Wno-stringop-truncation -g -O2 -std=c11 -Wextra -Wall -Werror -Wno-declaration-after-statement -Wno-vla -Wno-long-long -Wmissing-variable-declarations -fPIC -fvisibility=hidden -DEXTVERSION=\"0.19.5\" -I. -I./ -I/nix/store/dj25xabr71j1mmxf628lqsn61qd5qcyk-postgresql-17.11/include/server -I/nix/store/dj25xabr71j1mmxf628lqsn61qd5qcyk-postgresql-17.11/include/internal -D_GNU_SOURCE -I/nix/store/5nl2zr46dic7mxcw6cvbq85wa8c2gngh-libxml2-2.15.1-dev/include/libxml2 -I/nix/store/sl10j863s32x7dv5vw6wfx1nh22f3xh2-lz4-1.10.0-dev/include -I/nix/store/di94mxmhhk390zzzv2gvavfwkgww7q6h-zstd-1.5.7-dev/include -I/nix/store/h5hfqhzcqszmsacj26hh3fngwcal04zs-icu4c-75.1-dev/include -c -o src/core.o src/core.c368 > gcc -Wall -Wmissing-prototypes -Wpointer-arith -Wdeclaration-after-statement -Werror=vla -Wendif-labels -Wmissing-format-attribute -Wimplicit-fallthrough=3 -Wcast-function-type -Wshadow=compatible-local -Wformat-security -fno-strict-aliasing -fwrapv -fexcess-precision=standard -Wno-format-truncation -Wno-stringop-truncation -g -O2 -std=c11 -Wextra -Wall -Werror -Wno-declaration-after-statement -Wno-vla -Wno-long-long -Wmissing-variable-declarations -fPIC -fvisibility=hidden -DEXTVERSION=\"0.19.5\" -I. -I./ -I/nix/store/dj25xabr71j1mmxf628lqsn61qd5qcyk-postgresql-17.11/include/server -I/nix/store/dj25xabr71j1mmxf628lqsn61qd5qcyk-postgresql-17.11/include/internal -D_GNU_SOURCE -I/nix/store/5nl2zr46dic7mxcw6cvbq85wa8c2gngh-libxml2-2.15.1-dev/include/libxml2 -I/nix/store/sl10j863s32x7dv5vw6wfx1nh22f3xh2-lz4-1.10.0-dev/include -I/nix/store/di94mxmhhk390zzzv2gvavfwkgww7q6h-zstd-1.5.7-dev/include -I/nix/store/h5hfqhzcqszmsacj26hh3fngwcal04zs-icu4c-75.1-dev/include -c -o src/errors.o src/errors.c369 > gcc -Wall -Wmissing-prototypes -Wpointer-arith -Wdeclaration-after-statement -Werror=vla -Wendif-labels -Wmissing-format-attribute -Wimplicit-fallthrough=3 -Wcast-function-type -Wshadow=compatible-local -Wformat-security -fno-strict-aliasing -fwrapv -fexcess-precision=standard -Wno-format-truncation -Wno-stringop-truncation -g -O2 -std=c11 -Wextra -Wall -Werror -Wno-declaration-after-statement -Wno-vla -Wno-long-long -Wmissing-variable-declarations -fPIC -fvisibility=hidden -DEXTVERSION=\"0.19.5\" -I. -I./ -I/nix/store/dj25xabr71j1mmxf628lqsn61qd5qcyk-postgresql-17.11/include/server -I/nix/store/dj25xabr71j1mmxf628lqsn61qd5qcyk-postgresql-17.11/include/internal -D_GNU_SOURCE -I/nix/store/5nl2zr46dic7mxcw6cvbq85wa8c2gngh-libxml2-2.15.1-dev/include/libxml2 -I/nix/store/sl10j863s32x7dv5vw6wfx1nh22f3xh2-lz4-1.10.0-dev/include -I/nix/store/di94mxmhhk390zzzv2gvavfwkgww7q6h-zstd-1.5.7-dev/include -I/nix/store/h5hfqhzcqszmsacj26hh3fngwcal04zs-icu4c-75.1-dev/include -c -o src/event.o src/event.c370 > In file included from /nix/store/wflnb8fxmq4lqx3ca91hlpv95vrqkv51-curl-8.17.0-dev/include/curl/curl.h:3333,371 > from /nix/store/wflnb8fxmq4lqx3ca91hlpv95vrqkv51-curl-8.17.0-dev/include/curl/multi.h:51,372 > from src/event.h:4,373 > from src/event.c:6:374 > /nix/store/wflnb8fxmq4lqx3ca91hlpv95vrqkv51-curl-8.17.0-dev/include/curl/multi.h:429:23: error: expected identifier or '(' before '__extension__'375 > 429 | CURL_EXTERN CURLMcode curl_multi_setopt(CURLM *multi_handle,376 > | ^~~~~~~~~~~~~~~~~377 > /nix/store/wflnb8fxmq4lqx3ca91hlpv95vrqkv51-curl-8.17.0-dev/include/curl/multi.h:429:23: error: expected identifier or '(' before ')' token378 > 429 | CURL_EXTERN CURLMcode curl_multi_setopt(CURLM *multi_handle,379 > | ^~~~~~~~~~~~~~~~~380 > make: *** [<builtin>: src/event.o] Error 1381 For full logs, run:382 nix log /nix/store/h3jfznl8xhwm8wvvxg23yj74srzz3vii-pg_net-0.19.5.drv383error: Cannot build '/nix/store/hfwkzpr1kplwaywhvayqm6j4gsva8n5n-pg_net-0.20.0.drv'.384 Reason: builder failed with exit code 2.385 Output paths:386 /nix/store/scsfkgabhfzpzf64a6cgvkx2zglb6vji-pg_net-0.20.0387 Last 22 log lines:388 > Running phase: unpackPhase389 > unpacking source archive /nix/store/3783i7yhcfqnyv5ndli22gcr11ap151m-source390 > source root is source391 > Running phase: patchPhase392 > Running phase: updateAutotoolsGnuConfigScriptsPhase393 > Running phase: configurePhase394 > no configure script, doing nothing395 > Running phase: buildPhase396 > gcc -Wall -Wmissing-prototypes -Wpointer-arith -Wdeclaration-after-statement -Werror=vla -Wendif-labels -Wmissing-format-attribute -Wimplicit-fallthrough=3 -Wcast-function-type -Wformat-security -fno-strict-aliasing -fwrapv -fexcess-precision=standard -Wno-deprecated-non-prototype -Wno-format-truncation -Wno-stringop-truncation -g -O2 -std=gnu17 -std=c11 -Wextra -Wall -Werror -Wno-declaration-after-statement -Wno-vla -Wno-long-long -Wmissing-variable-declarations -fPIC -DEXTVERSION=\"0.20.0\" -I. -I./ -I/nix/store/804f042cyc4dca4vwl2fmh1rhfy0sij9-postgresql-15.19/include/server -I/nix/store/804f042cyc4dca4vwl2fmh1rhfy0sij9-postgresql-15.19/include/internal -D_GNU_SOURCE -I/nix/store/5nl2zr46dic7mxcw6cvbq85wa8c2gngh-libxml2-2.15.1-dev/include/libxml2 -I/nix/store/sl10j863s32x7dv5vw6wfx1nh22f3xh2-lz4-1.10.0-dev/include -I/nix/store/di94mxmhhk390zzzv2gvavfwkgww7q6h-zstd-1.5.7-dev/include -I/nix/store/h5hfqhzcqszmsacj26hh3fngwcal04zs-icu4c-75.1-dev/include -c -o src/core.o src/core.c397 > gcc -Wall -Wmissing-prototypes -Wpointer-arith -Wdeclaration-after-statement -Werror=vla -Wendif-labels -Wmissing-format-attribute -Wimplicit-fallthrough=3 -Wcast-function-type -Wformat-security -fno-strict-aliasing -fwrapv -fexcess-precision=standard -Wno-deprecated-non-prototype -Wno-format-truncation -Wno-stringop-truncation -g -O2 -std=gnu17 -std=c11 -Wextra -Wall -Werror -Wno-declaration-after-statement -Wno-vla -Wno-long-long -Wmissing-variable-declarations -fPIC -DEXTVERSION=\"0.20.0\" -I. -I./ -I/nix/store/804f042cyc4dca4vwl2fmh1rhfy0sij9-postgresql-15.19/include/server -I/nix/store/804f042cyc4dca4vwl2fmh1rhfy0sij9-postgresql-15.19/include/internal -D_GNU_SOURCE -I/nix/store/5nl2zr46dic7mxcw6cvbq85wa8c2gngh-libxml2-2.15.1-dev/include/libxml2 -I/nix/store/sl10j863s32x7dv5vw6wfx1nh22f3xh2-lz4-1.10.0-dev/include -I/nix/store/di94mxmhhk390zzzv2gvavfwkgww7q6h-zstd-1.5.7-dev/include -I/nix/store/h5hfqhzcqszmsacj26hh3fngwcal04zs-icu4c-75.1-dev/include -c -o src/errors.o src/errors.c398 > gcc -Wall -Wmissing-prototypes -Wpointer-arith -Wdeclaration-after-statement -Werror=vla -Wendif-labels -Wmissing-format-attribute -Wimplicit-fallthrough=3 -Wcast-function-type -Wformat-security -fno-strict-aliasing -fwrapv -fexcess-precision=standard -Wno-deprecated-non-prototype -Wno-format-truncation -Wno-stringop-truncation -g -O2 -std=gnu17 -std=c11 -Wextra -Wall -Werror -Wno-declaration-after-statement -Wno-vla -Wno-long-long -Wmissing-variable-declarations -fPIC -DEXTVERSION=\"0.20.0\" -I. -I./ -I/nix/store/804f042cyc4dca4vwl2fmh1rhfy0sij9-postgresql-15.19/include/server -I/nix/store/804f042cyc4dca4vwl2fmh1rhfy0sij9-postgresql-15.19/include/internal -D_GNU_SOURCE -I/nix/store/5nl2zr46dic7mxcw6cvbq85wa8c2gngh-libxml2-2.15.1-dev/include/libxml2 -I/nix/store/sl10j863s32x7dv5vw6wfx1nh22f3xh2-lz4-1.10.0-dev/include -I/nix/store/di94mxmhhk390zzzv2gvavfwkgww7q6h-zstd-1.5.7-dev/include -I/nix/store/h5hfqhzcqszmsacj26hh3fngwcal04zs-icu4c-75.1-dev/include -c -o src/event.o src/event.c399 > In file included from /nix/store/wflnb8fxmq4lqx3ca91hlpv95vrqkv51-curl-8.17.0-dev/include/curl/curl.h:3333,400 > from /nix/store/wflnb8fxmq4lqx3ca91hlpv95vrqkv51-curl-8.17.0-dev/include/curl/multi.h:51,401 > from src/event.h:4,402 > from src/event.c:6:403 > /nix/store/wflnb8fxmq4lqx3ca91hlpv95vrqkv51-curl-8.17.0-dev/include/curl/multi.h:429:23: error: expected identifier or '(' before '__extension__'404 > 429 | CURL_EXTERN CURLMcode curl_multi_setopt(CURLM *multi_handle,405 > | ^~~~~~~~~~~~~~~~~406 > /nix/store/wflnb8fxmq4lqx3ca91hlpv95vrqkv51-curl-8.17.0-dev/include/curl/multi.h:429:23: error: expected identifier or '(' before ')' token407 > 429 | CURL_EXTERN CURLMcode curl_multi_setopt(CURLM *multi_handle,408 > | ^~~~~~~~~~~~~~~~~409 > make: *** [<builtin>: src/event.o] Error 1410 For full logs, run:411 nix log /nix/store/hfwkzpr1kplwaywhvayqm6j4gsva8n5n-pg_net-0.20.0.drv412error: Cannot build '/nix/store/7b5ar71808xp6cc9vi64vcr3gxhaq9w2-pg_net-0.14.0.drv'.413 Reason: builder failed with exit code 2.414 Output paths:415 /nix/store/2vyqm50vp9dxrrm1lidjzvr6difmnnqc-pg_net-0.14.0416 Last 25 log lines:417 > src/errors.h:6:11: warning: call to 'Wcurl_easy_setopt_err_long' declared with attribute warning: curl_easy_setopt expects a long argument [-Wattribute-warning]418 > 6 | if (curl_easy_setopt(hdl, opt, prm) != CURLE_OK) \419 > | ^~~~~~~~~~~~~~~~420 > src/core.c:134:3: note: in expansion of macro 'EREPORT_CURL_SETOPT'421 > 134 | EREPORT_CURL_SETOPT(curl_ez_handle, CURLOPT_TIMEOUT_MS, cdata->timeout_milliseconds);422 > | ^~~~~~~~~~~~~~~~~~~423 > src/errors.h:6:11: warning: call to 'Wcurl_easy_setopt_err_long' declared with attribute warning: curl_easy_setopt expects a long argument [-Wattribute-warning]424 > 6 | if (curl_easy_setopt(hdl, opt, prm) != CURLE_OK) \425 > | ^~~~~~~~~~~~~~~~426 > src/core.c:136:3: note: in expansion of macro 'EREPORT_CURL_SETOPT'427 > 136 | EREPORT_CURL_SETOPT(curl_ez_handle, CURLOPT_FOLLOWLOCATION, true);428 > | ^~~~~~~~~~~~~~~~~~~429 > gcc -Wall -Wmissing-prototypes -Wpointer-arith -Wdeclaration-after-statement -Werror=vla -Wendif-labels -Wmissing-format-attribute -Wimplicit-fallthrough=3 -Wcast-function-type -Wformat-security -fno-strict-aliasing -fwrapv -fexcess-precision=standard -Wno-deprecated-non-prototype -Wno-format-truncation -Wno-stringop-truncation -g -O2 -std=gnu17 -std=c11 -Werror -Wno-declaration-after-statement -fPIC -DEXTVERSION=\"0.14.0\" -I. -I./ -I/nix/store/804f042cyc4dca4vwl2fmh1rhfy0sij9-postgresql-15.19/include/server -I/nix/store/804f042cyc4dca4vwl2fmh1rhfy0sij9-postgresql-15.19/include/internal -D_GNU_SOURCE -I/nix/store/5nl2zr46dic7mxcw6cvbq85wa8c2gngh-libxml2-2.15.1-dev/include/libxml2 -I/nix/store/sl10j863s32x7dv5vw6wfx1nh22f3xh2-lz4-1.10.0-dev/include -I/nix/store/di94mxmhhk390zzzv2gvavfwkgww7q6h-zstd-1.5.7-dev/include -I/nix/store/h5hfqhzcqszmsacj26hh3fngwcal04zs-icu4c-75.1-dev/include -c -o src/errors.o src/errors.c430 > gcc -Wall -Wmissing-prototypes -Wpointer-arith -Wdeclaration-after-statement -Werror=vla -Wendif-labels -Wmissing-format-attribute -Wimplicit-fallthrough=3 -Wcast-function-type -Wformat-security -fno-strict-aliasing -fwrapv -fexcess-precision=standard -Wno-deprecated-non-prototype -Wno-format-truncation -Wno-stringop-truncation -g -O2 -std=gnu17 -std=c11 -Werror -Wno-declaration-after-statement -fPIC -DEXTVERSION=\"0.14.0\" -I. -I./ -I/nix/store/804f042cyc4dca4vwl2fmh1rhfy0sij9-postgresql-15.19/include/server -I/nix/store/804f042cyc4dca4vwl2fmh1rhfy0sij9-postgresql-15.19/include/internal -D_GNU_SOURCE -I/nix/store/5nl2zr46dic7mxcw6cvbq85wa8c2gngh-libxml2-2.15.1-dev/include/libxml2 -I/nix/store/sl10j863s32x7dv5vw6wfx1nh22f3xh2-lz4-1.10.0-dev/include -I/nix/store/di94mxmhhk390zzzv2gvavfwkgww7q6h-zstd-1.5.7-dev/include -I/nix/store/h5hfqhzcqszmsacj26hh3fngwcal04zs-icu4c-75.1-dev/include -c -o src/event.o src/event.c431 > In file included from /nix/store/wflnb8fxmq4lqx3ca91hlpv95vrqkv51-curl-8.17.0-dev/include/curl/curl.h:3333,432 > from /nix/store/wflnb8fxmq4lqx3ca91hlpv95vrqkv51-curl-8.17.0-dev/include/curl/multi.h:51,433 > from src/event.h:4,434 > from src/event.c:6:435 > /nix/store/wflnb8fxmq4lqx3ca91hlpv95vrqkv51-curl-8.17.0-dev/include/curl/multi.h:429:23: error: expected identifier or '(' before '__extension__'436 > 429 | CURL_EXTERN CURLMcode curl_multi_setopt(CURLM *multi_handle,437 > | ^~~~~~~~~~~~~~~~~438 > /nix/store/wflnb8fxmq4lqx3ca91hlpv95vrqkv51-curl-8.17.0-dev/include/curl/multi.h:429:23: error: expected identifier or '(' before ')' token439 > 429 | CURL_EXTERN CURLMcode curl_multi_setopt(CURLM *multi_handle,440 > | ^~~~~~~~~~~~~~~~~441 > make: *** [<builtin>: src/event.o] Error 1442 For full logs, run:443 nix log /nix/store/7b5ar71808xp6cc9vi64vcr3gxhaq9w2-pg_net-0.14.0.drv444error: Cannot build '/nix/store/dxjxg15c0m6vdgy5yswqbm50g4fww2p1-pg_net-0.14.0.drv'.445 Reason: builder failed with exit code 2.446 Output paths:447 /nix/store/xqh65xhxx9wcmpgwvzh7kkpf9zs0y72x-pg_net-0.14.0448 Last 25 log lines:449 > src/errors.h:6:11: warning: call to 'Wcurl_easy_setopt_err_long' declared with attribute warning: curl_easy_setopt expects a long argument [-Wattribute-warning]450 > 6 | if (curl_easy_setopt(hdl, opt, prm) != CURLE_OK) \451 > | ^~~~~~~~~~~~~~~~452 > src/core.c:134:3: note: in expansion of macro 'EREPORT_CURL_SETOPT'453 > 134 | EREPORT_CURL_SETOPT(curl_ez_handle, CURLOPT_TIMEOUT_MS, cdata->timeout_milliseconds);454 > | ^~~~~~~~~~~~~~~~~~~455 > src/errors.h:6:11: warning: call to 'Wcurl_easy_setopt_err_long' declared with attribute warning: curl_easy_setopt expects a long argument [-Wattribute-warning]456 > 6 | if (curl_easy_setopt(hdl, opt, prm) != CURLE_OK) \457 > | ^~~~~~~~~~~~~~~~458 > src/core.c:136:3: note: in expansion of macro 'EREPORT_CURL_SETOPT'459 > 136 | EREPORT_CURL_SETOPT(curl_ez_handle, CURLOPT_FOLLOWLOCATION, true);460 > | ^~~~~~~~~~~~~~~~~~~461 > gcc -Wall -Wmissing-prototypes -Wpointer-arith -Wdeclaration-after-statement -Werror=vla -Wendif-labels -Wmissing-format-attribute -Wimplicit-fallthrough=3 -Wcast-function-type -Wshadow=compatible-local -Wformat-security -fno-strict-aliasing -fwrapv -fexcess-precision=standard -Wno-format-truncation -Wno-stringop-truncation -g -O2 -std=c11 -Werror -Wno-declaration-after-statement -fPIC -fvisibility=hidden -DEXTVERSION=\"0.14.0\" -I. -I./ -I/nix/store/qmc7y6nc0qxg50ywm46x4iaqq5knz702-postgresql-17_22/include/server -I/nix/store/qmc7y6nc0qxg50ywm46x4iaqq5knz702-postgresql-17_22/include/internal -D_GNU_SOURCE -I/nix/store/5nl2zr46dic7mxcw6cvbq85wa8c2gngh-libxml2-2.15.1-dev/include/libxml2 -I/nix/store/sl10j863s32x7dv5vw6wfx1nh22f3xh2-lz4-1.10.0-dev/include -I/nix/store/di94mxmhhk390zzzv2gvavfwkgww7q6h-zstd-1.5.7-dev/include -I/nix/store/h5hfqhzcqszmsacj26hh3fngwcal04zs-icu4c-75.1-dev/include -c -o src/errors.o src/errors.c462 > gcc -Wall -Wmissing-prototypes -Wpointer-arith -Wdeclaration-after-statement -Werror=vla -Wendif-labels -Wmissing-format-attribute -Wimplicit-fallthrough=3 -Wcast-function-type -Wshadow=compatible-local -Wformat-security -fno-strict-aliasing -fwrapv -fexcess-precision=standard -Wno-format-truncation -Wno-stringop-truncation -g -O2 -std=c11 -Werror -Wno-declaration-after-statement -fPIC -fvisibility=hidden -DEXTVERSION=\"0.14.0\" -I. -I./ -I/nix/store/qmc7y6nc0qxg50ywm46x4iaqq5knz702-postgresql-17_22/include/server -I/nix/store/qmc7y6nc0qxg50ywm46x4iaqq5knz702-postgresql-17_22/include/internal -D_GNU_SOURCE -I/nix/store/5nl2zr46dic7mxcw6cvbq85wa8c2gngh-libxml2-2.15.1-dev/include/libxml2 -I/nix/store/sl10j863s32x7dv5vw6wfx1nh22f3xh2-lz4-1.10.0-dev/include -I/nix/store/di94mxmhhk390zzzv2gvavfwkgww7q6h-zstd-1.5.7-dev/include -I/nix/store/h5hfqhzcqszmsacj26hh3fngwcal04zs-icu4c-75.1-dev/include -c -o src/event.o src/event.c463 > In file included from /nix/store/wflnb8fxmq4lqx3ca91hlpv95vrqkv51-curl-8.17.0-dev/include/curl/curl.h:3333,464 > from /nix/store/wflnb8fxmq4lqx3ca91hlpv95vrqkv51-curl-8.17.0-dev/include/curl/multi.h:51,465 > from src/event.h:4,466 > from src/event.c:6:467 > /nix/store/wflnb8fxmq4lqx3ca91hlpv95vrqkv51-curl-8.17.0-dev/include/curl/multi.h:429:23: error: expected identifier or '(' before '__extension__'468 > 429 | CURL_EXTERN CURLMcode curl_multi_setopt(CURLM *multi_handle,469 > | ^~~~~~~~~~~~~~~~~470 > /nix/store/wflnb8fxmq4lqx3ca91hlpv95vrqkv51-curl-8.17.0-dev/include/curl/multi.h:429:23: error: expected identifier or '(' before ')' token471 > 429 | CURL_EXTERN CURLMcode curl_multi_setopt(CURLM *multi_handle,472 > | ^~~~~~~~~~~~~~~~~473 > make: *** [<builtin>: src/event.o] Error 1474 For full logs, run:475 nix log /nix/store/dxjxg15c0m6vdgy5yswqbm50g4fww2p1-pg_net-0.14.0.drv476error: Cannot build '/nix/store/ky294hja2giinx8655lj1d83j4jq5gjj-pg_net-0.14.0.drv'.477 Reason: builder failed with exit code 2.478 Output paths:479 /nix/store/da6kcjzl896sjpnd8rrkfzykfm8chlaz-pg_net-0.14.0480 Last 25 log lines:481 > src/errors.h:6:11: warning: call to 'Wcurl_easy_setopt_err_long' declared with attribute warning: curl_easy_setopt expects a long argument [-Wattribute-warning]482 > 6 | if (curl_easy_setopt(hdl, opt, prm) != CURLE_OK) \483 > | ^~~~~~~~~~~~~~~~484 > src/core.c:134:3: note: in expansion of macro 'EREPORT_CURL_SETOPT'485 > 134 | EREPORT_CURL_SETOPT(curl_ez_handle, CURLOPT_TIMEOUT_MS, cdata->timeout_milliseconds);486 > | ^~~~~~~~~~~~~~~~~~~487 > src/errors.h:6:11: warning: call to 'Wcurl_easy_setopt_err_long' declared with attribute warning: curl_easy_setopt expects a long argument [-Wattribute-warning]488 > 6 | if (curl_easy_setopt(hdl, opt, prm) != CURLE_OK) \489 > | ^~~~~~~~~~~~~~~~490 > src/core.c:136:3: note: in expansion of macro 'EREPORT_CURL_SETOPT'491 > 136 | EREPORT_CURL_SETOPT(curl_ez_handle, CURLOPT_FOLLOWLOCATION, true);492 > | ^~~~~~~~~~~~~~~~~~~493 > gcc -Wall -Wmissing-prototypes -Wpointer-arith -Wdeclaration-after-statement -Werror=vla -Wendif-labels -Wmissing-format-attribute -Wimplicit-fallthrough=3 -Wcast-function-type -Wshadow=compatible-local -Wformat-security -fno-strict-aliasing -fwrapv -fexcess-precision=standard -Wno-format-truncation -Wno-stringop-truncation -g -O2 -std=c11 -Werror -Wno-declaration-after-statement -fPIC -fvisibility=hidden -DEXTVERSION=\"0.14.0\" -I. -I./ -I/nix/store/dj25xabr71j1mmxf628lqsn61qd5qcyk-postgresql-17.11/include/server -I/nix/store/dj25xabr71j1mmxf628lqsn61qd5qcyk-postgresql-17.11/include/internal -D_GNU_SOURCE -I/nix/store/5nl2zr46dic7mxcw6cvbq85wa8c2gngh-libxml2-2.15.1-dev/include/libxml2 -I/nix/store/sl10j863s32x7dv5vw6wfx1nh22f3xh2-lz4-1.10.0-dev/include -I/nix/store/di94mxmhhk390zzzv2gvavfwkgww7q6h-zstd-1.5.7-dev/include -I/nix/store/h5hfqhzcqszmsacj26hh3fngwcal04zs-icu4c-75.1-dev/include -c -o src/errors.o src/errors.c494 > gcc -Wall -Wmissing-prototypes -Wpointer-arith -Wdeclaration-after-statement -Werror=vla -Wendif-labels -Wmissing-format-attribute -Wimplicit-fallthrough=3 -Wcast-function-type -Wshadow=compatible-local -Wformat-security -fno-strict-aliasing -fwrapv -fexcess-precision=standard -Wno-format-truncation -Wno-stringop-truncation -g -O2 -std=c11 -Werror -Wno-declaration-after-statement -fPIC -fvisibility=hidden -DEXTVERSION=\"0.14.0\" -I. -I./ -I/nix/store/dj25xabr71j1mmxf628lqsn61qd5qcyk-postgresql-17.11/include/server -I/nix/store/dj25xabr71j1mmxf628lqsn61qd5qcyk-postgresql-17.11/include/internal -D_GNU_SOURCE -I/nix/store/5nl2zr46dic7mxcw6cvbq85wa8c2gngh-libxml2-2.15.1-dev/include/libxml2 -I/nix/store/sl10j863s32x7dv5vw6wfx1nh22f3xh2-lz4-1.10.0-dev/include -I/nix/store/di94mxmhhk390zzzv2gvavfwkgww7q6h-zstd-1.5.7-dev/include -I/nix/store/h5hfqhzcqszmsacj26hh3fngwcal04zs-icu4c-75.1-dev/include -c -o src/event.o src/event.c495 > In file included from /nix/store/wflnb8fxmq4lqx3ca91hlpv95vrqkv51-curl-8.17.0-dev/include/curl/curl.h:3333,496 > from /nix/store/wflnb8fxmq4lqx3ca91hlpv95vrqkv51-curl-8.17.0-dev/include/curl/multi.h:51,497 > from src/event.h:4,498 > from src/event.c:6:499 > /nix/store/wflnb8fxmq4lqx3ca91hlpv95vrqkv51-curl-8.17.0-dev/include/curl/multi.h:429:23: error: expected identifier or '(' before '__extension__'500 > 429 | CURL_EXTERN CURLMcode curl_multi_setopt(CURLM *multi_handle,501 > | ^~~~~~~~~~~~~~~~~502 > /nix/store/wflnb8fxmq4lqx3ca91hlpv95vrqkv51-curl-8.17.0-dev/include/curl/multi.h:429:23: error: expected identifier or '(' before ')' token503 > 429 | CURL_EXTERN CURLMcode curl_multi_setopt(CURLM *multi_handle,504 > | ^~~~~~~~~~~~~~~~~505 > make: *** [<builtin>: src/event.o] Error 1506 For full logs, run:507 nix log /nix/store/ky294hja2giinx8655lj1d83j4jq5gjj-pg_net-0.14.0.drv508error: Cannot build '/nix/store/cqdc5q7n6g9pkxy0cjcvkq185rps4bfd-pg_net.drv'.509 Reason: 4 dependencies failed.510 Output paths:511 /nix/store/4sc9iw7bqgw1y6834l2h4w200hvc8b79-pg_net512error: Cannot build '/nix/store/d5s4s970iizz6a8w5ndnpzyw63w1m1qv-postgresql-and-plugins-17.11.drv'.513 Reason: 1 dependency failed.514 Output paths:515 /nix/store/dlsqc392rqmvj64617g73zcbvclgch0b-postgresql-and-plugins-17.11516error: Cannot build '/nix/store/7hla3p20yajypj5w3hnrx38bc3kq14vq-postgresql-and-plugins-17.11.drv'.517 Reason: 1 dependency failed.518 Output paths:519 /nix/store/j9fc5s30v77k7ycb6icimvdhkb7ss17i-postgresql-and-plugins-17.11520error: Cannot build '/nix/store/bv2b3hyfiwg59frhybs6cmf9l26byfrs-pg_net-0.13.0.drv'.521 Reason: builder failed with exit code 2.522 Output paths:523 /nix/store/78qw5358gp449syn03ah921j442fw14j-pg_net-0.13.0524 Last 25 log lines:525 > | ^~~~~~~~~~~~~~526 > src/util.h:6:11: warning: call to 'Wcurl_easy_setopt_err_long' declared with attribute warning: curl_easy_setopt expects a long argument [-Wattribute-warning]527 > 6 | if (curl_easy_setopt(hdl, opt, prm) != CURLE_OK) \528 > | ^~~~~~~~~~~~~~~~529 > src/core.c:108:3: note: in expansion of macro 'CURL_EZ_SETOPT'530 > 108 | CURL_EZ_SETOPT(curl_ez_handle, CURLOPT_TIMEOUT_MS, timeout_milliseconds);531 > | ^~~~~~~~~~~~~~532 > src/util.h:6:11: warning: call to 'Wcurl_easy_setopt_err_long' declared with attribute warning: curl_easy_setopt expects a long argument [-Wattribute-warning]533 > 6 | if (curl_easy_setopt(hdl, opt, prm) != CURLE_OK) \534 > | ^~~~~~~~~~~~~~~~535 > src/core.c:110:3: note: in expansion of macro 'CURL_EZ_SETOPT'536 > 110 | CURL_EZ_SETOPT(curl_ez_handle, CURLOPT_FOLLOWLOCATION, true);537 > | ^~~~~~~~~~~~~~538 > gcc -Wall -Wmissing-prototypes -Wpointer-arith -Wdeclaration-after-statement -Werror=vla -Wendif-labels -Wmissing-format-attribute -Wimplicit-fallthrough=3 -Wcast-function-type -Wshadow=compatible-local -Wformat-security -fno-strict-aliasing -fwrapv -fexcess-precision=standard -Wno-format-truncation -Wno-stringop-truncation -g -O2 -std=c11 -Werror -Wno-declaration-after-statement -fPIC -fvisibility=hidden -DEXTVERSION=\"0.13.0\" -I. -I./ -I/nix/store/qmc7y6nc0qxg50ywm46x4iaqq5knz702-postgresql-17_22/include/server -I/nix/store/qmc7y6nc0qxg50ywm46x4iaqq5knz702-postgresql-17_22/include/internal -D_GNU_SOURCE -I/nix/store/5nl2zr46dic7mxcw6cvbq85wa8c2gngh-libxml2-2.15.1-dev/include/libxml2 -I/nix/store/sl10j863s32x7dv5vw6wfx1nh22f3xh2-lz4-1.10.0-dev/include -I/nix/store/di94mxmhhk390zzzv2gvavfwkgww7q6h-zstd-1.5.7-dev/include -I/nix/store/h5hfqhzcqszmsacj26hh3fngwcal04zs-icu4c-75.1-dev/include -c -o src/event.o src/event.c539 > In file included from /nix/store/wflnb8fxmq4lqx3ca91hlpv95vrqkv51-curl-8.17.0-dev/include/curl/curl.h:3333,540 > from /nix/store/wflnb8fxmq4lqx3ca91hlpv95vrqkv51-curl-8.17.0-dev/include/curl/multi.h:51,541 > from src/event.h:4,542 > from src/event.c:6:543 > /nix/store/wflnb8fxmq4lqx3ca91hlpv95vrqkv51-curl-8.17.0-dev/include/curl/multi.h:429:23: error: expected identifier or '(' before '__extension__'544 > 429 | CURL_EXTERN CURLMcode curl_multi_setopt(CURLM *multi_handle,545 > | ^~~~~~~~~~~~~~~~~546 > /nix/store/wflnb8fxmq4lqx3ca91hlpv95vrqkv51-curl-8.17.0-dev/include/curl/multi.h:429:23: error: expected identifier or '(' before ')' token547 > 429 | CURL_EXTERN CURLMcode curl_multi_setopt(CURLM *multi_handle,548 > | ^~~~~~~~~~~~~~~~~549 > make: *** [<builtin>: src/event.o] Error 1550 For full logs, run:551 nix log /nix/store/bv2b3hyfiwg59frhybs6cmf9l26byfrs-pg_net-0.13.0.drv552error: Cannot build '/nix/store/v7i610b6q10zpsd2536yvba9pd2xqrr6-pg_net-0.19.5.drv'.553 Reason: builder failed with exit code 2.554 Output paths:555 /nix/store/pzmf3gl6j9iwmkqjfvwvsb11fh4i1rz2-pg_net-0.19.5556 Last 22 log lines:557 > Running phase: unpackPhase558 > unpacking source archive /nix/store/5zgdqy3bz93jyn79pizxc1hks0cdcadw-source559 > source root is source560 > Running phase: patchPhase561 > Running phase: updateAutotoolsGnuConfigScriptsPhase562 > Running phase: configurePhase563 > no configure script, doing nothing564 > Running phase: buildPhase565 > gcc -Wall -Wmissing-prototypes -Wpointer-arith -Wdeclaration-after-statement -Werror=vla -Wendif-labels -Wmissing-format-attribute -Wimplicit-fallthrough=3 -Wcast-function-type -Wshadow=compatible-local -Wformat-security -fno-strict-aliasing -fwrapv -fexcess-precision=standard -Wno-format-truncation -Wno-stringop-truncation -g -O2 -std=c11 -Wextra -Wall -Werror -Wno-declaration-after-statement -Wno-vla -Wno-long-long -Wmissing-variable-declarations -fPIC -fvisibility=hidden -DEXTVERSION=\"0.19.5\" -I. -I./ -I/nix/store/qmc7y6nc0qxg50ywm46x4iaqq5knz702-postgresql-17_22/include/server -I/nix/store/qmc7y6nc0qxg50ywm46x4iaqq5knz702-postgresql-17_22/include/internal -D_GNU_SOURCE -I/nix/store/5nl2zr46dic7mxcw6cvbq85wa8c2gngh-libxml2-2.15.1-dev/include/libxml2 -I/nix/store/sl10j863s32x7dv5vw6wfx1nh22f3xh2-lz4-1.10.0-dev/include -I/nix/store/di94mxmhhk390zzzv2gvavfwkgww7q6h-zstd-1.5.7-dev/include -I/nix/store/h5hfqhzcqszmsacj26hh3fngwcal04zs-icu4c-75.1-dev/include -c -o src/core.o src/core.c566 > gcc -Wall -Wmissing-prototypes -Wpointer-arith -Wdeclaration-after-statement -Werror=vla -Wendif-labels -Wmissing-format-attribute -Wimplicit-fallthrough=3 -Wcast-function-type -Wshadow=compatible-local -Wformat-security -fno-strict-aliasing -fwrapv -fexcess-precision=standard -Wno-format-truncation -Wno-stringop-truncation -g -O2 -std=c11 -Wextra -Wall -Werror -Wno-declaration-after-statement -Wno-vla -Wno-long-long -Wmissing-variable-declarations -fPIC -fvisibility=hidden -DEXTVERSION=\"0.19.5\" -I. -I./ -I/nix/store/qmc7y6nc0qxg50ywm46x4iaqq5knz702-postgresql-17_22/include/server -I/nix/store/qmc7y6nc0qxg50ywm46x4iaqq5knz702-postgresql-17_22/include/internal -D_GNU_SOURCE -I/nix/store/5nl2zr46dic7mxcw6cvbq85wa8c2gngh-libxml2-2.15.1-dev/include/libxml2 -I/nix/store/sl10j863s32x7dv5vw6wfx1nh22f3xh2-lz4-1.10.0-dev/include -I/nix/store/di94mxmhhk390zzzv2gvavfwkgww7q6h-zstd-1.5.7-dev/include -I/nix/store/h5hfqhzcqszmsacj26hh3fngwcal04zs-icu4c-75.1-dev/include -c -o src/errors.o src/errors.c567 > gcc -Wall -Wmissing-prototypes -Wpointer-arith -Wdeclaration-after-statement -Werror=vla -Wendif-labels -Wmissing-format-attribute -Wimplicit-fallthrough=3 -Wcast-function-type -Wshadow=compatible-local -Wformat-security -fno-strict-aliasing -fwrapv -fexcess-precision=standard -Wno-format-truncation -Wno-stringop-truncation -g -O2 -std=c11 -Wextra -Wall -Werror -Wno-declaration-after-statement -Wno-vla -Wno-long-long -Wmissing-variable-declarations -fPIC -fvisibility=hidden -DEXTVERSION=\"0.19.5\" -I. -I./ -I/nix/store/qmc7y6nc0qxg50ywm46x4iaqq5knz702-postgresql-17_22/include/server -I/nix/store/qmc7y6nc0qxg50ywm46x4iaqq5knz702-postgresql-17_22/include/internal -D_GNU_SOURCE -I/nix/store/5nl2zr46dic7mxcw6cvbq85wa8c2gngh-libxml2-2.15.1-dev/include/libxml2 -I/nix/store/sl10j863s32x7dv5vw6wfx1nh22f3xh2-lz4-1.10.0-dev/include -I/nix/store/di94mxmhhk390zzzv2gvavfwkgww7q6h-zstd-1.5.7-dev/include -I/nix/store/h5hfqhzcqszmsacj26hh3fngwcal04zs-icu4c-75.1-dev/include -c -o src/event.o src/event.c568 > In file included from /nix/store/wflnb8fxmq4lqx3ca91hlpv95vrqkv51-curl-8.17.0-dev/include/curl/curl.h:3333,569 > from /nix/store/wflnb8fxmq4lqx3ca91hlpv95vrqkv51-curl-8.17.0-dev/include/curl/multi.h:51,570 > from src/event.h:4,571 > from src/event.c:6:572 > /nix/store/wflnb8fxmq4lqx3ca91hlpv95vrqkv51-curl-8.17.0-dev/include/curl/multi.h:429:23: error: expected identifier or '(' before '__extension__'573 > 429 | CURL_EXTERN CURLMcode curl_multi_setopt(CURLM *multi_handle,574 > | ^~~~~~~~~~~~~~~~~575 > /nix/store/wflnb8fxmq4lqx3ca91hlpv95vrqkv51-curl-8.17.0-dev/include/curl/multi.h:429:23: error: expected identifier or '(' before ')' token576 > 429 | CURL_EXTERN CURLMcode curl_multi_setopt(CURLM *multi_handle,577 > | ^~~~~~~~~~~~~~~~~578 > make: *** [<builtin>: src/event.o] Error 1579 For full logs, run:580 nix log /nix/store/v7i610b6q10zpsd2536yvba9pd2xqrr6-pg_net-0.19.5.drv581error: Cannot build '/nix/store/zd0hg58y5nwnnwfzy7sd19l7dzx4zvv5-pg_net.drv'.582 Reason: 4 dependencies failed.583 Output paths:584 /nix/store/5j8is0c6fp325l5akxcq6digg430r2fy-pg_net585error: Cannot build '/nix/store/m7073j3kxn6vxs53jdm448q51cxiimys-postgresql-and-plugins-17_22.drv'.586 Reason: 1 dependency failed.587 Output paths:588 /nix/store/z04smpdjsr0zxxl7phxyvwwh4ycfq6c5-postgresql-and-plugins-17_22589error: Cannot build '/nix/store/q8qv7gf9izi4my9mjapggg0fx2dhzlwc-postgresql-and-plugins-17_22.drv'.590 Reason: 1 dependency failed.591 Output paths:592 /nix/store/y845ymwkrl6d1g0swpxgxwk72nyclj1s-postgresql-and-plugins-17_22593error: Cannot build '/nix/store/y85ggf9qcv7hsaxx3fyr5a14nf67953g-postgresql-orioledb-init.drv'.594 Reason: 1 dependency failed.595 Output paths:596 /nix/store/ljganhrp9i6y9sfsqv77nzm8ylql0ial-postgresql-orioledb-init597error: Cannot build '/nix/store/7p4sg9x4d75pncaxpl0sa51ja5k2bik8-supabase-orioledb-db-init.drv'.598 Reason: 1 dependency failed.599 Output paths:600 /nix/store/584vyxv0pxm2ks5a423n8i4n4jjfbmza-supabase-orioledb-db-init601error: Cannot build '/nix/store/6dmfl5hj72ck728kvz45gg2241dk81ci-unit-postgresql.service.drv'.602 Reason: 2 dependencies failed.603 Output paths:604 /nix/store/4d86ahvbvwk5brsw0hnkci0nq2i5hzbs-unit-postgresql.service605error: Cannot build '/nix/store/dadjlp1c0v94bsq44xmi8yl99z9dwd3n-unit-supabase-db-init.service.drv'.606 Reason: 1 dependency failed.607 Output paths:608 /nix/store/224g1r7756ryqw509vkfqxila6hi91bb-unit-supabase-db-init.service609error: Cannot build '/nix/store/5v6a4ssacxc4snck5dzagkmqhcsh2swz-pg_net-0.19.5.drv'.610 Reason: builder failed with exit code 2.611 Output paths:612 /nix/store/xcsw4jyz7w5071r5drjiify20gjvij99-pg_net-0.19.5613 Last 22 log lines:614 > Running phase: unpackPhase615 > unpacking source archive /nix/store/5zgdqy3bz93jyn79pizxc1hks0cdcadw-source616 > source root is source617 > Running phase: patchPhase618 > Running phase: updateAutotoolsGnuConfigScriptsPhase619 > Running phase: configurePhase620 > no configure script, doing nothing621 > Running phase: buildPhase622 > gcc -Wall -Wmissing-prototypes -Wpointer-arith -Wdeclaration-after-statement -Werror=vla -Wendif-labels -Wmissing-format-attribute -Wimplicit-fallthrough=3 -Wcast-function-type -Wformat-security -fno-strict-aliasing -fwrapv -fexcess-precision=standard -Wno-deprecated-non-prototype -Wno-format-truncation -Wno-stringop-truncation -g -O2 -std=gnu17 -std=c11 -Wextra -Wall -Werror -Wno-declaration-after-statement -Wno-vla -Wno-long-long -Wmissing-variable-declarations -fPIC -DEXTVERSION=\"0.19.5\" -I. -I./ -I/nix/store/804f042cyc4dca4vwl2fmh1rhfy0sij9-postgresql-15.19/include/server -I/nix/store/804f042cyc4dca4vwl2fmh1rhfy0sij9-postgresql-15.19/include/internal -D_GNU_SOURCE -I/nix/store/5nl2zr46dic7mxcw6cvbq85wa8c2gngh-libxml2-2.15.1-dev/include/libxml2 -I/nix/store/sl10j863s32x7dv5vw6wfx1nh22f3xh2-lz4-1.10.0-dev/include -I/nix/store/di94mxmhhk390zzzv2gvavfwkgww7q6h-zstd-1.5.7-dev/include -I/nix/store/h5hfqhzcqszmsacj26hh3fngwcal04zs-icu4c-75.1-dev/include -c -o src/core.o src/core.c623 > gcc -Wall -Wmissing-prototypes -Wpointer-arith -Wdeclaration-after-statement -Werror=vla -Wendif-labels -Wmissing-format-attribute -Wimplicit-fallthrough=3 -Wcast-function-type -Wformat-security -fno-strict-aliasing -fwrapv -fexcess-precision=standard -Wno-deprecated-non-prototype -Wno-format-truncation -Wno-stringop-truncation -g -O2 -std=gnu17 -std=c11 -Wextra -Wall -Werror -Wno-declaration-after-statement -Wno-vla -Wno-long-long -Wmissing-variable-declarations -fPIC -DEXTVERSION=\"0.19.5\" -I. -I./ -I/nix/store/804f042cyc4dca4vwl2fmh1rhfy0sij9-postgresql-15.19/include/server -I/nix/store/804f042cyc4dca4vwl2fmh1rhfy0sij9-postgresql-15.19/include/internal -D_GNU_SOURCE -I/nix/store/5nl2zr46dic7mxcw6cvbq85wa8c2gngh-libxml2-2.15.1-dev/include/libxml2 -I/nix/store/sl10j863s32x7dv5vw6wfx1nh22f3xh2-lz4-1.10.0-dev/include -I/nix/store/di94mxmhhk390zzzv2gvavfwkgww7q6h-zstd-1.5.7-dev/include -I/nix/store/h5hfqhzcqszmsacj26hh3fngwcal04zs-icu4c-75.1-dev/include -c -o src/errors.o src/errors.c624 > gcc -Wall -Wmissing-prototypes -Wpointer-arith -Wdeclaration-after-statement -Werror=vla -Wendif-labels -Wmissing-format-attribute -Wimplicit-fallthrough=3 -Wcast-function-type -Wformat-security -fno-strict-aliasing -fwrapv -fexcess-precision=standard -Wno-deprecated-non-prototype -Wno-format-truncation -Wno-stringop-truncation -g -O2 -std=gnu17 -std=c11 -Wextra -Wall -Werror -Wno-declaration-after-statement -Wno-vla -Wno-long-long -Wmissing-variable-declarations -fPIC -DEXTVERSION=\"0.19.5\" -I. -I./ -I/nix/store/804f042cyc4dca4vwl2fmh1rhfy0sij9-postgresql-15.19/include/server -I/nix/store/804f042cyc4dca4vwl2fmh1rhfy0sij9-postgresql-15.19/include/internal -D_GNU_SOURCE -I/nix/store/5nl2zr46dic7mxcw6cvbq85wa8c2gngh-libxml2-2.15.1-dev/include/libxml2 -I/nix/store/sl10j863s32x7dv5vw6wfx1nh22f3xh2-lz4-1.10.0-dev/include -I/nix/store/di94mxmhhk390zzzv2gvavfwkgww7q6h-zstd-1.5.7-dev/include -I/nix/store/h5hfqhzcqszmsacj26hh3fngwcal04zs-icu4c-75.1-dev/include -c -o src/event.o src/event.c625 > In file included from /nix/store/wflnb8fxmq4lqx3ca91hlpv95vrqkv51-curl-8.17.0-dev/include/curl/curl.h:3333,626 > from /nix/store/wflnb8fxmq4lqx3ca91hlpv95vrqkv51-curl-8.17.0-dev/include/curl/multi.h:51,627 > from src/event.h:4,628 > from src/event.c:6:629 > /nix/store/wflnb8fxmq4lqx3ca91hlpv95vrqkv51-curl-8.17.0-dev/include/curl/multi.h:429:23: error: expected identifier or '(' before '__extension__'630 > 429 | CURL_EXTERN CURLMcode curl_multi_setopt(CURLM *multi_handle,631 > | ^~~~~~~~~~~~~~~~~632 > /nix/store/wflnb8fxmq4lqx3ca91hlpv95vrqkv51-curl-8.17.0-dev/include/curl/multi.h:429:23: error: expected identifier or '(' before ')' token633 > 429 | CURL_EXTERN CURLMcode curl_multi_setopt(CURLM *multi_handle,634 > | ^~~~~~~~~~~~~~~~~635 > make: *** [<builtin>: src/event.o] Error 1636 For full logs, run:637 nix log /nix/store/5v6a4ssacxc4snck5dzagkmqhcsh2swz-pg_net-0.19.5.drv638error: Cannot build '/nix/store/ggfg6al5fkdp0r1jsc3iabgz0p7g6l1m-pg_net-0.7.drv'.639 Reason: builder failed with exit code 2.640 Output paths:641 /nix/store/pkfapf0li10b8b6nrhwm8880g4d2i8y5-pg_net-0.7642 Last 25 log lines:643 > | ^~~~~~~~~~~~~~644 > src/util.h:6:11: warning: call to 'Wcurl_easy_setopt_err_long' declared with attribute warning: curl_easy_setopt expects a long argument [-Wattribute-warning]645 > 6 | if (curl_easy_setopt(hdl, opt, prm) != CURLE_OK) \646 > | ^~~~~~~~~~~~~~~~647 > src/core.c:108:3: note: in expansion of macro 'CURL_EZ_SETOPT'648 > 108 | CURL_EZ_SETOPT(curl_ez_handle, CURLOPT_TIMEOUT_MS, timeout_milliseconds);649 > | ^~~~~~~~~~~~~~650 > src/util.h:6:11: warning: call to 'Wcurl_easy_setopt_err_long' declared with attribute warning: curl_easy_setopt expects a long argument [-Wattribute-warning]651 > 6 | if (curl_easy_setopt(hdl, opt, prm) != CURLE_OK) \652 > | ^~~~~~~~~~~~~~~~653 > src/core.c:110:3: note: in expansion of macro 'CURL_EZ_SETOPT'654 > 110 | CURL_EZ_SETOPT(curl_ez_handle, CURLOPT_FOLLOWLOCATION, true);655 > | ^~~~~~~~~~~~~~656 > gcc -Wall -Wmissing-prototypes -Wpointer-arith -Wdeclaration-after-statement -Werror=vla -Wendif-labels -Wmissing-format-attribute -Wimplicit-fallthrough=3 -Wcast-function-type -Wformat-security -fno-strict-aliasing -fwrapv -fexcess-precision=standard -Wno-deprecated-non-prototype -Wno-format-truncation -Wno-stringop-truncation -g -O2 -std=gnu17 -std=c11 -Werror -Wno-declaration-after-statement -fPIC -DEXTVERSION=\"0.13.0\" -I. -I./ -I/nix/store/804f042cyc4dca4vwl2fmh1rhfy0sij9-postgresql-15.19/include/server -I/nix/store/804f042cyc4dca4vwl2fmh1rhfy0sij9-postgresql-15.19/include/internal -D_GNU_SOURCE -I/nix/store/5nl2zr46dic7mxcw6cvbq85wa8c2gngh-libxml2-2.15.1-dev/include/libxml2 -I/nix/store/sl10j863s32x7dv5vw6wfx1nh22f3xh2-lz4-1.10.0-dev/include -I/nix/store/di94mxmhhk390zzzv2gvavfwkgww7q6h-zstd-1.5.7-dev/include -I/nix/store/h5hfqhzcqszmsacj26hh3fngwcal04zs-icu4c-75.1-dev/include -c -o src/event.o src/event.c657 > In file included from /nix/store/wflnb8fxmq4lqx3ca91hlpv95vrqkv51-curl-8.17.0-dev/include/curl/curl.h:3333,658 > from /nix/store/wflnb8fxmq4lqx3ca91hlpv95vrqkv51-curl-8.17.0-dev/include/curl/multi.h:51,659 > from src/event.h:4,660 > from src/event.c:6:661 > /nix/store/wflnb8fxmq4lqx3ca91hlpv95vrqkv51-curl-8.17.0-dev/include/curl/multi.h:429:23: error: expected identifier or '(' before '__extension__'662 > 429 | CURL_EXTERN CURLMcode curl_multi_setopt(CURLM *multi_handle,663 > | ^~~~~~~~~~~~~~~~~664 > /nix/store/wflnb8fxmq4lqx3ca91hlpv95vrqkv51-curl-8.17.0-dev/include/curl/multi.h:429:23: error: expected identifier or '(' before ')' token665 > 429 | CURL_EXTERN CURLMcode curl_multi_setopt(CURLM *multi_handle,666 > | ^~~~~~~~~~~~~~~~~667 > make: *** [<builtin>: src/event.o] Error 1668 For full logs, run:669 nix log /nix/store/ggfg6al5fkdp0r1jsc3iabgz0p7g6l1m-pg_net-0.7.drv670error: Cannot build '/nix/store/94hi7qqfg86lfxqnyqizx334my0yjbh3-pg_net.drv'.671 Reason: 5 dependencies failed.672 Output paths:673 /nix/store/88g5knkc68im4z0plvckvdf0ag9pl97y-pg_net674error: Cannot build '/nix/store/a5gfyj0k47cxv70v4a1zhhk1998vd290-postgresql-and-plugins-15.19.drv'.675 Reason: 1 dependency failed.676 Output paths:677 /nix/store/zn5pxdcd7zf2nviqxmbqb3whv0b89njc-postgresql-and-plugins-15.19678error: Cannot build '/nix/store/69zc44dp9979jf4p9hcpgfdf1wgpw40l-postgresql-and-plugins-15.19.drv'.679 Reason: 1 dependency failed.680 Output paths:681 /nix/store/hhm9gzfpx0h3lp8ld4wvl64kwnddl1yd-postgresql-and-plugins-15.19682error: Cannot build '/nix/store/yr25cab0bgg2gdcjr0fkk052aqw4ag84-postgresql-init.drv'.683 Reason: 1 dependency failed.684 Output paths:685 /nix/store/7nv58lyapj4mqdczihsi6cfmcydjazv0-postgresql-init686error: Cannot build '/nix/store/319yam8jpgm13yfxs5psx2g1j4zd346h-postgresql-migrate.drv'.687 Reason: 2 dependencies failed.688 Output paths:689 /nix/store/rpg8r2qwvwslgphbrd164k6alxbq4zpq-postgresql-migrate690error: Cannot build '/nix/store/9dhmhlajdjqsz58msmq42lwanwgk4c0z-supabase-db-init.drv'.691 Reason: 1 dependency failed.692 Output paths:693 /nix/store/04kjr2y1f7hkywc7dmww3n56f9awljyv-supabase-db-init694error: Cannot build '/nix/store/ggzwf7y9bbwypxs8a44lg59dd3cbp5k5-system-path.drv'.695 Reason: 2 dependencies failed.696 Output paths:697 /nix/store/2jflmsikx3zpi2kl04372bz76n24mmmh-system-path698error: Cannot build '/nix/store/rp3411xgkcmbnrvxwgg7kxxlhj217519-system-path.drv'.699 Reason: 2 dependencies failed.700 Output paths:701 /nix/store/kx4lvchs53hma4qg0i96hchxf6l84a5d-system-path702error: Cannot build '/nix/store/sn90bhb87fs1r7szfvpnhakcf5cbqipi-system-path.drv'.703 Reason: 1 dependency failed.704 Output paths:705 /nix/store/d1l9p7cxy6frga61c961vbakykybwla0-system-path706error: Cannot build '/nix/store/7mf1lcyklc71a89s4mi3r7w8k39ihvya-dbus-1.drv'.707 Reason: 1 dependency failed.708 Output paths:709 /nix/store/kw6ni7kh3277pz2yj4mabcb1y91fj4fm-dbus-1710error: Cannot build '/nix/store/jwcb2kgwrcwds3m6z7byrg26qackyaxf-dbus-1.drv'.711 Reason: 1 dependency failed.712 Output paths:713 /nix/store/fz2sb148fkcajn05ynvjfm5frqpx68m1-dbus-1714error: Cannot build '/nix/store/rnjj94ch4qaxpyhgvk900hq1rp2ji4cx-dbus-1.drv'.715 Reason: 1 dependency failed.716 Output paths:717 /nix/store/9an5r6jm2y6kpbk4r0b8sibw0vkf19vj-dbus-1718error: Cannot build '/nix/store/xvpj8kcdwibf0zb3lvh74lg9sn132fb6-unit-postgresql-migrate.service.drv'.719 Reason: 1 dependency failed.720 Output paths:721 /nix/store/l0w9p74lwhi21rjz4554f0qafxjgl47r-unit-postgresql-migrate.service722error: Cannot build '/nix/store/18idp8l89ga0vbjdvp5y33m42h8ypb3n-unit-postgresql.service.drv'.723 Reason: 2 dependencies failed.724 Output paths:725 /nix/store/107kzs2gwas10ryhvr2x3ch174m6f6i3-unit-postgresql.service726error: Cannot build '/nix/store/vl4z7w7y2dciycqgcm6qp86dpgddrqgg-unit-postgresql.service.drv'.727 Reason: 2 dependencies failed.728 Output paths:729 /nix/store/k5gqg28zclcqsxfm34fyz0vqq6nrhmj9-unit-postgresql.service730error: Cannot build '/nix/store/9189fi92i7805xz024zxxwljw2xfqplf-unit-supabase-db-init.service.drv'.731 Reason: 1 dependency failed.732 Output paths:733 /nix/store/n1bvlic1id0sybb254vs4nzw75kv51jn-unit-supabase-db-init.service734error: Cannot build '/nix/store/bj8k3q4xx5yxsjpcz0k6pjkann65ifyp-X-Restart-Triggers-dbus.drv'.735 Reason: 1 dependency failed.736 Output paths:737 /nix/store/m5s8iv4fvwca77nj8x9gzi2kbkbhkwj5-X-Restart-Triggers-dbus738error: Cannot build '/nix/store/hkbib28lgy3sdk60wwh6fnjx17lrpkd0-X-Restart-Triggers-dbus.drv'.739 Reason: 1 dependency failed.740 Output paths:741 /nix/store/dykpq6m9x904fkf5li1wl1g95ijg9ag2-X-Restart-Triggers-dbus742error: Cannot build '/nix/store/wd8irv2ffhnmkp1bdcqcf4x5nyhapq43-X-Restart-Triggers-dbus.drv'.743 Reason: 1 dependency failed.744 Output paths:745 /nix/store/v0cz3xq1yacg7hy4vw9qbq7krai8szxa-X-Restart-Triggers-dbus746error: Cannot build '/nix/store/2i01a9qxfbdjlvkl937aq52x148dm5hk-unit-dbus.service.drv'.747 Reason: 1 dependency failed.748 Output paths:749 /nix/store/5a52fh7fc53ay515sc03ffina2qnx016-unit-dbus.service750error: Cannot build '/nix/store/9hia6rkh5qzm30dxyfjihl6251cmnv0l-unit-dbus.service.drv'.751 Reason: 1 dependency failed.752 Output paths:753 /nix/store/4rc70981za6xs4ngbzz75kjzm3w511wc-unit-dbus.service754error: Cannot build '/nix/store/a0nhwyhawfp54kccbpjcvlkybsc46m66-unit-dbus.service.drv'.755 Reason: 1 dependency failed.756 Output paths:757 /nix/store/pm59aikr1pgkii8lbjgy9c339k6gkk70-unit-dbus.service758error: Cannot build '/nix/store/ks9rz4w18q5w6apnl8bszi42p6fqb7w9-unit-dbus.service.drv'.759 Reason: 1 dependency failed.760 Output paths:761 /nix/store/4ivywhvyw3mwb077ypjyzzkgmkm6hdzi-unit-dbus.service762error: Cannot build '/nix/store/ljfzjxqwx4kxjwxjjlnpaqdzh0xqd7xr-unit-dbus.service.drv'.763 Reason: 1 dependency failed.764 Output paths:765 /nix/store/2ah9ks1byg1x3j9kg1x6mbbmykxgl9s1-unit-dbus.service766error: Cannot build '/nix/store/zbb4xyx08cfb7d20vxf6chbzvcw94xva-unit-dbus.service.drv'.767 Reason: 1 dependency failed.768 Output paths:769 /nix/store/dykdj7nvn6dhqk3a88l90a3kcvz0x5vp-unit-dbus.service770error: Cannot build '/nix/store/bk16kzbxqyyqfg6qlmkplrgfhv7k21kl-system-units.drv'.771 Reason: 3 dependencies failed.772 Output paths:773 /nix/store/5hc8xp1vv3vx3vl70cngxm69f7xq9v25-system-units774error: Cannot build '/nix/store/nnswm02aq5rs1v3j77dlnha5mh5c19z7-system-units.drv'.775 Reason: 3 dependencies failed.776 Output paths:777 /nix/store/xc89nsmmxclandfqqfs4kks5mh5m9iya-system-units778error: Cannot build '/nix/store/w29pxvjbvdmyac5wz16l2kakq9n2w4dn-system-units.drv'.779 Reason: 3 dependencies failed.780 Output paths:781 /nix/store/2wkv7zmc05vlyn9797agk3w3grgyiyqp-system-units782error: Cannot build '/nix/store/6axq4j62rji3faz7rvgyjfccczni7z3n-user-units.drv'.783 Reason: 1 dependency failed.784 Output paths:785 /nix/store/y2f4sk4ka6ihz6v4q0hbli1bipmxgrlf-user-units786error: Cannot build '/nix/store/6w9n69ddwya8kjxyrz8n8p48cnhhv8m2-user-units.drv'.787 Reason: 1 dependency failed.788 Output paths:789 /nix/store/d63ihld7njm0bz4m9s6bz2bj5bg4kmqm-user-units790error: Cannot build '/nix/store/jphjq6s3xb6lm1r9a0yllq3wvcijkikd-user-units.drv'.791 Reason: 1 dependency failed.792 Output paths:793 /nix/store/9kr2570q5fkwfrvcvd5r7vr4p5n9bn1r-user-units794error: Cannot build '/nix/store/5i64fsbcnqkbbwyscs590q4x0kckm8vz-etc.drv'.795 Reason: 4 dependencies failed.796 Output paths:797 /nix/store/id8grildviwmlw31q8w30fyk3c4cyhlw-etc798error: Cannot build '/nix/store/dys7bm2r3m1f5zv7a66ajhqdsxph4zlw-etc.drv'.799 Reason: 4 dependencies failed.800 Output paths:801 /nix/store/nsbdx81bppdz5a7lyzsbv7s97qh52vlp-etc802error: Cannot build '/nix/store/yigqx2853rhqfbmrfci5bzld6c089mrd-etc.drv'.803 Reason: 4 dependencies failed.804 Output paths:805 /nix/store/j65wr0g6yjn70yxfwvwvm8n6xb4zlp97-etc806error: Cannot build '/nix/store/0mzm2f6fa46w1xld4wk2fb47gg0spks1-activate.drv'.807 Reason: 1 dependency failed.808 Output paths:809 /nix/store/dz71l6nx8zwrr604q4bqkbj3mnb19y78-activate810error: Cannot build '/nix/store/9i17zb3islwpb2pj7iwsw6d08gv9zdi2-activate.drv'.811 Reason: 1 dependency failed.812 Output paths:813 /nix/store/lplwwpzas08vvhnpcpq2wsxa0iwzykyv-activate814error: Cannot build '/nix/store/f3zaq5gia1p450hfwx1a5ka9b2crwvpc-activate.drv'.815 Reason: 1 dependency failed.816 Output paths:817 /nix/store/fs4g4l5vxpi515v6ki5mm5bff92cxjm8-activate818error: Cannot build '/nix/store/flpw9rfcwf20596nm3x5g91lj4wx6gsa-nixos-system-server-test.drv'.819 Reason: 3 dependencies failed.820 Output paths:821 /nix/store/b2y0ydacc3q228q5ng7sx3ahix9jmmrc-nixos-system-server-test822error: Cannot build '/nix/store/imr0jfl9r75i4l9br1zkqw4li7qls97p-nixos-system-server-test.drv'.823 Reason: 3 dependencies failed.824 Output paths:825 /nix/store/fp9xi6s4v3xhr3cvihbgvly7dvjxbr9b-nixos-system-server-test826error: Cannot build '/nix/store/zn5pqckvabyvbj8b760an4hwnbp3x1vx-nixos-system-server-test.drv'.827 Reason: 5 dependencies failed.828 Output paths:829 /nix/store/4a0v768sma96paf065lwj3c0baxbwwmq-nixos-system-server-test830error: Cannot build '/nix/store/l3g0a20fmxqmkdp4radxq4r3xd5jwzjy-closure-info.drv'.831 Reason: 1 dependency failed.832 Output paths:833 /nix/store/zb01z9b1jjvd3kxr2rxhgrayzjbjp6sp-closure-info834error: Cannot build '/nix/store/q1smldjprgklvy119fkq6b38a23idjc4-run-nixos-vm.drv'.835 Reason: 2 dependencies failed.836 Output paths:837 /nix/store/21alg8q3cb7j8dv42jy2rkmk2zixr935-run-nixos-vm838error: Cannot build '/nix/store/c0y8vb21y52ps11vi8ajzkqyvl7dd7nz-nixos-vm.drv'.839 Reason: 2 dependencies failed.840 Output paths:841 /nix/store/hl9ffgp199r4ciynbkr96ykzq247zy1w-nixos-vm842error: Cannot build '/nix/store/3ngaaqb5yrwkgwk0i7iwl63xngb9m1q8-nixos-test-driver-pgrouting.drv'.843 Reason: 2 dependencies failed.844 Output paths:845 /nix/store/7ljnmfns27i5v7k82mn2cyrxf8biggln-nixos-test-driver-pgrouting846error: Cannot build '/nix/store/qwkwqsjxx1l5y5j91y4f8kzwvwnr5728-vm-test-run-pgrouting.drv'.847 Reason: 1 dependency failed.848 Output paths:849 /nix/store/v4p82a77gzrd82y0s0lvqn9ic0qp7gh7-vm-test-run-pgrouting