setup
checks.x86_64-linux.ext-pgmq
· build #133
· raw
1these 68 derivations will be built:2 /nix/store/5v6a4ssacxc4snck5dzagkmqhcsh2swz-pg_net-0.19.5.drv3 /nix/store/7b5ar71808xp6cc9vi64vcr3gxhaq9w2-pg_net-0.14.0.drv4 /nix/store/ggfg6al5fkdp0r1jsc3iabgz0p7g6l1m-pg_net-0.7.drv5 /nix/store/hfwkzpr1kplwaywhvayqm6j4gsva8n5n-pg_net-0.20.0.drv6 /nix/store/ymx9gp4jhvd7qpjvk95vw2m6ycb0jal7-pg_net-0.13.0.drv7 /nix/store/94hi7qqfg86lfxqnyqizx334my0yjbh3-pg_net.drv8 /nix/store/a5gfyj0k47cxv70v4a1zhhk1998vd290-postgresql-and-plugins-15.19.drv9 /nix/store/69zc44dp9979jf4p9hcpgfdf1wgpw40l-postgresql-and-plugins-15.19.drv10 /nix/store/bv2b3hyfiwg59frhybs6cmf9l26byfrs-pg_net-0.13.0.drv11 /nix/store/dxjxg15c0m6vdgy5yswqbm50g4fww2p1-pg_net-0.14.0.drv12 /nix/store/jvalwdcdi2ci9kcx1q2zx6hyla1sa738-pg_net-0.20.0.drv13 /nix/store/v7i610b6q10zpsd2536yvba9pd2xqrr6-pg_net-0.19.5.drv14 /nix/store/zd0hg58y5nwnnwfzy7sd19l7dzx4zvv5-pg_net.drv15 /nix/store/m7073j3kxn6vxs53jdm448q51cxiimys-postgresql-and-plugins-17_22.drv16 /nix/store/q8qv7gf9izi4my9mjapggg0fx2dhzlwc-postgresql-and-plugins-17_22.drv17 /nix/store/ggzwf7y9bbwypxs8a44lg59dd3cbp5k5-system-path.drv18 /nix/store/7mf1lcyklc71a89s4mi3r7w8k39ihvya-dbus-1.drv19 /nix/store/wd8irv2ffhnmkp1bdcqcf4x5nyhapq43-X-Restart-Triggers-dbus.drv20 /nix/store/2i01a9qxfbdjlvkl937aq52x148dm5hk-unit-dbus.service.drv21 /nix/store/6axq4j62rji3faz7rvgyjfccczni7z3n-user-units.drv22 /nix/store/y85ggf9qcv7hsaxx3fyr5a14nf67953g-postgresql-orioledb-init.drv23 /nix/store/6dmfl5hj72ck728kvz45gg2241dk81ci-unit-postgresql.service.drv24 /nix/store/9hia6rkh5qzm30dxyfjihl6251cmnv0l-unit-dbus.service.drv25 /nix/store/7p4sg9x4d75pncaxpl0sa51ja5k2bik8-supabase-orioledb-db-init.drv26 /nix/store/dadjlp1c0v94bsq44xmi8yl99z9dwd3n-unit-supabase-db-init.service.drv27 /nix/store/nnswm02aq5rs1v3j77dlnha5mh5c19z7-system-units.drv28 /nix/store/dys7bm2r3m1f5zv7a66ajhqdsxph4zlw-etc.drv29 /nix/store/0mzm2f6fa46w1xld4wk2fb47gg0spks1-activate.drv30 /nix/store/sn90bhb87fs1r7szfvpnhakcf5cbqipi-system-path.drv31 /nix/store/rnjj94ch4qaxpyhgvk900hq1rp2ji4cx-dbus-1.drv32 /nix/store/bj8k3q4xx5yxsjpcz0k6pjkann65ifyp-X-Restart-Triggers-dbus.drv33 /nix/store/ljfzjxqwx4kxjwxjjlnpaqdzh0xqd7xr-unit-dbus.service.drv34 /nix/store/jphjq6s3xb6lm1r9a0yllq3wvcijkikd-user-units.drv35 /nix/store/yr25cab0bgg2gdcjr0fkk052aqw4ag84-postgresql-init.drv36 /nix/store/18idp8l89ga0vbjdvp5y33m42h8ypb3n-unit-postgresql.service.drv37 /nix/store/9dhmhlajdjqsz58msmq42lwanwgk4c0z-supabase-db-init.drv38 /nix/store/9189fi92i7805xz024zxxwljw2xfqplf-unit-supabase-db-init.service.drv39 /nix/store/ks9rz4w18q5w6apnl8bszi42p6fqb7w9-unit-dbus.service.drv40 /nix/store/w29pxvjbvdmyac5wz16l2kakq9n2w4dn-system-units.drv41 /nix/store/5i64fsbcnqkbbwyscs590q4x0kckm8vz-etc.drv42 /nix/store/f3zaq5gia1p450hfwx1a5ka9b2crwvpc-activate.drv43 /nix/store/flpw9rfcwf20596nm3x5g91lj4wx6gsa-nixos-system-server-test.drv44 /nix/store/h3jfznl8xhwm8wvvxg23yj74srzz3vii-pg_net-0.19.5.drv45 /nix/store/jdx62c5jlcjxsbqjaqi25zwfy2ys9jp5-pg_net-0.13.0.drv46 /nix/store/ky294hja2giinx8655lj1d83j4jq5gjj-pg_net-0.14.0.drv47 /nix/store/ky7414m088qm5h8xn9z7xzw0k08wgcrh-pg_net-0.20.0.drv48 /nix/store/cqdc5q7n6g9pkxy0cjcvkq185rps4bfd-pg_net.drv49 /nix/store/d5s4s970iizz6a8w5ndnpzyw63w1m1qv-postgresql-and-plugins-17.11.drv50 /nix/store/7hla3p20yajypj5w3hnrx38bc3kq14vq-postgresql-and-plugins-17.11.drv51 /nix/store/rp3411xgkcmbnrvxwgg7kxxlhj217519-system-path.drv52 /nix/store/jwcb2kgwrcwds3m6z7byrg26qackyaxf-dbus-1.drv53 /nix/store/hkbib28lgy3sdk60wwh6fnjx17lrpkd0-X-Restart-Triggers-dbus.drv54 /nix/store/zbb4xyx08cfb7d20vxf6chbzvcw94xva-unit-dbus.service.drv55 /nix/store/6w9n69ddwya8kjxyrz8n8p48cnhhv8m2-user-units.drv56 /nix/store/a0nhwyhawfp54kccbpjcvlkybsc46m66-unit-dbus.service.drv57 /nix/store/vl4z7w7y2dciycqgcm6qp86dpgddrqgg-unit-postgresql.service.drv58 /nix/store/319yam8jpgm13yfxs5psx2g1j4zd346h-postgresql-migrate.drv59 /nix/store/xvpj8kcdwibf0zb3lvh74lg9sn132fb6-unit-postgresql-migrate.service.drv60 /nix/store/bk16kzbxqyyqfg6qlmkplrgfhv7k21kl-system-units.drv61 /nix/store/yigqx2853rhqfbmrfci5bzld6c089mrd-etc.drv62 /nix/store/9i17zb3islwpb2pj7iwsw6d08gv9zdi2-activate.drv63 /nix/store/imr0jfl9r75i4l9br1zkqw4li7qls97p-nixos-system-server-test.drv64 /nix/store/zn5pqckvabyvbj8b760an4hwnbp3x1vx-nixos-system-server-test.drv65 /nix/store/l3g0a20fmxqmkdp4radxq4r3xd5jwzjy-closure-info.drv66 /nix/store/q1smldjprgklvy119fkq6b38a23idjc4-run-nixos-vm.drv67 /nix/store/c0y8vb21y52ps11vi8ajzkqyvl7dd7nz-nixos-vm.drv68 /nix/store/17x2akj87jznlh9g691nzdd6xvnjgprj-nixos-test-driver-pgmq.drv69 /nix/store/nzwzqzh0nfxvv8qqk00vbj3nwfpd8jlv-vm-test-run-pgmq.drv70error: Cannot build '/nix/store/dxjxg15c0m6vdgy5yswqbm50g4fww2p1-pg_net-0.14.0.drv'.71 Reason: builder failed with exit code 2.72 Output paths:73 /nix/store/xqh65xhxx9wcmpgwvzh7kkpf9zs0y72x-pg_net-0.14.074 Last 25 log lines:75 > src/errors.h:6:11: warning: call to 'Wcurl_easy_setopt_err_long' declared with attribute warning: curl_easy_setopt expects a long argument [-Wattribute-warning]76 > 6 | if (curl_easy_setopt(hdl, opt, prm) != CURLE_OK) \77 > | ^~~~~~~~~~~~~~~~78 > src/core.c:134:3: note: in expansion of macro 'EREPORT_CURL_SETOPT'79 > 134 | EREPORT_CURL_SETOPT(curl_ez_handle, CURLOPT_TIMEOUT_MS, cdata->timeout_milliseconds);80 > | ^~~~~~~~~~~~~~~~~~~81 > src/errors.h:6:11: warning: call to 'Wcurl_easy_setopt_err_long' declared with attribute warning: curl_easy_setopt expects a long argument [-Wattribute-warning]82 > 6 | if (curl_easy_setopt(hdl, opt, prm) != CURLE_OK) \83 > | ^~~~~~~~~~~~~~~~84 > src/core.c:136:3: note: in expansion of macro 'EREPORT_CURL_SETOPT'85 > 136 | EREPORT_CURL_SETOPT(curl_ez_handle, CURLOPT_FOLLOWLOCATION, true);86 > | ^~~~~~~~~~~~~~~~~~~87 > gcc -Wall -Wmissing-prototypes -Wpointer-arith -Wdeclaration-after-statement -Werror=vla -Wendif-labels -Wmissing-format-attribute -Wimplicit-fallthrough=3 -Wcast-function-type -Wshadow=compatible-local -Wformat-security -fno-strict-aliasing -fwrapv -fexcess-precision=standard -Wno-format-truncation -Wno-stringop-truncation -g -O2 -std=c11 -Werror -Wno-declaration-after-statement -fPIC -fvisibility=hidden -DEXTVERSION=\"0.14.0\" -I. -I./ -I/nix/store/qmc7y6nc0qxg50ywm46x4iaqq5knz702-postgresql-17_22/include/server -I/nix/store/qmc7y6nc0qxg50ywm46x4iaqq5knz702-postgresql-17_22/include/internal -D_GNU_SOURCE -I/nix/store/5nl2zr46dic7mxcw6cvbq85wa8c2gngh-libxml2-2.15.1-dev/include/libxml2 -I/nix/store/sl10j863s32x7dv5vw6wfx1nh22f3xh2-lz4-1.10.0-dev/include -I/nix/store/di94mxmhhk390zzzv2gvavfwkgww7q6h-zstd-1.5.7-dev/include -I/nix/store/h5hfqhzcqszmsacj26hh3fngwcal04zs-icu4c-75.1-dev/include -c -o src/errors.o src/errors.c88 > gcc -Wall -Wmissing-prototypes -Wpointer-arith -Wdeclaration-after-statement -Werror=vla -Wendif-labels -Wmissing-format-attribute -Wimplicit-fallthrough=3 -Wcast-function-type -Wshadow=compatible-local -Wformat-security -fno-strict-aliasing -fwrapv -fexcess-precision=standard -Wno-format-truncation -Wno-stringop-truncation -g -O2 -std=c11 -Werror -Wno-declaration-after-statement -fPIC -fvisibility=hidden -DEXTVERSION=\"0.14.0\" -I. -I./ -I/nix/store/qmc7y6nc0qxg50ywm46x4iaqq5knz702-postgresql-17_22/include/server -I/nix/store/qmc7y6nc0qxg50ywm46x4iaqq5knz702-postgresql-17_22/include/internal -D_GNU_SOURCE -I/nix/store/5nl2zr46dic7mxcw6cvbq85wa8c2gngh-libxml2-2.15.1-dev/include/libxml2 -I/nix/store/sl10j863s32x7dv5vw6wfx1nh22f3xh2-lz4-1.10.0-dev/include -I/nix/store/di94mxmhhk390zzzv2gvavfwkgww7q6h-zstd-1.5.7-dev/include -I/nix/store/h5hfqhzcqszmsacj26hh3fngwcal04zs-icu4c-75.1-dev/include -c -o src/event.o src/event.c89 > In file included from /nix/store/wflnb8fxmq4lqx3ca91hlpv95vrqkv51-curl-8.17.0-dev/include/curl/curl.h:3333,90 > from /nix/store/wflnb8fxmq4lqx3ca91hlpv95vrqkv51-curl-8.17.0-dev/include/curl/multi.h:51,91 > from src/event.h:4,92 > from src/event.c:6:93 > /nix/store/wflnb8fxmq4lqx3ca91hlpv95vrqkv51-curl-8.17.0-dev/include/curl/multi.h:429:23: error: expected identifier or '(' before '__extension__'94 > 429 | CURL_EXTERN CURLMcode curl_multi_setopt(CURLM *multi_handle,95 > | ^~~~~~~~~~~~~~~~~96 > /nix/store/wflnb8fxmq4lqx3ca91hlpv95vrqkv51-curl-8.17.0-dev/include/curl/multi.h:429:23: error: expected identifier or '(' before ')' token97 > 429 | CURL_EXTERN CURLMcode curl_multi_setopt(CURLM *multi_handle,98 > | ^~~~~~~~~~~~~~~~~99 > make: *** [<builtin>: src/event.o] Error 1100 For full logs, run:101 nix log /nix/store/dxjxg15c0m6vdgy5yswqbm50g4fww2p1-pg_net-0.14.0.drv102error: Cannot build '/nix/store/ky294hja2giinx8655lj1d83j4jq5gjj-pg_net-0.14.0.drv'.103 Reason: builder failed with exit code 2.104 Output paths:105 /nix/store/da6kcjzl896sjpnd8rrkfzykfm8chlaz-pg_net-0.14.0106 Last 25 log lines:107 > src/errors.h:6:11: warning: call to 'Wcurl_easy_setopt_err_long' declared with attribute warning: curl_easy_setopt expects a long argument [-Wattribute-warning]108 > 6 | if (curl_easy_setopt(hdl, opt, prm) != CURLE_OK) \109 > | ^~~~~~~~~~~~~~~~110 > src/core.c:134:3: note: in expansion of macro 'EREPORT_CURL_SETOPT'111 > 134 | EREPORT_CURL_SETOPT(curl_ez_handle, CURLOPT_TIMEOUT_MS, cdata->timeout_milliseconds);112 > | ^~~~~~~~~~~~~~~~~~~113 > src/errors.h:6:11: warning: call to 'Wcurl_easy_setopt_err_long' declared with attribute warning: curl_easy_setopt expects a long argument [-Wattribute-warning]114 > 6 | if (curl_easy_setopt(hdl, opt, prm) != CURLE_OK) \115 > | ^~~~~~~~~~~~~~~~116 > src/core.c:136:3: note: in expansion of macro 'EREPORT_CURL_SETOPT'117 > 136 | EREPORT_CURL_SETOPT(curl_ez_handle, CURLOPT_FOLLOWLOCATION, true);118 > | ^~~~~~~~~~~~~~~~~~~119 > gcc -Wall -Wmissing-prototypes -Wpointer-arith -Wdeclaration-after-statement -Werror=vla -Wendif-labels -Wmissing-format-attribute -Wimplicit-fallthrough=3 -Wcast-function-type -Wshadow=compatible-local -Wformat-security -fno-strict-aliasing -fwrapv -fexcess-precision=standard -Wno-format-truncation -Wno-stringop-truncation -g -O2 -std=c11 -Werror -Wno-declaration-after-statement -fPIC -fvisibility=hidden -DEXTVERSION=\"0.14.0\" -I. -I./ -I/nix/store/dj25xabr71j1mmxf628lqsn61qd5qcyk-postgresql-17.11/include/server -I/nix/store/dj25xabr71j1mmxf628lqsn61qd5qcyk-postgresql-17.11/include/internal -D_GNU_SOURCE -I/nix/store/5nl2zr46dic7mxcw6cvbq85wa8c2gngh-libxml2-2.15.1-dev/include/libxml2 -I/nix/store/sl10j863s32x7dv5vw6wfx1nh22f3xh2-lz4-1.10.0-dev/include -I/nix/store/di94mxmhhk390zzzv2gvavfwkgww7q6h-zstd-1.5.7-dev/include -I/nix/store/h5hfqhzcqszmsacj26hh3fngwcal04zs-icu4c-75.1-dev/include -c -o src/errors.o src/errors.c120 > gcc -Wall -Wmissing-prototypes -Wpointer-arith -Wdeclaration-after-statement -Werror=vla -Wendif-labels -Wmissing-format-attribute -Wimplicit-fallthrough=3 -Wcast-function-type -Wshadow=compatible-local -Wformat-security -fno-strict-aliasing -fwrapv -fexcess-precision=standard -Wno-format-truncation -Wno-stringop-truncation -g -O2 -std=c11 -Werror -Wno-declaration-after-statement -fPIC -fvisibility=hidden -DEXTVERSION=\"0.14.0\" -I. -I./ -I/nix/store/dj25xabr71j1mmxf628lqsn61qd5qcyk-postgresql-17.11/include/server -I/nix/store/dj25xabr71j1mmxf628lqsn61qd5qcyk-postgresql-17.11/include/internal -D_GNU_SOURCE -I/nix/store/5nl2zr46dic7mxcw6cvbq85wa8c2gngh-libxml2-2.15.1-dev/include/libxml2 -I/nix/store/sl10j863s32x7dv5vw6wfx1nh22f3xh2-lz4-1.10.0-dev/include -I/nix/store/di94mxmhhk390zzzv2gvavfwkgww7q6h-zstd-1.5.7-dev/include -I/nix/store/h5hfqhzcqszmsacj26hh3fngwcal04zs-icu4c-75.1-dev/include -c -o src/event.o src/event.c121 > In file included from /nix/store/wflnb8fxmq4lqx3ca91hlpv95vrqkv51-curl-8.17.0-dev/include/curl/curl.h:3333,122 > from /nix/store/wflnb8fxmq4lqx3ca91hlpv95vrqkv51-curl-8.17.0-dev/include/curl/multi.h:51,123 > from src/event.h:4,124 > from src/event.c:6:125 > /nix/store/wflnb8fxmq4lqx3ca91hlpv95vrqkv51-curl-8.17.0-dev/include/curl/multi.h:429:23: error: expected identifier or '(' before '__extension__'126 > 429 | CURL_EXTERN CURLMcode curl_multi_setopt(CURLM *multi_handle,127 > | ^~~~~~~~~~~~~~~~~128 > /nix/store/wflnb8fxmq4lqx3ca91hlpv95vrqkv51-curl-8.17.0-dev/include/curl/multi.h:429:23: error: expected identifier or '(' before ')' token129 > 429 | CURL_EXTERN CURLMcode curl_multi_setopt(CURLM *multi_handle,130 > | ^~~~~~~~~~~~~~~~~131 > make: *** [<builtin>: src/event.o] Error 1132 For full logs, run:133 nix log /nix/store/ky294hja2giinx8655lj1d83j4jq5gjj-pg_net-0.14.0.drv134error: Cannot build '/nix/store/hfwkzpr1kplwaywhvayqm6j4gsva8n5n-pg_net-0.20.0.drv'.135 Reason: builder failed with exit code 2.136 Output paths:137 /nix/store/scsfkgabhfzpzf64a6cgvkx2zglb6vji-pg_net-0.20.0138 Last 22 log lines:139 > Running phase: unpackPhase140 > unpacking source archive /nix/store/3783i7yhcfqnyv5ndli22gcr11ap151m-source141 > source root is source142 > Running phase: patchPhase143 > Running phase: updateAutotoolsGnuConfigScriptsPhase144 > Running phase: configurePhase145 > no configure script, doing nothing146 > Running phase: buildPhase147 > gcc -Wall -Wmissing-prototypes -Wpointer-arith -Wdeclaration-after-statement -Werror=vla -Wendif-labels -Wmissing-format-attribute -Wimplicit-fallthrough=3 -Wcast-function-type -Wformat-security -fno-strict-aliasing -fwrapv -fexcess-precision=standard -Wno-deprecated-non-prototype -Wno-format-truncation -Wno-stringop-truncation -g -O2 -std=gnu17 -std=c11 -Wextra -Wall -Werror -Wno-declaration-after-statement -Wno-vla -Wno-long-long -Wmissing-variable-declarations -fPIC -DEXTVERSION=\"0.20.0\" -I. -I./ -I/nix/store/804f042cyc4dca4vwl2fmh1rhfy0sij9-postgresql-15.19/include/server -I/nix/store/804f042cyc4dca4vwl2fmh1rhfy0sij9-postgresql-15.19/include/internal -D_GNU_SOURCE -I/nix/store/5nl2zr46dic7mxcw6cvbq85wa8c2gngh-libxml2-2.15.1-dev/include/libxml2 -I/nix/store/sl10j863s32x7dv5vw6wfx1nh22f3xh2-lz4-1.10.0-dev/include -I/nix/store/di94mxmhhk390zzzv2gvavfwkgww7q6h-zstd-1.5.7-dev/include -I/nix/store/h5hfqhzcqszmsacj26hh3fngwcal04zs-icu4c-75.1-dev/include -c -o src/core.o src/core.c148 > gcc -Wall -Wmissing-prototypes -Wpointer-arith -Wdeclaration-after-statement -Werror=vla -Wendif-labels -Wmissing-format-attribute -Wimplicit-fallthrough=3 -Wcast-function-type -Wformat-security -fno-strict-aliasing -fwrapv -fexcess-precision=standard -Wno-deprecated-non-prototype -Wno-format-truncation -Wno-stringop-truncation -g -O2 -std=gnu17 -std=c11 -Wextra -Wall -Werror -Wno-declaration-after-statement -Wno-vla -Wno-long-long -Wmissing-variable-declarations -fPIC -DEXTVERSION=\"0.20.0\" -I. -I./ -I/nix/store/804f042cyc4dca4vwl2fmh1rhfy0sij9-postgresql-15.19/include/server -I/nix/store/804f042cyc4dca4vwl2fmh1rhfy0sij9-postgresql-15.19/include/internal -D_GNU_SOURCE -I/nix/store/5nl2zr46dic7mxcw6cvbq85wa8c2gngh-libxml2-2.15.1-dev/include/libxml2 -I/nix/store/sl10j863s32x7dv5vw6wfx1nh22f3xh2-lz4-1.10.0-dev/include -I/nix/store/di94mxmhhk390zzzv2gvavfwkgww7q6h-zstd-1.5.7-dev/include -I/nix/store/h5hfqhzcqszmsacj26hh3fngwcal04zs-icu4c-75.1-dev/include -c -o src/errors.o src/errors.c149 > gcc -Wall -Wmissing-prototypes -Wpointer-arith -Wdeclaration-after-statement -Werror=vla -Wendif-labels -Wmissing-format-attribute -Wimplicit-fallthrough=3 -Wcast-function-type -Wformat-security -fno-strict-aliasing -fwrapv -fexcess-precision=standard -Wno-deprecated-non-prototype -Wno-format-truncation -Wno-stringop-truncation -g -O2 -std=gnu17 -std=c11 -Wextra -Wall -Werror -Wno-declaration-after-statement -Wno-vla -Wno-long-long -Wmissing-variable-declarations -fPIC -DEXTVERSION=\"0.20.0\" -I. -I./ -I/nix/store/804f042cyc4dca4vwl2fmh1rhfy0sij9-postgresql-15.19/include/server -I/nix/store/804f042cyc4dca4vwl2fmh1rhfy0sij9-postgresql-15.19/include/internal -D_GNU_SOURCE -I/nix/store/5nl2zr46dic7mxcw6cvbq85wa8c2gngh-libxml2-2.15.1-dev/include/libxml2 -I/nix/store/sl10j863s32x7dv5vw6wfx1nh22f3xh2-lz4-1.10.0-dev/include -I/nix/store/di94mxmhhk390zzzv2gvavfwkgww7q6h-zstd-1.5.7-dev/include -I/nix/store/h5hfqhzcqszmsacj26hh3fngwcal04zs-icu4c-75.1-dev/include -c -o src/event.o src/event.c150 > In file included from /nix/store/wflnb8fxmq4lqx3ca91hlpv95vrqkv51-curl-8.17.0-dev/include/curl/curl.h:3333,151 > from /nix/store/wflnb8fxmq4lqx3ca91hlpv95vrqkv51-curl-8.17.0-dev/include/curl/multi.h:51,152 > from src/event.h:4,153 > from src/event.c:6:154 > /nix/store/wflnb8fxmq4lqx3ca91hlpv95vrqkv51-curl-8.17.0-dev/include/curl/multi.h:429:23: error: expected identifier or '(' before '__extension__'155 > 429 | CURL_EXTERN CURLMcode curl_multi_setopt(CURLM *multi_handle,156 > | ^~~~~~~~~~~~~~~~~157 > /nix/store/wflnb8fxmq4lqx3ca91hlpv95vrqkv51-curl-8.17.0-dev/include/curl/multi.h:429:23: error: expected identifier or '(' before ')' token158 > 429 | CURL_EXTERN CURLMcode curl_multi_setopt(CURLM *multi_handle,159 > | ^~~~~~~~~~~~~~~~~160 > make: *** [<builtin>: src/event.o] Error 1161 For full logs, run:162 nix log /nix/store/hfwkzpr1kplwaywhvayqm6j4gsva8n5n-pg_net-0.20.0.drv163error: Cannot build '/nix/store/jdx62c5jlcjxsbqjaqi25zwfy2ys9jp5-pg_net-0.13.0.drv'.164 Reason: builder failed with exit code 2.165 Output paths:166 /nix/store/z8m2csva6bci9vlabgjm2wqd19ww393d-pg_net-0.13.0167 Last 25 log lines:168 > | ^~~~~~~~~~~~~~169 > src/util.h:6:11: warning: call to 'Wcurl_easy_setopt_err_long' declared with attribute warning: curl_easy_setopt expects a long argument [-Wattribute-warning]170 > 6 | if (curl_easy_setopt(hdl, opt, prm) != CURLE_OK) \171 > | ^~~~~~~~~~~~~~~~172 > src/core.c:108:3: note: in expansion of macro 'CURL_EZ_SETOPT'173 > 108 | CURL_EZ_SETOPT(curl_ez_handle, CURLOPT_TIMEOUT_MS, timeout_milliseconds);174 > | ^~~~~~~~~~~~~~175 > src/util.h:6:11: warning: call to 'Wcurl_easy_setopt_err_long' declared with attribute warning: curl_easy_setopt expects a long argument [-Wattribute-warning]176 > 6 | if (curl_easy_setopt(hdl, opt, prm) != CURLE_OK) \177 > | ^~~~~~~~~~~~~~~~178 > src/core.c:110:3: note: in expansion of macro 'CURL_EZ_SETOPT'179 > 110 | CURL_EZ_SETOPT(curl_ez_handle, CURLOPT_FOLLOWLOCATION, true);180 > | ^~~~~~~~~~~~~~181 > gcc -Wall -Wmissing-prototypes -Wpointer-arith -Wdeclaration-after-statement -Werror=vla -Wendif-labels -Wmissing-format-attribute -Wimplicit-fallthrough=3 -Wcast-function-type -Wshadow=compatible-local -Wformat-security -fno-strict-aliasing -fwrapv -fexcess-precision=standard -Wno-format-truncation -Wno-stringop-truncation -g -O2 -std=c11 -Werror -Wno-declaration-after-statement -fPIC -fvisibility=hidden -DEXTVERSION=\"0.13.0\" -I. -I./ -I/nix/store/dj25xabr71j1mmxf628lqsn61qd5qcyk-postgresql-17.11/include/server -I/nix/store/dj25xabr71j1mmxf628lqsn61qd5qcyk-postgresql-17.11/include/internal -D_GNU_SOURCE -I/nix/store/5nl2zr46dic7mxcw6cvbq85wa8c2gngh-libxml2-2.15.1-dev/include/libxml2 -I/nix/store/sl10j863s32x7dv5vw6wfx1nh22f3xh2-lz4-1.10.0-dev/include -I/nix/store/di94mxmhhk390zzzv2gvavfwkgww7q6h-zstd-1.5.7-dev/include -I/nix/store/h5hfqhzcqszmsacj26hh3fngwcal04zs-icu4c-75.1-dev/include -c -o src/event.o src/event.c182 > In file included from /nix/store/wflnb8fxmq4lqx3ca91hlpv95vrqkv51-curl-8.17.0-dev/include/curl/curl.h:3333,183 > from /nix/store/wflnb8fxmq4lqx3ca91hlpv95vrqkv51-curl-8.17.0-dev/include/curl/multi.h:51,184 > from src/event.h:4,185 > from src/event.c:6:186 > /nix/store/wflnb8fxmq4lqx3ca91hlpv95vrqkv51-curl-8.17.0-dev/include/curl/multi.h:429:23: error: expected identifier or '(' before '__extension__'187 > 429 | CURL_EXTERN CURLMcode curl_multi_setopt(CURLM *multi_handle,188 > | ^~~~~~~~~~~~~~~~~189 > /nix/store/wflnb8fxmq4lqx3ca91hlpv95vrqkv51-curl-8.17.0-dev/include/curl/multi.h:429:23: error: expected identifier or '(' before ')' token190 > 429 | CURL_EXTERN CURLMcode curl_multi_setopt(CURLM *multi_handle,191 > | ^~~~~~~~~~~~~~~~~192 > make: *** [<builtin>: src/event.o] Error 1193 For full logs, run:194 nix log /nix/store/jdx62c5jlcjxsbqjaqi25zwfy2ys9jp5-pg_net-0.13.0.drv195error: Cannot build '/nix/store/bv2b3hyfiwg59frhybs6cmf9l26byfrs-pg_net-0.13.0.drv'.196 Reason: builder failed with exit code 2.197 Output paths:198 /nix/store/78qw5358gp449syn03ah921j442fw14j-pg_net-0.13.0199 Last 25 log lines:200 > | ^~~~~~~~~~~~~~201 > src/util.h:6:11: warning: call to 'Wcurl_easy_setopt_err_long' declared with attribute warning: curl_easy_setopt expects a long argument [-Wattribute-warning]202 > 6 | if (curl_easy_setopt(hdl, opt, prm) != CURLE_OK) \203 > | ^~~~~~~~~~~~~~~~204 > src/core.c:108:3: note: in expansion of macro 'CURL_EZ_SETOPT'205 > 108 | CURL_EZ_SETOPT(curl_ez_handle, CURLOPT_TIMEOUT_MS, timeout_milliseconds);206 > | ^~~~~~~~~~~~~~207 > src/util.h:6:11: warning: call to 'Wcurl_easy_setopt_err_long' declared with attribute warning: curl_easy_setopt expects a long argument [-Wattribute-warning]208 > 6 | if (curl_easy_setopt(hdl, opt, prm) != CURLE_OK) \209 > | ^~~~~~~~~~~~~~~~210 > src/core.c:110:3: note: in expansion of macro 'CURL_EZ_SETOPT'211 > 110 | CURL_EZ_SETOPT(curl_ez_handle, CURLOPT_FOLLOWLOCATION, true);212 > | ^~~~~~~~~~~~~~213 > gcc -Wall -Wmissing-prototypes -Wpointer-arith -Wdeclaration-after-statement -Werror=vla -Wendif-labels -Wmissing-format-attribute -Wimplicit-fallthrough=3 -Wcast-function-type -Wshadow=compatible-local -Wformat-security -fno-strict-aliasing -fwrapv -fexcess-precision=standard -Wno-format-truncation -Wno-stringop-truncation -g -O2 -std=c11 -Werror -Wno-declaration-after-statement -fPIC -fvisibility=hidden -DEXTVERSION=\"0.13.0\" -I. -I./ -I/nix/store/qmc7y6nc0qxg50ywm46x4iaqq5knz702-postgresql-17_22/include/server -I/nix/store/qmc7y6nc0qxg50ywm46x4iaqq5knz702-postgresql-17_22/include/internal -D_GNU_SOURCE -I/nix/store/5nl2zr46dic7mxcw6cvbq85wa8c2gngh-libxml2-2.15.1-dev/include/libxml2 -I/nix/store/sl10j863s32x7dv5vw6wfx1nh22f3xh2-lz4-1.10.0-dev/include -I/nix/store/di94mxmhhk390zzzv2gvavfwkgww7q6h-zstd-1.5.7-dev/include -I/nix/store/h5hfqhzcqszmsacj26hh3fngwcal04zs-icu4c-75.1-dev/include -c -o src/event.o src/event.c214 > In file included from /nix/store/wflnb8fxmq4lqx3ca91hlpv95vrqkv51-curl-8.17.0-dev/include/curl/curl.h:3333,215 > from /nix/store/wflnb8fxmq4lqx3ca91hlpv95vrqkv51-curl-8.17.0-dev/include/curl/multi.h:51,216 > from src/event.h:4,217 > from src/event.c:6:218 > /nix/store/wflnb8fxmq4lqx3ca91hlpv95vrqkv51-curl-8.17.0-dev/include/curl/multi.h:429:23: error: expected identifier or '(' before '__extension__'219 > 429 | CURL_EXTERN CURLMcode curl_multi_setopt(CURLM *multi_handle,220 > | ^~~~~~~~~~~~~~~~~221 > /nix/store/wflnb8fxmq4lqx3ca91hlpv95vrqkv51-curl-8.17.0-dev/include/curl/multi.h:429:23: error: expected identifier or '(' before ')' token222 > 429 | CURL_EXTERN CURLMcode curl_multi_setopt(CURLM *multi_handle,223 > | ^~~~~~~~~~~~~~~~~224 > make: *** [<builtin>: src/event.o] Error 1225 For full logs, run:226 nix log /nix/store/bv2b3hyfiwg59frhybs6cmf9l26byfrs-pg_net-0.13.0.drv227error: Cannot build '/nix/store/h3jfznl8xhwm8wvvxg23yj74srzz3vii-pg_net-0.19.5.drv'.228 Reason: builder failed with exit code 2.229 Output paths:230 /nix/store/yc457kag2jhvws0021nbq7nsws86glnl-pg_net-0.19.5231 Last 22 log lines:232 > Running phase: unpackPhase233 > unpacking source archive /nix/store/5zgdqy3bz93jyn79pizxc1hks0cdcadw-source234 > source root is source235 > Running phase: patchPhase236 > Running phase: updateAutotoolsGnuConfigScriptsPhase237 > Running phase: configurePhase238 > no configure script, doing nothing239 > Running phase: buildPhase240 > gcc -Wall -Wmissing-prototypes -Wpointer-arith -Wdeclaration-after-statement -Werror=vla -Wendif-labels -Wmissing-format-attribute -Wimplicit-fallthrough=3 -Wcast-function-type -Wshadow=compatible-local -Wformat-security -fno-strict-aliasing -fwrapv -fexcess-precision=standard -Wno-format-truncation -Wno-stringop-truncation -g -O2 -std=c11 -Wextra -Wall -Werror -Wno-declaration-after-statement -Wno-vla -Wno-long-long -Wmissing-variable-declarations -fPIC -fvisibility=hidden -DEXTVERSION=\"0.19.5\" -I. -I./ -I/nix/store/dj25xabr71j1mmxf628lqsn61qd5qcyk-postgresql-17.11/include/server -I/nix/store/dj25xabr71j1mmxf628lqsn61qd5qcyk-postgresql-17.11/include/internal -D_GNU_SOURCE -I/nix/store/5nl2zr46dic7mxcw6cvbq85wa8c2gngh-libxml2-2.15.1-dev/include/libxml2 -I/nix/store/sl10j863s32x7dv5vw6wfx1nh22f3xh2-lz4-1.10.0-dev/include -I/nix/store/di94mxmhhk390zzzv2gvavfwkgww7q6h-zstd-1.5.7-dev/include -I/nix/store/h5hfqhzcqszmsacj26hh3fngwcal04zs-icu4c-75.1-dev/include -c -o src/core.o src/core.c241 > gcc -Wall -Wmissing-prototypes -Wpointer-arith -Wdeclaration-after-statement -Werror=vla -Wendif-labels -Wmissing-format-attribute -Wimplicit-fallthrough=3 -Wcast-function-type -Wshadow=compatible-local -Wformat-security -fno-strict-aliasing -fwrapv -fexcess-precision=standard -Wno-format-truncation -Wno-stringop-truncation -g -O2 -std=c11 -Wextra -Wall -Werror -Wno-declaration-after-statement -Wno-vla -Wno-long-long -Wmissing-variable-declarations -fPIC -fvisibility=hidden -DEXTVERSION=\"0.19.5\" -I. -I./ -I/nix/store/dj25xabr71j1mmxf628lqsn61qd5qcyk-postgresql-17.11/include/server -I/nix/store/dj25xabr71j1mmxf628lqsn61qd5qcyk-postgresql-17.11/include/internal -D_GNU_SOURCE -I/nix/store/5nl2zr46dic7mxcw6cvbq85wa8c2gngh-libxml2-2.15.1-dev/include/libxml2 -I/nix/store/sl10j863s32x7dv5vw6wfx1nh22f3xh2-lz4-1.10.0-dev/include -I/nix/store/di94mxmhhk390zzzv2gvavfwkgww7q6h-zstd-1.5.7-dev/include -I/nix/store/h5hfqhzcqszmsacj26hh3fngwcal04zs-icu4c-75.1-dev/include -c -o src/errors.o src/errors.c242 > gcc -Wall -Wmissing-prototypes -Wpointer-arith -Wdeclaration-after-statement -Werror=vla -Wendif-labels -Wmissing-format-attribute -Wimplicit-fallthrough=3 -Wcast-function-type -Wshadow=compatible-local -Wformat-security -fno-strict-aliasing -fwrapv -fexcess-precision=standard -Wno-format-truncation -Wno-stringop-truncation -g -O2 -std=c11 -Wextra -Wall -Werror -Wno-declaration-after-statement -Wno-vla -Wno-long-long -Wmissing-variable-declarations -fPIC -fvisibility=hidden -DEXTVERSION=\"0.19.5\" -I. -I./ -I/nix/store/dj25xabr71j1mmxf628lqsn61qd5qcyk-postgresql-17.11/include/server -I/nix/store/dj25xabr71j1mmxf628lqsn61qd5qcyk-postgresql-17.11/include/internal -D_GNU_SOURCE -I/nix/store/5nl2zr46dic7mxcw6cvbq85wa8c2gngh-libxml2-2.15.1-dev/include/libxml2 -I/nix/store/sl10j863s32x7dv5vw6wfx1nh22f3xh2-lz4-1.10.0-dev/include -I/nix/store/di94mxmhhk390zzzv2gvavfwkgww7q6h-zstd-1.5.7-dev/include -I/nix/store/h5hfqhzcqszmsacj26hh3fngwcal04zs-icu4c-75.1-dev/include -c -o src/event.o src/event.c243 > In file included from /nix/store/wflnb8fxmq4lqx3ca91hlpv95vrqkv51-curl-8.17.0-dev/include/curl/curl.h:3333,244 > from /nix/store/wflnb8fxmq4lqx3ca91hlpv95vrqkv51-curl-8.17.0-dev/include/curl/multi.h:51,245 > from src/event.h:4,246 > from src/event.c:6:247 > /nix/store/wflnb8fxmq4lqx3ca91hlpv95vrqkv51-curl-8.17.0-dev/include/curl/multi.h:429:23: error: expected identifier or '(' before '__extension__'248 > 429 | CURL_EXTERN CURLMcode curl_multi_setopt(CURLM *multi_handle,249 > | ^~~~~~~~~~~~~~~~~250 > /nix/store/wflnb8fxmq4lqx3ca91hlpv95vrqkv51-curl-8.17.0-dev/include/curl/multi.h:429:23: error: expected identifier or '(' before ')' token251 > 429 | CURL_EXTERN CURLMcode curl_multi_setopt(CURLM *multi_handle,252 > | ^~~~~~~~~~~~~~~~~253 > make: *** [<builtin>: src/event.o] Error 1254 For full logs, run:255 nix log /nix/store/h3jfznl8xhwm8wvvxg23yj74srzz3vii-pg_net-0.19.5.drv256error: Cannot build '/nix/store/v7i610b6q10zpsd2536yvba9pd2xqrr6-pg_net-0.19.5.drv'.257 Reason: builder failed with exit code 2.258 Output paths:259 /nix/store/pzmf3gl6j9iwmkqjfvwvsb11fh4i1rz2-pg_net-0.19.5260 Last 22 log lines:261 > Running phase: unpackPhase262 > unpacking source archive /nix/store/5zgdqy3bz93jyn79pizxc1hks0cdcadw-source263 > source root is source264 > Running phase: patchPhase265 > Running phase: updateAutotoolsGnuConfigScriptsPhase266 > Running phase: configurePhase267 > no configure script, doing nothing268 > Running phase: buildPhase269 > gcc -Wall -Wmissing-prototypes -Wpointer-arith -Wdeclaration-after-statement -Werror=vla -Wendif-labels -Wmissing-format-attribute -Wimplicit-fallthrough=3 -Wcast-function-type -Wshadow=compatible-local -Wformat-security -fno-strict-aliasing -fwrapv -fexcess-precision=standard -Wno-format-truncation -Wno-stringop-truncation -g -O2 -std=c11 -Wextra -Wall -Werror -Wno-declaration-after-statement -Wno-vla -Wno-long-long -Wmissing-variable-declarations -fPIC -fvisibility=hidden -DEXTVERSION=\"0.19.5\" -I. -I./ -I/nix/store/qmc7y6nc0qxg50ywm46x4iaqq5knz702-postgresql-17_22/include/server -I/nix/store/qmc7y6nc0qxg50ywm46x4iaqq5knz702-postgresql-17_22/include/internal -D_GNU_SOURCE -I/nix/store/5nl2zr46dic7mxcw6cvbq85wa8c2gngh-libxml2-2.15.1-dev/include/libxml2 -I/nix/store/sl10j863s32x7dv5vw6wfx1nh22f3xh2-lz4-1.10.0-dev/include -I/nix/store/di94mxmhhk390zzzv2gvavfwkgww7q6h-zstd-1.5.7-dev/include -I/nix/store/h5hfqhzcqszmsacj26hh3fngwcal04zs-icu4c-75.1-dev/include -c -o src/core.o src/core.c270 > gcc -Wall -Wmissing-prototypes -Wpointer-arith -Wdeclaration-after-statement -Werror=vla -Wendif-labels -Wmissing-format-attribute -Wimplicit-fallthrough=3 -Wcast-function-type -Wshadow=compatible-local -Wformat-security -fno-strict-aliasing -fwrapv -fexcess-precision=standard -Wno-format-truncation -Wno-stringop-truncation -g -O2 -std=c11 -Wextra -Wall -Werror -Wno-declaration-after-statement -Wno-vla -Wno-long-long -Wmissing-variable-declarations -fPIC -fvisibility=hidden -DEXTVERSION=\"0.19.5\" -I. -I./ -I/nix/store/qmc7y6nc0qxg50ywm46x4iaqq5knz702-postgresql-17_22/include/server -I/nix/store/qmc7y6nc0qxg50ywm46x4iaqq5knz702-postgresql-17_22/include/internal -D_GNU_SOURCE -I/nix/store/5nl2zr46dic7mxcw6cvbq85wa8c2gngh-libxml2-2.15.1-dev/include/libxml2 -I/nix/store/sl10j863s32x7dv5vw6wfx1nh22f3xh2-lz4-1.10.0-dev/include -I/nix/store/di94mxmhhk390zzzv2gvavfwkgww7q6h-zstd-1.5.7-dev/include -I/nix/store/h5hfqhzcqszmsacj26hh3fngwcal04zs-icu4c-75.1-dev/include -c -o src/errors.o src/errors.c271 > gcc -Wall -Wmissing-prototypes -Wpointer-arith -Wdeclaration-after-statement -Werror=vla -Wendif-labels -Wmissing-format-attribute -Wimplicit-fallthrough=3 -Wcast-function-type -Wshadow=compatible-local -Wformat-security -fno-strict-aliasing -fwrapv -fexcess-precision=standard -Wno-format-truncation -Wno-stringop-truncation -g -O2 -std=c11 -Wextra -Wall -Werror -Wno-declaration-after-statement -Wno-vla -Wno-long-long -Wmissing-variable-declarations -fPIC -fvisibility=hidden -DEXTVERSION=\"0.19.5\" -I. -I./ -I/nix/store/qmc7y6nc0qxg50ywm46x4iaqq5knz702-postgresql-17_22/include/server -I/nix/store/qmc7y6nc0qxg50ywm46x4iaqq5knz702-postgresql-17_22/include/internal -D_GNU_SOURCE -I/nix/store/5nl2zr46dic7mxcw6cvbq85wa8c2gngh-libxml2-2.15.1-dev/include/libxml2 -I/nix/store/sl10j863s32x7dv5vw6wfx1nh22f3xh2-lz4-1.10.0-dev/include -I/nix/store/di94mxmhhk390zzzv2gvavfwkgww7q6h-zstd-1.5.7-dev/include -I/nix/store/h5hfqhzcqszmsacj26hh3fngwcal04zs-icu4c-75.1-dev/include -c -o src/event.o src/event.c272 > In file included from /nix/store/wflnb8fxmq4lqx3ca91hlpv95vrqkv51-curl-8.17.0-dev/include/curl/curl.h:3333,273 > from /nix/store/wflnb8fxmq4lqx3ca91hlpv95vrqkv51-curl-8.17.0-dev/include/curl/multi.h:51,274 > from src/event.h:4,275 > from src/event.c:6:276 > /nix/store/wflnb8fxmq4lqx3ca91hlpv95vrqkv51-curl-8.17.0-dev/include/curl/multi.h:429:23: error: expected identifier or '(' before '__extension__'277 > 429 | CURL_EXTERN CURLMcode curl_multi_setopt(CURLM *multi_handle,278 > | ^~~~~~~~~~~~~~~~~279 > /nix/store/wflnb8fxmq4lqx3ca91hlpv95vrqkv51-curl-8.17.0-dev/include/curl/multi.h:429:23: error: expected identifier or '(' before ')' token280 > 429 | CURL_EXTERN CURLMcode curl_multi_setopt(CURLM *multi_handle,281 > | ^~~~~~~~~~~~~~~~~282 > make: *** [<builtin>: src/event.o] Error 1283 For full logs, run:284 nix log /nix/store/v7i610b6q10zpsd2536yvba9pd2xqrr6-pg_net-0.19.5.drv285error: Cannot build '/nix/store/jvalwdcdi2ci9kcx1q2zx6hyla1sa738-pg_net-0.20.0.drv'.286 Reason: builder failed with exit code 2.287 Output paths:288 /nix/store/rqjwkm6vikims9d8b7f0a6x4n2qbkq4s-pg_net-0.20.0289 Last 22 log lines:290 > Running phase: unpackPhase291 > unpacking source archive /nix/store/3783i7yhcfqnyv5ndli22gcr11ap151m-source292 > source root is source293 > Running phase: patchPhase294 > Running phase: updateAutotoolsGnuConfigScriptsPhase295 > Running phase: configurePhase296 > no configure script, doing nothing297 > Running phase: buildPhase298 > gcc -Wall -Wmissing-prototypes -Wpointer-arith -Wdeclaration-after-statement -Werror=vla -Wendif-labels -Wmissing-format-attribute -Wimplicit-fallthrough=3 -Wcast-function-type -Wshadow=compatible-local -Wformat-security -fno-strict-aliasing -fwrapv -fexcess-precision=standard -Wno-format-truncation -Wno-stringop-truncation -g -O2 -std=c11 -Wextra -Wall -Werror -Wno-declaration-after-statement -Wno-vla -Wno-long-long -Wmissing-variable-declarations -fPIC -fvisibility=hidden -DEXTVERSION=\"0.20.0\" -I. -I./ -I/nix/store/qmc7y6nc0qxg50ywm46x4iaqq5knz702-postgresql-17_22/include/server -I/nix/store/qmc7y6nc0qxg50ywm46x4iaqq5knz702-postgresql-17_22/include/internal -D_GNU_SOURCE -I/nix/store/5nl2zr46dic7mxcw6cvbq85wa8c2gngh-libxml2-2.15.1-dev/include/libxml2 -I/nix/store/sl10j863s32x7dv5vw6wfx1nh22f3xh2-lz4-1.10.0-dev/include -I/nix/store/di94mxmhhk390zzzv2gvavfwkgww7q6h-zstd-1.5.7-dev/include -I/nix/store/h5hfqhzcqszmsacj26hh3fngwcal04zs-icu4c-75.1-dev/include -c -o src/core.o src/core.c299 > gcc -Wall -Wmissing-prototypes -Wpointer-arith -Wdeclaration-after-statement -Werror=vla -Wendif-labels -Wmissing-format-attribute -Wimplicit-fallthrough=3 -Wcast-function-type -Wshadow=compatible-local -Wformat-security -fno-strict-aliasing -fwrapv -fexcess-precision=standard -Wno-format-truncation -Wno-stringop-truncation -g -O2 -std=c11 -Wextra -Wall -Werror -Wno-declaration-after-statement -Wno-vla -Wno-long-long -Wmissing-variable-declarations -fPIC -fvisibility=hidden -DEXTVERSION=\"0.20.0\" -I. -I./ -I/nix/store/qmc7y6nc0qxg50ywm46x4iaqq5knz702-postgresql-17_22/include/server -I/nix/store/qmc7y6nc0qxg50ywm46x4iaqq5knz702-postgresql-17_22/include/internal -D_GNU_SOURCE -I/nix/store/5nl2zr46dic7mxcw6cvbq85wa8c2gngh-libxml2-2.15.1-dev/include/libxml2 -I/nix/store/sl10j863s32x7dv5vw6wfx1nh22f3xh2-lz4-1.10.0-dev/include -I/nix/store/di94mxmhhk390zzzv2gvavfwkgww7q6h-zstd-1.5.7-dev/include -I/nix/store/h5hfqhzcqszmsacj26hh3fngwcal04zs-icu4c-75.1-dev/include -c -o src/errors.o src/errors.c300 > gcc -Wall -Wmissing-prototypes -Wpointer-arith -Wdeclaration-after-statement -Werror=vla -Wendif-labels -Wmissing-format-attribute -Wimplicit-fallthrough=3 -Wcast-function-type -Wshadow=compatible-local -Wformat-security -fno-strict-aliasing -fwrapv -fexcess-precision=standard -Wno-format-truncation -Wno-stringop-truncation -g -O2 -std=c11 -Wextra -Wall -Werror -Wno-declaration-after-statement -Wno-vla -Wno-long-long -Wmissing-variable-declarations -fPIC -fvisibility=hidden -DEXTVERSION=\"0.20.0\" -I. -I./ -I/nix/store/qmc7y6nc0qxg50ywm46x4iaqq5knz702-postgresql-17_22/include/server -I/nix/store/qmc7y6nc0qxg50ywm46x4iaqq5knz702-postgresql-17_22/include/internal -D_GNU_SOURCE -I/nix/store/5nl2zr46dic7mxcw6cvbq85wa8c2gngh-libxml2-2.15.1-dev/include/libxml2 -I/nix/store/sl10j863s32x7dv5vw6wfx1nh22f3xh2-lz4-1.10.0-dev/include -I/nix/store/di94mxmhhk390zzzv2gvavfwkgww7q6h-zstd-1.5.7-dev/include -I/nix/store/h5hfqhzcqszmsacj26hh3fngwcal04zs-icu4c-75.1-dev/include -c -o src/event.o src/event.c301 > In file included from /nix/store/wflnb8fxmq4lqx3ca91hlpv95vrqkv51-curl-8.17.0-dev/include/curl/curl.h:3333,302 > from /nix/store/wflnb8fxmq4lqx3ca91hlpv95vrqkv51-curl-8.17.0-dev/include/curl/multi.h:51,303 > from src/event.h:4,304 > from src/event.c:6:305 > /nix/store/wflnb8fxmq4lqx3ca91hlpv95vrqkv51-curl-8.17.0-dev/include/curl/multi.h:429:23: error: expected identifier or '(' before '__extension__'306 > 429 | CURL_EXTERN CURLMcode curl_multi_setopt(CURLM *multi_handle,307 > | ^~~~~~~~~~~~~~~~~308 > /nix/store/wflnb8fxmq4lqx3ca91hlpv95vrqkv51-curl-8.17.0-dev/include/curl/multi.h:429:23: error: expected identifier or '(' before ')' token309 > 429 | CURL_EXTERN CURLMcode curl_multi_setopt(CURLM *multi_handle,310 > | ^~~~~~~~~~~~~~~~~311 > make: *** [<builtin>: src/event.o] Error 1312 For full logs, run:313 nix log /nix/store/jvalwdcdi2ci9kcx1q2zx6hyla1sa738-pg_net-0.20.0.drv314error: Cannot build '/nix/store/zd0hg58y5nwnnwfzy7sd19l7dzx4zvv5-pg_net.drv'.315 Reason: 4 dependencies failed.316 Output paths:317 /nix/store/5j8is0c6fp325l5akxcq6digg430r2fy-pg_net318error: Cannot build '/nix/store/m7073j3kxn6vxs53jdm448q51cxiimys-postgresql-and-plugins-17_22.drv'.319 Reason: 1 dependency failed.320 Output paths:321 /nix/store/z04smpdjsr0zxxl7phxyvwwh4ycfq6c5-postgresql-and-plugins-17_22322error: Cannot build '/nix/store/q8qv7gf9izi4my9mjapggg0fx2dhzlwc-postgresql-and-plugins-17_22.drv'.323 Reason: 1 dependency failed.324 Output paths:325 /nix/store/y845ymwkrl6d1g0swpxgxwk72nyclj1s-postgresql-and-plugins-17_22326error: Cannot build '/nix/store/y85ggf9qcv7hsaxx3fyr5a14nf67953g-postgresql-orioledb-init.drv'.327 Reason: 1 dependency failed.328 Output paths:329 /nix/store/ljganhrp9i6y9sfsqv77nzm8ylql0ial-postgresql-orioledb-init330error: Cannot build '/nix/store/7p4sg9x4d75pncaxpl0sa51ja5k2bik8-supabase-orioledb-db-init.drv'.331 Reason: 1 dependency failed.332 Output paths:333 /nix/store/584vyxv0pxm2ks5a423n8i4n4jjfbmza-supabase-orioledb-db-init334error: Cannot build '/nix/store/6dmfl5hj72ck728kvz45gg2241dk81ci-unit-postgresql.service.drv'.335 Reason: 2 dependencies failed.336 Output paths:337 /nix/store/4d86ahvbvwk5brsw0hnkci0nq2i5hzbs-unit-postgresql.service338error: Cannot build '/nix/store/dadjlp1c0v94bsq44xmi8yl99z9dwd3n-unit-supabase-db-init.service.drv'.339 Reason: 1 dependency failed.340 Output paths:341 /nix/store/224g1r7756ryqw509vkfqxila6hi91bb-unit-supabase-db-init.service342error: Cannot build '/nix/store/7b5ar71808xp6cc9vi64vcr3gxhaq9w2-pg_net-0.14.0.drv'.343 Reason: builder failed with exit code 2.344 Output paths:345 /nix/store/2vyqm50vp9dxrrm1lidjzvr6difmnnqc-pg_net-0.14.0346 Last 25 log lines:347 > src/errors.h:6:11: warning: call to 'Wcurl_easy_setopt_err_long' declared with attribute warning: curl_easy_setopt expects a long argument [-Wattribute-warning]348 > 6 | if (curl_easy_setopt(hdl, opt, prm) != CURLE_OK) \349 > | ^~~~~~~~~~~~~~~~350 > src/core.c:134:3: note: in expansion of macro 'EREPORT_CURL_SETOPT'351 > 134 | EREPORT_CURL_SETOPT(curl_ez_handle, CURLOPT_TIMEOUT_MS, cdata->timeout_milliseconds);352 > | ^~~~~~~~~~~~~~~~~~~353 > src/errors.h:6:11: warning: call to 'Wcurl_easy_setopt_err_long' declared with attribute warning: curl_easy_setopt expects a long argument [-Wattribute-warning]354 > 6 | if (curl_easy_setopt(hdl, opt, prm) != CURLE_OK) \355 > | ^~~~~~~~~~~~~~~~356 > src/core.c:136:3: note: in expansion of macro 'EREPORT_CURL_SETOPT'357 > 136 | EREPORT_CURL_SETOPT(curl_ez_handle, CURLOPT_FOLLOWLOCATION, true);358 > | ^~~~~~~~~~~~~~~~~~~359 > gcc -Wall -Wmissing-prototypes -Wpointer-arith -Wdeclaration-after-statement -Werror=vla -Wendif-labels -Wmissing-format-attribute -Wimplicit-fallthrough=3 -Wcast-function-type -Wformat-security -fno-strict-aliasing -fwrapv -fexcess-precision=standard -Wno-deprecated-non-prototype -Wno-format-truncation -Wno-stringop-truncation -g -O2 -std=gnu17 -std=c11 -Werror -Wno-declaration-after-statement -fPIC -DEXTVERSION=\"0.14.0\" -I. -I./ -I/nix/store/804f042cyc4dca4vwl2fmh1rhfy0sij9-postgresql-15.19/include/server -I/nix/store/804f042cyc4dca4vwl2fmh1rhfy0sij9-postgresql-15.19/include/internal -D_GNU_SOURCE -I/nix/store/5nl2zr46dic7mxcw6cvbq85wa8c2gngh-libxml2-2.15.1-dev/include/libxml2 -I/nix/store/sl10j863s32x7dv5vw6wfx1nh22f3xh2-lz4-1.10.0-dev/include -I/nix/store/di94mxmhhk390zzzv2gvavfwkgww7q6h-zstd-1.5.7-dev/include -I/nix/store/h5hfqhzcqszmsacj26hh3fngwcal04zs-icu4c-75.1-dev/include -c -o src/errors.o src/errors.c360 > gcc -Wall -Wmissing-prototypes -Wpointer-arith -Wdeclaration-after-statement -Werror=vla -Wendif-labels -Wmissing-format-attribute -Wimplicit-fallthrough=3 -Wcast-function-type -Wformat-security -fno-strict-aliasing -fwrapv -fexcess-precision=standard -Wno-deprecated-non-prototype -Wno-format-truncation -Wno-stringop-truncation -g -O2 -std=gnu17 -std=c11 -Werror -Wno-declaration-after-statement -fPIC -DEXTVERSION=\"0.14.0\" -I. -I./ -I/nix/store/804f042cyc4dca4vwl2fmh1rhfy0sij9-postgresql-15.19/include/server -I/nix/store/804f042cyc4dca4vwl2fmh1rhfy0sij9-postgresql-15.19/include/internal -D_GNU_SOURCE -I/nix/store/5nl2zr46dic7mxcw6cvbq85wa8c2gngh-libxml2-2.15.1-dev/include/libxml2 -I/nix/store/sl10j863s32x7dv5vw6wfx1nh22f3xh2-lz4-1.10.0-dev/include -I/nix/store/di94mxmhhk390zzzv2gvavfwkgww7q6h-zstd-1.5.7-dev/include -I/nix/store/h5hfqhzcqszmsacj26hh3fngwcal04zs-icu4c-75.1-dev/include -c -o src/event.o src/event.c361 > In file included from /nix/store/wflnb8fxmq4lqx3ca91hlpv95vrqkv51-curl-8.17.0-dev/include/curl/curl.h:3333,362 > from /nix/store/wflnb8fxmq4lqx3ca91hlpv95vrqkv51-curl-8.17.0-dev/include/curl/multi.h:51,363 > from src/event.h:4,364 > from src/event.c:6:365 > /nix/store/wflnb8fxmq4lqx3ca91hlpv95vrqkv51-curl-8.17.0-dev/include/curl/multi.h:429:23: error: expected identifier or '(' before '__extension__'366 > 429 | CURL_EXTERN CURLMcode curl_multi_setopt(CURLM *multi_handle,367 > | ^~~~~~~~~~~~~~~~~368 > /nix/store/wflnb8fxmq4lqx3ca91hlpv95vrqkv51-curl-8.17.0-dev/include/curl/multi.h:429:23: error: expected identifier or '(' before ')' token369 > 429 | CURL_EXTERN CURLMcode curl_multi_setopt(CURLM *multi_handle,370 > | ^~~~~~~~~~~~~~~~~371 > make: *** [<builtin>: src/event.o] Error 1372 For full logs, run:373 nix log /nix/store/7b5ar71808xp6cc9vi64vcr3gxhaq9w2-pg_net-0.14.0.drv374error: Cannot build '/nix/store/ymx9gp4jhvd7qpjvk95vw2m6ycb0jal7-pg_net-0.13.0.drv'.375 Reason: builder failed with exit code 2.376 Output paths:377 /nix/store/pxjg6rykpbbhl7xmwasvyb94bc1v5w3r-pg_net-0.13.0378 Last 25 log lines:379 > | ^~~~~~~~~~~~~~380 > src/util.h:6:11: warning: call to 'Wcurl_easy_setopt_err_long' declared with attribute warning: curl_easy_setopt expects a long argument [-Wattribute-warning]381 > 6 | if (curl_easy_setopt(hdl, opt, prm) != CURLE_OK) \382 > | ^~~~~~~~~~~~~~~~383 > src/core.c:108:3: note: in expansion of macro 'CURL_EZ_SETOPT'384 > 108 | CURL_EZ_SETOPT(curl_ez_handle, CURLOPT_TIMEOUT_MS, timeout_milliseconds);385 > | ^~~~~~~~~~~~~~386 > src/util.h:6:11: warning: call to 'Wcurl_easy_setopt_err_long' declared with attribute warning: curl_easy_setopt expects a long argument [-Wattribute-warning]387 > 6 | if (curl_easy_setopt(hdl, opt, prm) != CURLE_OK) \388 > | ^~~~~~~~~~~~~~~~389 > src/core.c:110:3: note: in expansion of macro 'CURL_EZ_SETOPT'390 > 110 | CURL_EZ_SETOPT(curl_ez_handle, CURLOPT_FOLLOWLOCATION, true);391 > | ^~~~~~~~~~~~~~392 > gcc -Wall -Wmissing-prototypes -Wpointer-arith -Wdeclaration-after-statement -Werror=vla -Wendif-labels -Wmissing-format-attribute -Wimplicit-fallthrough=3 -Wcast-function-type -Wformat-security -fno-strict-aliasing -fwrapv -fexcess-precision=standard -Wno-deprecated-non-prototype -Wno-format-truncation -Wno-stringop-truncation -g -O2 -std=gnu17 -std=c11 -Werror -Wno-declaration-after-statement -fPIC -DEXTVERSION=\"0.13.0\" -I. -I./ -I/nix/store/804f042cyc4dca4vwl2fmh1rhfy0sij9-postgresql-15.19/include/server -I/nix/store/804f042cyc4dca4vwl2fmh1rhfy0sij9-postgresql-15.19/include/internal -D_GNU_SOURCE -I/nix/store/5nl2zr46dic7mxcw6cvbq85wa8c2gngh-libxml2-2.15.1-dev/include/libxml2 -I/nix/store/sl10j863s32x7dv5vw6wfx1nh22f3xh2-lz4-1.10.0-dev/include -I/nix/store/di94mxmhhk390zzzv2gvavfwkgww7q6h-zstd-1.5.7-dev/include -I/nix/store/h5hfqhzcqszmsacj26hh3fngwcal04zs-icu4c-75.1-dev/include -c -o src/event.o src/event.c393 > In file included from /nix/store/wflnb8fxmq4lqx3ca91hlpv95vrqkv51-curl-8.17.0-dev/include/curl/curl.h:3333,394 > from /nix/store/wflnb8fxmq4lqx3ca91hlpv95vrqkv51-curl-8.17.0-dev/include/curl/multi.h:51,395 > from src/event.h:4,396 > from src/event.c:6:397 > /nix/store/wflnb8fxmq4lqx3ca91hlpv95vrqkv51-curl-8.17.0-dev/include/curl/multi.h:429:23: error: expected identifier or '(' before '__extension__'398 > 429 | CURL_EXTERN CURLMcode curl_multi_setopt(CURLM *multi_handle,399 > | ^~~~~~~~~~~~~~~~~400 > /nix/store/wflnb8fxmq4lqx3ca91hlpv95vrqkv51-curl-8.17.0-dev/include/curl/multi.h:429:23: error: expected identifier or '(' before ')' token401 > 429 | CURL_EXTERN CURLMcode curl_multi_setopt(CURLM *multi_handle,402 > | ^~~~~~~~~~~~~~~~~403 > make: *** [<builtin>: src/event.o] Error 1404 For full logs, run:405 nix log /nix/store/ymx9gp4jhvd7qpjvk95vw2m6ycb0jal7-pg_net-0.13.0.drv406error: Cannot build '/nix/store/5v6a4ssacxc4snck5dzagkmqhcsh2swz-pg_net-0.19.5.drv'.407 Reason: builder failed with exit code 2.408 Output paths:409 /nix/store/xcsw4jyz7w5071r5drjiify20gjvij99-pg_net-0.19.5410 Last 22 log lines:411 > Running phase: unpackPhase412 > unpacking source archive /nix/store/5zgdqy3bz93jyn79pizxc1hks0cdcadw-source413 > source root is source414 > Running phase: patchPhase415 > Running phase: updateAutotoolsGnuConfigScriptsPhase416 > Running phase: configurePhase417 > no configure script, doing nothing418 > Running phase: buildPhase419 > gcc -Wall -Wmissing-prototypes -Wpointer-arith -Wdeclaration-after-statement -Werror=vla -Wendif-labels -Wmissing-format-attribute -Wimplicit-fallthrough=3 -Wcast-function-type -Wformat-security -fno-strict-aliasing -fwrapv -fexcess-precision=standard -Wno-deprecated-non-prototype -Wno-format-truncation -Wno-stringop-truncation -g -O2 -std=gnu17 -std=c11 -Wextra -Wall -Werror -Wno-declaration-after-statement -Wno-vla -Wno-long-long -Wmissing-variable-declarations -fPIC -DEXTVERSION=\"0.19.5\" -I. -I./ -I/nix/store/804f042cyc4dca4vwl2fmh1rhfy0sij9-postgresql-15.19/include/server -I/nix/store/804f042cyc4dca4vwl2fmh1rhfy0sij9-postgresql-15.19/include/internal -D_GNU_SOURCE -I/nix/store/5nl2zr46dic7mxcw6cvbq85wa8c2gngh-libxml2-2.15.1-dev/include/libxml2 -I/nix/store/sl10j863s32x7dv5vw6wfx1nh22f3xh2-lz4-1.10.0-dev/include -I/nix/store/di94mxmhhk390zzzv2gvavfwkgww7q6h-zstd-1.5.7-dev/include -I/nix/store/h5hfqhzcqszmsacj26hh3fngwcal04zs-icu4c-75.1-dev/include -c -o src/core.o src/core.c420 > gcc -Wall -Wmissing-prototypes -Wpointer-arith -Wdeclaration-after-statement -Werror=vla -Wendif-labels -Wmissing-format-attribute -Wimplicit-fallthrough=3 -Wcast-function-type -Wformat-security -fno-strict-aliasing -fwrapv -fexcess-precision=standard -Wno-deprecated-non-prototype -Wno-format-truncation -Wno-stringop-truncation -g -O2 -std=gnu17 -std=c11 -Wextra -Wall -Werror -Wno-declaration-after-statement -Wno-vla -Wno-long-long -Wmissing-variable-declarations -fPIC -DEXTVERSION=\"0.19.5\" -I. -I./ -I/nix/store/804f042cyc4dca4vwl2fmh1rhfy0sij9-postgresql-15.19/include/server -I/nix/store/804f042cyc4dca4vwl2fmh1rhfy0sij9-postgresql-15.19/include/internal -D_GNU_SOURCE -I/nix/store/5nl2zr46dic7mxcw6cvbq85wa8c2gngh-libxml2-2.15.1-dev/include/libxml2 -I/nix/store/sl10j863s32x7dv5vw6wfx1nh22f3xh2-lz4-1.10.0-dev/include -I/nix/store/di94mxmhhk390zzzv2gvavfwkgww7q6h-zstd-1.5.7-dev/include -I/nix/store/h5hfqhzcqszmsacj26hh3fngwcal04zs-icu4c-75.1-dev/include -c -o src/errors.o src/errors.c421 > gcc -Wall -Wmissing-prototypes -Wpointer-arith -Wdeclaration-after-statement -Werror=vla -Wendif-labels -Wmissing-format-attribute -Wimplicit-fallthrough=3 -Wcast-function-type -Wformat-security -fno-strict-aliasing -fwrapv -fexcess-precision=standard -Wno-deprecated-non-prototype -Wno-format-truncation -Wno-stringop-truncation -g -O2 -std=gnu17 -std=c11 -Wextra -Wall -Werror -Wno-declaration-after-statement -Wno-vla -Wno-long-long -Wmissing-variable-declarations -fPIC -DEXTVERSION=\"0.19.5\" -I. -I./ -I/nix/store/804f042cyc4dca4vwl2fmh1rhfy0sij9-postgresql-15.19/include/server -I/nix/store/804f042cyc4dca4vwl2fmh1rhfy0sij9-postgresql-15.19/include/internal -D_GNU_SOURCE -I/nix/store/5nl2zr46dic7mxcw6cvbq85wa8c2gngh-libxml2-2.15.1-dev/include/libxml2 -I/nix/store/sl10j863s32x7dv5vw6wfx1nh22f3xh2-lz4-1.10.0-dev/include -I/nix/store/di94mxmhhk390zzzv2gvavfwkgww7q6h-zstd-1.5.7-dev/include -I/nix/store/h5hfqhzcqszmsacj26hh3fngwcal04zs-icu4c-75.1-dev/include -c -o src/event.o src/event.c422 > In file included from /nix/store/wflnb8fxmq4lqx3ca91hlpv95vrqkv51-curl-8.17.0-dev/include/curl/curl.h:3333,423 > from /nix/store/wflnb8fxmq4lqx3ca91hlpv95vrqkv51-curl-8.17.0-dev/include/curl/multi.h:51,424 > from src/event.h:4,425 > from src/event.c:6:426 > /nix/store/wflnb8fxmq4lqx3ca91hlpv95vrqkv51-curl-8.17.0-dev/include/curl/multi.h:429:23: error: expected identifier or '(' before '__extension__'427 > 429 | CURL_EXTERN CURLMcode curl_multi_setopt(CURLM *multi_handle,428 > | ^~~~~~~~~~~~~~~~~429 > /nix/store/wflnb8fxmq4lqx3ca91hlpv95vrqkv51-curl-8.17.0-dev/include/curl/multi.h:429:23: error: expected identifier or '(' before ')' token430 > 429 | CURL_EXTERN CURLMcode curl_multi_setopt(CURLM *multi_handle,431 > | ^~~~~~~~~~~~~~~~~432 > make: *** [<builtin>: src/event.o] Error 1433 For full logs, run:434 nix log /nix/store/5v6a4ssacxc4snck5dzagkmqhcsh2swz-pg_net-0.19.5.drv435error: Cannot build '/nix/store/ggfg6al5fkdp0r1jsc3iabgz0p7g6l1m-pg_net-0.7.drv'.436 Reason: builder failed with exit code 2.437 Output paths:438 /nix/store/pkfapf0li10b8b6nrhwm8880g4d2i8y5-pg_net-0.7439 Last 25 log lines:440 > | ^~~~~~~~~~~~~~441 > src/util.h:6:11: warning: call to 'Wcurl_easy_setopt_err_long' declared with attribute warning: curl_easy_setopt expects a long argument [-Wattribute-warning]442 > 6 | if (curl_easy_setopt(hdl, opt, prm) != CURLE_OK) \443 > | ^~~~~~~~~~~~~~~~444 > src/core.c:108:3: note: in expansion of macro 'CURL_EZ_SETOPT'445 > 108 | CURL_EZ_SETOPT(curl_ez_handle, CURLOPT_TIMEOUT_MS, timeout_milliseconds);446 > | ^~~~~~~~~~~~~~447 > src/util.h:6:11: warning: call to 'Wcurl_easy_setopt_err_long' declared with attribute warning: curl_easy_setopt expects a long argument [-Wattribute-warning]448 > 6 | if (curl_easy_setopt(hdl, opt, prm) != CURLE_OK) \449 > | ^~~~~~~~~~~~~~~~450 > src/core.c:110:3: note: in expansion of macro 'CURL_EZ_SETOPT'451 > 110 | CURL_EZ_SETOPT(curl_ez_handle, CURLOPT_FOLLOWLOCATION, true);452 > | ^~~~~~~~~~~~~~453 > gcc -Wall -Wmissing-prototypes -Wpointer-arith -Wdeclaration-after-statement -Werror=vla -Wendif-labels -Wmissing-format-attribute -Wimplicit-fallthrough=3 -Wcast-function-type -Wformat-security -fno-strict-aliasing -fwrapv -fexcess-precision=standard -Wno-deprecated-non-prototype -Wno-format-truncation -Wno-stringop-truncation -g -O2 -std=gnu17 -std=c11 -Werror -Wno-declaration-after-statement -fPIC -DEXTVERSION=\"0.13.0\" -I. -I./ -I/nix/store/804f042cyc4dca4vwl2fmh1rhfy0sij9-postgresql-15.19/include/server -I/nix/store/804f042cyc4dca4vwl2fmh1rhfy0sij9-postgresql-15.19/include/internal -D_GNU_SOURCE -I/nix/store/5nl2zr46dic7mxcw6cvbq85wa8c2gngh-libxml2-2.15.1-dev/include/libxml2 -I/nix/store/sl10j863s32x7dv5vw6wfx1nh22f3xh2-lz4-1.10.0-dev/include -I/nix/store/di94mxmhhk390zzzv2gvavfwkgww7q6h-zstd-1.5.7-dev/include -I/nix/store/h5hfqhzcqszmsacj26hh3fngwcal04zs-icu4c-75.1-dev/include -c -o src/event.o src/event.c454 > In file included from /nix/store/wflnb8fxmq4lqx3ca91hlpv95vrqkv51-curl-8.17.0-dev/include/curl/curl.h:3333,455 > from /nix/store/wflnb8fxmq4lqx3ca91hlpv95vrqkv51-curl-8.17.0-dev/include/curl/multi.h:51,456 > from src/event.h:4,457 > from src/event.c:6:458 > /nix/store/wflnb8fxmq4lqx3ca91hlpv95vrqkv51-curl-8.17.0-dev/include/curl/multi.h:429:23: error: expected identifier or '(' before '__extension__'459 > 429 | CURL_EXTERN CURLMcode curl_multi_setopt(CURLM *multi_handle,460 > | ^~~~~~~~~~~~~~~~~461 > /nix/store/wflnb8fxmq4lqx3ca91hlpv95vrqkv51-curl-8.17.0-dev/include/curl/multi.h:429:23: error: expected identifier or '(' before ')' token462 > 429 | CURL_EXTERN CURLMcode curl_multi_setopt(CURLM *multi_handle,463 > | ^~~~~~~~~~~~~~~~~464 > make: *** [<builtin>: src/event.o] Error 1465 For full logs, run:466 nix log /nix/store/ggfg6al5fkdp0r1jsc3iabgz0p7g6l1m-pg_net-0.7.drv467error: Cannot build '/nix/store/94hi7qqfg86lfxqnyqizx334my0yjbh3-pg_net.drv'.468 Reason: 5 dependencies failed.469 Output paths:470 /nix/store/88g5knkc68im4z0plvckvdf0ag9pl97y-pg_net471error: Cannot build '/nix/store/a5gfyj0k47cxv70v4a1zhhk1998vd290-postgresql-and-plugins-15.19.drv'.472 Reason: 1 dependency failed.473 Output paths:474 /nix/store/zn5pxdcd7zf2nviqxmbqb3whv0b89njc-postgresql-and-plugins-15.19475error: Cannot build '/nix/store/69zc44dp9979jf4p9hcpgfdf1wgpw40l-postgresql-and-plugins-15.19.drv'.476 Reason: 1 dependency failed.477 Output paths:478 /nix/store/hhm9gzfpx0h3lp8ld4wvl64kwnddl1yd-postgresql-and-plugins-15.19479error: Cannot build '/nix/store/yr25cab0bgg2gdcjr0fkk052aqw4ag84-postgresql-init.drv'.480 Reason: 1 dependency failed.481 Output paths:482 /nix/store/7nv58lyapj4mqdczihsi6cfmcydjazv0-postgresql-init483error: Cannot build '/nix/store/9dhmhlajdjqsz58msmq42lwanwgk4c0z-supabase-db-init.drv'.484 Reason: 1 dependency failed.485 Output paths:486 /nix/store/04kjr2y1f7hkywc7dmww3n56f9awljyv-supabase-db-init487error: Cannot build '/nix/store/ggzwf7y9bbwypxs8a44lg59dd3cbp5k5-system-path.drv'.488 Reason: 2 dependencies failed.489 Output paths:490 /nix/store/2jflmsikx3zpi2kl04372bz76n24mmmh-system-path491error: Cannot build '/nix/store/sn90bhb87fs1r7szfvpnhakcf5cbqipi-system-path.drv'.492 Reason: 1 dependency failed.493 Output paths:494 /nix/store/d1l9p7cxy6frga61c961vbakykybwla0-system-path495error: Cannot build '/nix/store/7mf1lcyklc71a89s4mi3r7w8k39ihvya-dbus-1.drv'.496 Reason: 1 dependency failed.497 Output paths:498 /nix/store/kw6ni7kh3277pz2yj4mabcb1y91fj4fm-dbus-1499error: Cannot build '/nix/store/rnjj94ch4qaxpyhgvk900hq1rp2ji4cx-dbus-1.drv'.500 Reason: 1 dependency failed.501 Output paths:502 /nix/store/9an5r6jm2y6kpbk4r0b8sibw0vkf19vj-dbus-1503error: Cannot build '/nix/store/18idp8l89ga0vbjdvp5y33m42h8ypb3n-unit-postgresql.service.drv'.504 Reason: 2 dependencies failed.505 Output paths:506 /nix/store/107kzs2gwas10ryhvr2x3ch174m6f6i3-unit-postgresql.service507error: Cannot build '/nix/store/9189fi92i7805xz024zxxwljw2xfqplf-unit-supabase-db-init.service.drv'.508 Reason: 1 dependency failed.509 Output paths:510 /nix/store/n1bvlic1id0sybb254vs4nzw75kv51jn-unit-supabase-db-init.service511error: Cannot build '/nix/store/bj8k3q4xx5yxsjpcz0k6pjkann65ifyp-X-Restart-Triggers-dbus.drv'.512 Reason: 1 dependency failed.513 Output paths:514 /nix/store/m5s8iv4fvwca77nj8x9gzi2kbkbhkwj5-X-Restart-Triggers-dbus515error: Cannot build '/nix/store/wd8irv2ffhnmkp1bdcqcf4x5nyhapq43-X-Restart-Triggers-dbus.drv'.516 Reason: 1 dependency failed.517 Output paths:518 /nix/store/v0cz3xq1yacg7hy4vw9qbq7krai8szxa-X-Restart-Triggers-dbus519error: Cannot build '/nix/store/2i01a9qxfbdjlvkl937aq52x148dm5hk-unit-dbus.service.drv'.520 Reason: 1 dependency failed.521 Output paths:522 /nix/store/5a52fh7fc53ay515sc03ffina2qnx016-unit-dbus.service523error: Cannot build '/nix/store/9hia6rkh5qzm30dxyfjihl6251cmnv0l-unit-dbus.service.drv'.524 Reason: 1 dependency failed.525 Output paths:526 /nix/store/4rc70981za6xs4ngbzz75kjzm3w511wc-unit-dbus.service527error: Cannot build '/nix/store/ks9rz4w18q5w6apnl8bszi42p6fqb7w9-unit-dbus.service.drv'.528 Reason: 1 dependency failed.529 Output paths:530 /nix/store/4ivywhvyw3mwb077ypjyzzkgmkm6hdzi-unit-dbus.service531error: Cannot build '/nix/store/ljfzjxqwx4kxjwxjjlnpaqdzh0xqd7xr-unit-dbus.service.drv'.532 Reason: 1 dependency failed.533 Output paths:534 /nix/store/2ah9ks1byg1x3j9kg1x6mbbmykxgl9s1-unit-dbus.service535error: Cannot build '/nix/store/nnswm02aq5rs1v3j77dlnha5mh5c19z7-system-units.drv'.536 Reason: 3 dependencies failed.537 Output paths:538 /nix/store/xc89nsmmxclandfqqfs4kks5mh5m9iya-system-units539error: Cannot build '/nix/store/w29pxvjbvdmyac5wz16l2kakq9n2w4dn-system-units.drv'.540 Reason: 3 dependencies failed.541 Output paths:542 /nix/store/2wkv7zmc05vlyn9797agk3w3grgyiyqp-system-units543error: Cannot build '/nix/store/6axq4j62rji3faz7rvgyjfccczni7z3n-user-units.drv'.544 Reason: 1 dependency failed.545 Output paths:546 /nix/store/y2f4sk4ka6ihz6v4q0hbli1bipmxgrlf-user-units547error: Cannot build '/nix/store/jphjq6s3xb6lm1r9a0yllq3wvcijkikd-user-units.drv'.548 Reason: 1 dependency failed.549 Output paths:550 /nix/store/9kr2570q5fkwfrvcvd5r7vr4p5n9bn1r-user-units551error: Cannot build '/nix/store/5i64fsbcnqkbbwyscs590q4x0kckm8vz-etc.drv'.552 Reason: 4 dependencies failed.553 Output paths:554 /nix/store/id8grildviwmlw31q8w30fyk3c4cyhlw-etc555error: Cannot build '/nix/store/dys7bm2r3m1f5zv7a66ajhqdsxph4zlw-etc.drv'.556 Reason: 4 dependencies failed.557 Output paths:558 /nix/store/nsbdx81bppdz5a7lyzsbv7s97qh52vlp-etc559error: Cannot build '/nix/store/0mzm2f6fa46w1xld4wk2fb47gg0spks1-activate.drv'.560 Reason: 1 dependency failed.561 Output paths:562 /nix/store/dz71l6nx8zwrr604q4bqkbj3mnb19y78-activate563error: Cannot build '/nix/store/f3zaq5gia1p450hfwx1a5ka9b2crwvpc-activate.drv'.564 Reason: 1 dependency failed.565 Output paths:566 /nix/store/fs4g4l5vxpi515v6ki5mm5bff92cxjm8-activate567error: Cannot build '/nix/store/flpw9rfcwf20596nm3x5g91lj4wx6gsa-nixos-system-server-test.drv'.568 Reason: 3 dependencies failed.569 Output paths:570 /nix/store/b2y0ydacc3q228q5ng7sx3ahix9jmmrc-nixos-system-server-test571error: Cannot build '/nix/store/ky7414m088qm5h8xn9z7xzw0k08wgcrh-pg_net-0.20.0.drv'.572 Reason: builder failed with exit code 2.573 Output paths:574 /nix/store/div76hg9lzzwipcrl72qfbl1vaps6bqr-pg_net-0.20.0575 Last 22 log lines:576 > Running phase: unpackPhase577 > unpacking source archive /nix/store/3783i7yhcfqnyv5ndli22gcr11ap151m-source578 > source root is source579 > Running phase: patchPhase580 > Running phase: updateAutotoolsGnuConfigScriptsPhase581 > Running phase: configurePhase582 > no configure script, doing nothing583 > Running phase: buildPhase584 > gcc -Wall -Wmissing-prototypes -Wpointer-arith -Wdeclaration-after-statement -Werror=vla -Wendif-labels -Wmissing-format-attribute -Wimplicit-fallthrough=3 -Wcast-function-type -Wshadow=compatible-local -Wformat-security -fno-strict-aliasing -fwrapv -fexcess-precision=standard -Wno-format-truncation -Wno-stringop-truncation -g -O2 -std=c11 -Wextra -Wall -Werror -Wno-declaration-after-statement -Wno-vla -Wno-long-long -Wmissing-variable-declarations -fPIC -fvisibility=hidden -DEXTVERSION=\"0.20.0\" -I. -I./ -I/nix/store/dj25xabr71j1mmxf628lqsn61qd5qcyk-postgresql-17.11/include/server -I/nix/store/dj25xabr71j1mmxf628lqsn61qd5qcyk-postgresql-17.11/include/internal -D_GNU_SOURCE -I/nix/store/5nl2zr46dic7mxcw6cvbq85wa8c2gngh-libxml2-2.15.1-dev/include/libxml2 -I/nix/store/sl10j863s32x7dv5vw6wfx1nh22f3xh2-lz4-1.10.0-dev/include -I/nix/store/di94mxmhhk390zzzv2gvavfwkgww7q6h-zstd-1.5.7-dev/include -I/nix/store/h5hfqhzcqszmsacj26hh3fngwcal04zs-icu4c-75.1-dev/include -c -o src/core.o src/core.c585 > gcc -Wall -Wmissing-prototypes -Wpointer-arith -Wdeclaration-after-statement -Werror=vla -Wendif-labels -Wmissing-format-attribute -Wimplicit-fallthrough=3 -Wcast-function-type -Wshadow=compatible-local -Wformat-security -fno-strict-aliasing -fwrapv -fexcess-precision=standard -Wno-format-truncation -Wno-stringop-truncation -g -O2 -std=c11 -Wextra -Wall -Werror -Wno-declaration-after-statement -Wno-vla -Wno-long-long -Wmissing-variable-declarations -fPIC -fvisibility=hidden -DEXTVERSION=\"0.20.0\" -I. -I./ -I/nix/store/dj25xabr71j1mmxf628lqsn61qd5qcyk-postgresql-17.11/include/server -I/nix/store/dj25xabr71j1mmxf628lqsn61qd5qcyk-postgresql-17.11/include/internal -D_GNU_SOURCE -I/nix/store/5nl2zr46dic7mxcw6cvbq85wa8c2gngh-libxml2-2.15.1-dev/include/libxml2 -I/nix/store/sl10j863s32x7dv5vw6wfx1nh22f3xh2-lz4-1.10.0-dev/include -I/nix/store/di94mxmhhk390zzzv2gvavfwkgww7q6h-zstd-1.5.7-dev/include -I/nix/store/h5hfqhzcqszmsacj26hh3fngwcal04zs-icu4c-75.1-dev/include -c -o src/errors.o src/errors.c586 > gcc -Wall -Wmissing-prototypes -Wpointer-arith -Wdeclaration-after-statement -Werror=vla -Wendif-labels -Wmissing-format-attribute -Wimplicit-fallthrough=3 -Wcast-function-type -Wshadow=compatible-local -Wformat-security -fno-strict-aliasing -fwrapv -fexcess-precision=standard -Wno-format-truncation -Wno-stringop-truncation -g -O2 -std=c11 -Wextra -Wall -Werror -Wno-declaration-after-statement -Wno-vla -Wno-long-long -Wmissing-variable-declarations -fPIC -fvisibility=hidden -DEXTVERSION=\"0.20.0\" -I. -I./ -I/nix/store/dj25xabr71j1mmxf628lqsn61qd5qcyk-postgresql-17.11/include/server -I/nix/store/dj25xabr71j1mmxf628lqsn61qd5qcyk-postgresql-17.11/include/internal -D_GNU_SOURCE -I/nix/store/5nl2zr46dic7mxcw6cvbq85wa8c2gngh-libxml2-2.15.1-dev/include/libxml2 -I/nix/store/sl10j863s32x7dv5vw6wfx1nh22f3xh2-lz4-1.10.0-dev/include -I/nix/store/di94mxmhhk390zzzv2gvavfwkgww7q6h-zstd-1.5.7-dev/include -I/nix/store/h5hfqhzcqszmsacj26hh3fngwcal04zs-icu4c-75.1-dev/include -c -o src/event.o src/event.c587 > In file included from /nix/store/wflnb8fxmq4lqx3ca91hlpv95vrqkv51-curl-8.17.0-dev/include/curl/curl.h:3333,588 > from /nix/store/wflnb8fxmq4lqx3ca91hlpv95vrqkv51-curl-8.17.0-dev/include/curl/multi.h:51,589 > from src/event.h:4,590 > from src/event.c:6:591 > /nix/store/wflnb8fxmq4lqx3ca91hlpv95vrqkv51-curl-8.17.0-dev/include/curl/multi.h:429:23: error: expected identifier or '(' before '__extension__'592 > 429 | CURL_EXTERN CURLMcode curl_multi_setopt(CURLM *multi_handle,593 > | ^~~~~~~~~~~~~~~~~594 > /nix/store/wflnb8fxmq4lqx3ca91hlpv95vrqkv51-curl-8.17.0-dev/include/curl/multi.h:429:23: error: expected identifier or '(' before ')' token595 > 429 | CURL_EXTERN CURLMcode curl_multi_setopt(CURLM *multi_handle,596 > | ^~~~~~~~~~~~~~~~~597 > make: *** [<builtin>: src/event.o] Error 1598 For full logs, run:599 nix log /nix/store/ky7414m088qm5h8xn9z7xzw0k08wgcrh-pg_net-0.20.0.drv600error: Cannot build '/nix/store/cqdc5q7n6g9pkxy0cjcvkq185rps4bfd-pg_net.drv'.601 Reason: 4 dependencies failed.602 Output paths:603 /nix/store/4sc9iw7bqgw1y6834l2h4w200hvc8b79-pg_net604error: Cannot build '/nix/store/d5s4s970iizz6a8w5ndnpzyw63w1m1qv-postgresql-and-plugins-17.11.drv'.605 Reason: 1 dependency failed.606 Output paths:607 /nix/store/dlsqc392rqmvj64617g73zcbvclgch0b-postgresql-and-plugins-17.11608error: Cannot build '/nix/store/7hla3p20yajypj5w3hnrx38bc3kq14vq-postgresql-and-plugins-17.11.drv'.609 Reason: 1 dependency failed.610 Output paths:611 /nix/store/j9fc5s30v77k7ycb6icimvdhkb7ss17i-postgresql-and-plugins-17.11612error: Cannot build '/nix/store/319yam8jpgm13yfxs5psx2g1j4zd346h-postgresql-migrate.drv'.613 Reason: 2 dependencies failed.614 Output paths:615 /nix/store/rpg8r2qwvwslgphbrd164k6alxbq4zpq-postgresql-migrate616error: Cannot build '/nix/store/rp3411xgkcmbnrvxwgg7kxxlhj217519-system-path.drv'.617 Reason: 2 dependencies failed.618 Output paths:619 /nix/store/kx4lvchs53hma4qg0i96hchxf6l84a5d-system-path620error: Cannot build '/nix/store/vl4z7w7y2dciycqgcm6qp86dpgddrqgg-unit-postgresql.service.drv'.621 Reason: 2 dependencies failed.622 Output paths:623 /nix/store/k5gqg28zclcqsxfm34fyz0vqq6nrhmj9-unit-postgresql.service624error: Cannot build '/nix/store/jwcb2kgwrcwds3m6z7byrg26qackyaxf-dbus-1.drv'.625 Reason: 1 dependency failed.626 Output paths:627 /nix/store/fz2sb148fkcajn05ynvjfm5frqpx68m1-dbus-1628error: Cannot build '/nix/store/xvpj8kcdwibf0zb3lvh74lg9sn132fb6-unit-postgresql-migrate.service.drv'.629 Reason: 1 dependency failed.630 Output paths:631 /nix/store/l0w9p74lwhi21rjz4554f0qafxjgl47r-unit-postgresql-migrate.service632error: Cannot build '/nix/store/hkbib28lgy3sdk60wwh6fnjx17lrpkd0-X-Restart-Triggers-dbus.drv'.633 Reason: 1 dependency failed.634 Output paths:635 /nix/store/dykpq6m9x904fkf5li1wl1g95ijg9ag2-X-Restart-Triggers-dbus636error: Cannot build '/nix/store/a0nhwyhawfp54kccbpjcvlkybsc46m66-unit-dbus.service.drv'.637 Reason: 1 dependency failed.638 Output paths:639 /nix/store/pm59aikr1pgkii8lbjgy9c339k6gkk70-unit-dbus.service640error: Cannot build '/nix/store/zbb4xyx08cfb7d20vxf6chbzvcw94xva-unit-dbus.service.drv'.641 Reason: 1 dependency failed.642 Output paths:643 /nix/store/dykdj7nvn6dhqk3a88l90a3kcvz0x5vp-unit-dbus.service644error: Cannot build '/nix/store/bk16kzbxqyyqfg6qlmkplrgfhv7k21kl-system-units.drv'.645 Reason: 3 dependencies failed.646 Output paths:647 /nix/store/5hc8xp1vv3vx3vl70cngxm69f7xq9v25-system-units648error: Cannot build '/nix/store/6w9n69ddwya8kjxyrz8n8p48cnhhv8m2-user-units.drv'.649 Reason: 1 dependency failed.650 Output paths:651 /nix/store/d63ihld7njm0bz4m9s6bz2bj5bg4kmqm-user-units652error: Cannot build '/nix/store/yigqx2853rhqfbmrfci5bzld6c089mrd-etc.drv'.653 Reason: 4 dependencies failed.654 Output paths:655 /nix/store/j65wr0g6yjn70yxfwvwvm8n6xb4zlp97-etc656error: Cannot build '/nix/store/9i17zb3islwpb2pj7iwsw6d08gv9zdi2-activate.drv'.657 Reason: 1 dependency failed.658 Output paths:659 /nix/store/lplwwpzas08vvhnpcpq2wsxa0iwzykyv-activate660error: Cannot build '/nix/store/imr0jfl9r75i4l9br1zkqw4li7qls97p-nixos-system-server-test.drv'.661 Reason: 3 dependencies failed.662 Output paths:663 /nix/store/fp9xi6s4v3xhr3cvihbgvly7dvjxbr9b-nixos-system-server-test664error: Cannot build '/nix/store/zn5pqckvabyvbj8b760an4hwnbp3x1vx-nixos-system-server-test.drv'.665 Reason: 5 dependencies failed.666 Output paths:667 /nix/store/4a0v768sma96paf065lwj3c0baxbwwmq-nixos-system-server-test668error: Cannot build '/nix/store/l3g0a20fmxqmkdp4radxq4r3xd5jwzjy-closure-info.drv'.669 Reason: 1 dependency failed.670 Output paths:671 /nix/store/zb01z9b1jjvd3kxr2rxhgrayzjbjp6sp-closure-info672error: Cannot build '/nix/store/q1smldjprgklvy119fkq6b38a23idjc4-run-nixos-vm.drv'.673 Reason: 2 dependencies failed.674 Output paths:675 /nix/store/21alg8q3cb7j8dv42jy2rkmk2zixr935-run-nixos-vm676error: Cannot build '/nix/store/c0y8vb21y52ps11vi8ajzkqyvl7dd7nz-nixos-vm.drv'.677 Reason: 2 dependencies failed.678 Output paths:679 /nix/store/hl9ffgp199r4ciynbkr96ykzq247zy1w-nixos-vm680error: Cannot build '/nix/store/17x2akj87jznlh9g691nzdd6xvnjgprj-nixos-test-driver-pgmq.drv'.681 Reason: 2 dependencies failed.682 Output paths:683 /nix/store/94kaw7pdxarxmy9ss11gfspb08hk4kjb-nixos-test-driver-pgmq684error: Cannot build '/nix/store/nzwzqzh0nfxvv8qqk00vbj3nwfpd8jlv-vm-test-run-pgmq.drv'.685 Reason: 1 dependency failed.686 Output paths:687 /nix/store/yxvrnqyspgblazdfjdyvb83m5xif475j-vm-test-run-pgmq