nixbot

builds

failed pg_net-0.14.0 checks.x86_64-linux.ext-pgjwt · build #133 · raw

unpackPhase
1unpacking source archive /nix/store/cijlkfxy6vfh6pbq2nd4v8pc51nxn75y-source2source root is source
configurePhase
3no configure script, doing nothing
buildPhase
4gcc -Wall -Wmissing-prototypes -Wpointer-arith -Wdeclaration-after-statement -Werror=vla -Wendif-labels -Wmissing-format-attribute -Wimplicit-fallthrough=3 -Wcast-function-type -Wshadow=compatible-local -Wformat-security -fno-strict-aliasing -fwrapv -fexcess-precision=standard -Wno-format-truncation -Wno-stringop-truncation -g -O2 -std=c11 -Werror -Wno-declaration-after-statement -fPIC -fvisibility=hidden -DEXTVERSION=\"0.14.0\" -I. -I./ -I/nix/store/dj25xabr71j1mmxf628lqsn61qd5qcyk-postgresql-17.11/include/server -I/nix/store/dj25xabr71j1mmxf628lqsn61qd5qcyk-postgresql-17.11/include/internal -D_GNU_SOURCE -I/nix/store/5nl2zr46dic7mxcw6cvbq85wa8c2gngh-libxml2-2.15.1-dev/include/libxml2 -I/nix/store/sl10j863s32x7dv5vw6wfx1nh22f3xh2-lz4-1.10.0-dev/include -I/nix/store/di94mxmhhk390zzzv2gvavfwkgww7q6h-zstd-1.5.7-dev/include -I/nix/store/h5hfqhzcqszmsacj26hh3fngwcal04zs-icu4c-75.1-dev/include -c -o src/core.o src/core.c5In file included from src/core.c:23:6In function 'init_curl_handle',7 inlined from 'consume_request_queue' at src/core.c:306:5:8src/errors.h:6:11: warning: call to 'Wcurl_easy_setopt_err_long' declared with attribute warning: curl_easy_setopt expects a long argument [-Wattribute-warning]9 6 | if (curl_easy_setopt(hdl, opt, prm) != CURLE_OK) \10 | ^~~~~~~~~~~~~~~~11src/core.c:120:7: note: in expansion of macro 'EREPORT_CURL_SETOPT'12 120 | EREPORT_CURL_SETOPT(curl_ez_handle, CURLOPT_POST, 1);13 | ^~~~~~~~~~~~~~~~~~~14src/errors.h:6:11: warning: call to 'Wcurl_easy_setopt_err_long' declared with attribute warning: curl_easy_setopt expects a long argument [-Wattribute-warning]15 6 | if (curl_easy_setopt(hdl, opt, prm) != CURLE_OK) \16 | ^~~~~~~~~~~~~~~~17src/core.c:121:7: note: in expansion of macro 'EREPORT_CURL_SETOPT'18 121 | EREPORT_CURL_SETOPT(curl_ez_handle, CURLOPT_POSTFIELDSIZE, 0);19 | ^~~~~~~~~~~~~~~~~~~20src/errors.h:6:11: warning: call to 'Wcurl_easy_setopt_err_long' declared with attribute warning: curl_easy_setopt expects a long argument [-Wattribute-warning]21 6 | if (curl_easy_setopt(hdl, opt, prm) != CURLE_OK) \22 | ^~~~~~~~~~~~~~~~23src/core.c:134:3: note: in expansion of macro 'EREPORT_CURL_SETOPT'24 134 | EREPORT_CURL_SETOPT(curl_ez_handle, CURLOPT_TIMEOUT_MS, cdata->timeout_milliseconds);25 | ^~~~~~~~~~~~~~~~~~~26src/errors.h:6:11: warning: call to 'Wcurl_easy_setopt_err_long' declared with attribute warning: curl_easy_setopt expects a long argument [-Wattribute-warning]27 6 | if (curl_easy_setopt(hdl, opt, prm) != CURLE_OK) \28 | ^~~~~~~~~~~~~~~~29src/core.c:136:3: note: in expansion of macro 'EREPORT_CURL_SETOPT'30 136 | EREPORT_CURL_SETOPT(curl_ez_handle, CURLOPT_FOLLOWLOCATION, true);31 | ^~~~~~~~~~~~~~~~~~~32gcc -Wall -Wmissing-prototypes -Wpointer-arith -Wdeclaration-after-statement -Werror=vla -Wendif-labels -Wmissing-format-attribute -Wimplicit-fallthrough=3 -Wcast-function-type -Wshadow=compatible-local -Wformat-security -fno-strict-aliasing -fwrapv -fexcess-precision=standard -Wno-format-truncation -Wno-stringop-truncation -g -O2 -std=c11 -Werror -Wno-declaration-after-statement -fPIC -fvisibility=hidden -DEXTVERSION=\"0.14.0\" -I. -I./ -I/nix/store/dj25xabr71j1mmxf628lqsn61qd5qcyk-postgresql-17.11/include/server -I/nix/store/dj25xabr71j1mmxf628lqsn61qd5qcyk-postgresql-17.11/include/internal -D_GNU_SOURCE -I/nix/store/5nl2zr46dic7mxcw6cvbq85wa8c2gngh-libxml2-2.15.1-dev/include/libxml2 -I/nix/store/sl10j863s32x7dv5vw6wfx1nh22f3xh2-lz4-1.10.0-dev/include -I/nix/store/di94mxmhhk390zzzv2gvavfwkgww7q6h-zstd-1.5.7-dev/include -I/nix/store/h5hfqhzcqszmsacj26hh3fngwcal04zs-icu4c-75.1-dev/include -c -o src/errors.o src/errors.c33gcc -Wall -Wmissing-prototypes -Wpointer-arith -Wdeclaration-after-statement -Werror=vla -Wendif-labels -Wmissing-format-attribute -Wimplicit-fallthrough=3 -Wcast-function-type -Wshadow=compatible-local -Wformat-security -fno-strict-aliasing -fwrapv -fexcess-precision=standard -Wno-format-truncation -Wno-stringop-truncation -g -O2 -std=c11 -Werror -Wno-declaration-after-statement -fPIC -fvisibility=hidden -DEXTVERSION=\"0.14.0\" -I. -I./ -I/nix/store/dj25xabr71j1mmxf628lqsn61qd5qcyk-postgresql-17.11/include/server -I/nix/store/dj25xabr71j1mmxf628lqsn61qd5qcyk-postgresql-17.11/include/internal -D_GNU_SOURCE -I/nix/store/5nl2zr46dic7mxcw6cvbq85wa8c2gngh-libxml2-2.15.1-dev/include/libxml2 -I/nix/store/sl10j863s32x7dv5vw6wfx1nh22f3xh2-lz4-1.10.0-dev/include -I/nix/store/di94mxmhhk390zzzv2gvavfwkgww7q6h-zstd-1.5.7-dev/include -I/nix/store/h5hfqhzcqszmsacj26hh3fngwcal04zs-icu4c-75.1-dev/include -c -o src/event.o src/event.c34In file included from /nix/store/wflnb8fxmq4lqx3ca91hlpv95vrqkv51-curl-8.17.0-dev/include/curl/curl.h:3333,35 from /nix/store/wflnb8fxmq4lqx3ca91hlpv95vrqkv51-curl-8.17.0-dev/include/curl/multi.h:51,36 from src/event.h:4,37 from src/event.c:6:38/nix/store/wflnb8fxmq4lqx3ca91hlpv95vrqkv51-curl-8.17.0-dev/include/curl/multi.h:429:23: error: expected identifier or '(' before '__extension__'39 429 | CURL_EXTERN CURLMcode curl_multi_setopt(CURLM *multi_handle,40 | ^~~~~~~~~~~~~~~~~41/nix/store/wflnb8fxmq4lqx3ca91hlpv95vrqkv51-curl-8.17.0-dev/include/curl/multi.h:429:23: error: expected identifier or '(' before ')' token42 429 | CURL_EXTERN CURLMcode curl_multi_setopt(CURLM *multi_handle,43 | ^~~~~~~~~~~~~~~~~44make: *** [<builtin>: src/event.o] Error 1