pg_net-0.19.5
checks.x86_64-linux.ext-pg_repack
· build #133
· raw
unpackPhase
1unpacking source archive /nix/store/5zgdqy3bz93jyn79pizxc1hks0cdcadw-source2source root is sourceconfigurePhase
3no configure script, doing nothingbuildPhase
4gcc -Wall -Wmissing-prototypes -Wpointer-arith -Wdeclaration-after-statement -Werror=vla -Wendif-labels -Wmissing-format-attribute -Wimplicit-fallthrough=3 -Wcast-function-type -Wshadow=compatible-local -Wformat-security -fno-strict-aliasing -fwrapv -fexcess-precision=standard -Wno-format-truncation -Wno-stringop-truncation -g -O2 -std=c11 -Wextra -Wall -Werror -Wno-declaration-after-statement -Wno-vla -Wno-long-long -Wmissing-variable-declarations -fPIC -fvisibility=hidden -DEXTVERSION=\"0.19.5\" -I. -I./ -I/nix/store/dj25xabr71j1mmxf628lqsn61qd5qcyk-postgresql-17.11/include/server -I/nix/store/dj25xabr71j1mmxf628lqsn61qd5qcyk-postgresql-17.11/include/internal -D_GNU_SOURCE -I/nix/store/5nl2zr46dic7mxcw6cvbq85wa8c2gngh-libxml2-2.15.1-dev/include/libxml2 -I/nix/store/sl10j863s32x7dv5vw6wfx1nh22f3xh2-lz4-1.10.0-dev/include -I/nix/store/di94mxmhhk390zzzv2gvavfwkgww7q6h-zstd-1.5.7-dev/include -I/nix/store/h5hfqhzcqszmsacj26hh3fngwcal04zs-icu4c-75.1-dev/include -c -o src/core.o src/core.c5gcc -Wall -Wmissing-prototypes -Wpointer-arith -Wdeclaration-after-statement -Werror=vla -Wendif-labels -Wmissing-format-attribute -Wimplicit-fallthrough=3 -Wcast-function-type -Wshadow=compatible-local -Wformat-security -fno-strict-aliasing -fwrapv -fexcess-precision=standard -Wno-format-truncation -Wno-stringop-truncation -g -O2 -std=c11 -Wextra -Wall -Werror -Wno-declaration-after-statement -Wno-vla -Wno-long-long -Wmissing-variable-declarations -fPIC -fvisibility=hidden -DEXTVERSION=\"0.19.5\" -I. -I./ -I/nix/store/dj25xabr71j1mmxf628lqsn61qd5qcyk-postgresql-17.11/include/server -I/nix/store/dj25xabr71j1mmxf628lqsn61qd5qcyk-postgresql-17.11/include/internal -D_GNU_SOURCE -I/nix/store/5nl2zr46dic7mxcw6cvbq85wa8c2gngh-libxml2-2.15.1-dev/include/libxml2 -I/nix/store/sl10j863s32x7dv5vw6wfx1nh22f3xh2-lz4-1.10.0-dev/include -I/nix/store/di94mxmhhk390zzzv2gvavfwkgww7q6h-zstd-1.5.7-dev/include -I/nix/store/h5hfqhzcqszmsacj26hh3fngwcal04zs-icu4c-75.1-dev/include -c -o src/errors.o src/errors.c6gcc -Wall -Wmissing-prototypes -Wpointer-arith -Wdeclaration-after-statement -Werror=vla -Wendif-labels -Wmissing-format-attribute -Wimplicit-fallthrough=3 -Wcast-function-type -Wshadow=compatible-local -Wformat-security -fno-strict-aliasing -fwrapv -fexcess-precision=standard -Wno-format-truncation -Wno-stringop-truncation -g -O2 -std=c11 -Wextra -Wall -Werror -Wno-declaration-after-statement -Wno-vla -Wno-long-long -Wmissing-variable-declarations -fPIC -fvisibility=hidden -DEXTVERSION=\"0.19.5\" -I. -I./ -I/nix/store/dj25xabr71j1mmxf628lqsn61qd5qcyk-postgresql-17.11/include/server -I/nix/store/dj25xabr71j1mmxf628lqsn61qd5qcyk-postgresql-17.11/include/internal -D_GNU_SOURCE -I/nix/store/5nl2zr46dic7mxcw6cvbq85wa8c2gngh-libxml2-2.15.1-dev/include/libxml2 -I/nix/store/sl10j863s32x7dv5vw6wfx1nh22f3xh2-lz4-1.10.0-dev/include -I/nix/store/di94mxmhhk390zzzv2gvavfwkgww7q6h-zstd-1.5.7-dev/include -I/nix/store/h5hfqhzcqszmsacj26hh3fngwcal04zs-icu4c-75.1-dev/include -c -o src/event.o src/event.c7In file included from /nix/store/wflnb8fxmq4lqx3ca91hlpv95vrqkv51-curl-8.17.0-dev/include/curl/curl.h:3333,8 from /nix/store/wflnb8fxmq4lqx3ca91hlpv95vrqkv51-curl-8.17.0-dev/include/curl/multi.h:51,9 from src/event.h:4,10 from src/event.c:6:11/nix/store/wflnb8fxmq4lqx3ca91hlpv95vrqkv51-curl-8.17.0-dev/include/curl/multi.h:429:23: error: expected identifier or '(' before '__extension__'12 429 | CURL_EXTERN CURLMcode curl_multi_setopt(CURLM *multi_handle,13 | ^~~~~~~~~~~~~~~~~14/nix/store/wflnb8fxmq4lqx3ca91hlpv95vrqkv51-curl-8.17.0-dev/include/curl/multi.h:429:23: error: expected identifier or '(' before ')' token15 429 | CURL_EXTERN CURLMcode curl_multi_setopt(CURLM *multi_handle,16 | ^~~~~~~~~~~~~~~~~17make: *** [<builtin>: src/event.o] Error 1