setup
checks.x86_64-linux.ext-pg_repack
· build #133
· raw
1these 139 derivations will be built:2 /nix/store/0ghzb9i3wrf3s927kg39aa01cd1lm0ic-pgtap.drv3 /nix/store/43hrszb68idmxn0cyb83axyaiv1rlrh9-pg_stat_monitor.drv4 /nix/store/5ym865yyw3zws7gm6xnncdb2715wa2h4-supabase_vault.drv5 /nix/store/6xiqjskc06w7z35k5pacs4276hqawiww-timescaledb.drv6 /nix/store/76skdlc74q1hgpkqqj7zk9fsm4wh4hl5-pgrouting.drv7 /nix/store/5v6a4ssacxc4snck5dzagkmqhcsh2swz-pg_net-0.19.5.drv8 /nix/store/7b5ar71808xp6cc9vi64vcr3gxhaq9w2-pg_net-0.14.0.drv9 /nix/store/82vkrfmb1h23wpf7jvwwb1r82vfiqb7w-pg_net-0.8.0.drv10 /nix/store/fs82kzwwqc58qma6aiyaljkngq7g3y4z-pg_net-0.20.3.drv11 /nix/store/ggfg6al5fkdp0r1jsc3iabgz0p7g6l1m-pg_net-0.7.drv12 /nix/store/hfwkzpr1kplwaywhvayqm6j4gsva8n5n-pg_net-0.20.0.drv13 /nix/store/nf025wlsx99h5f5yjmkj9wrj54ifbzad-pg_net-0.7.1.drv14 /nix/store/ymx9gp4jhvd7qpjvk95vw2m6ycb0jal7-pg_net-0.13.0.drv15 /nix/store/94hi7qqfg86lfxqnyqizx334my0yjbh3-pg_net.drv16 /nix/store/a1v4diwd4c9632zv93sjh9ab3b042mnr-pg_hashids.drv17 /nix/store/aimjdqqfyl4laxlkpc6gfnyvlsbxlvcv-pg_repack.drv18 /nix/store/az25v409jh9k6133nsy8i8brvfc21nw5-pg_graphql.drv19 /nix/store/b8z393jnpighs0xp0wn572slxhxhwnxp-pg_partman.drv20 /nix/store/cqki7rv2w3vxrsajqy279mhm5wa88fjp-wal2json.drv21 /nix/store/h5q13dsfp2bfp3ydgj9vdnx6fmnyfl2z-hypopg.drv22 /nix/store/ixv7i4skcbnzgym04khdnvkqa513ld45-plan_filter.drv23 /nix/store/j06p7y4xc647bfzs8ba58rf9h0ilbz44-pgmq.drv24 /nix/store/jrggalwa5kfhzqhcip8f5g1f584pazw5-plpgsql_check.drv25 /nix/store/l4slq9wyfag2892w5zrycrzy3z7kpv2p-pgaudit.drv26 /nix/store/lzgjq8v4l4vm5lwyxkllg0ii0n1vvam6-http.drv27 /nix/store/pjhzv6b54gh758msf91ibg3aggs5v63y-safeupdate.drv28 /nix/store/pwyqyi1k7a59b2jnwr875426synr7qmi-pg_cron.drv29 /nix/store/qfh9m6hmvdh3axd43qraz43rrjs2pjzr-pgsodium.drv30 /nix/store/qvw78yhywxdh6c8gky9qmdaxwka0hkyg-pgroonga.drv31 /nix/store/rcl303fv0rxrbkgjcwqi92h8hlsksl86-plv8.drv32 /nix/store/v38577cf27cjada1fbai6jc2gqc1yqg9-pg_jsonschema.drv33 /nix/store/w76pb8iwp6gmij6ng0xyxbdwpyp31gjx-vector.drv34 /nix/store/w8w3j8l9i3fwp8lvrddpz6szlbsz1b80-wrappers.drv35 /nix/store/wby05b23yks4smfxxdngav8mxnv4pvvi-index_advisor.drv36 /nix/store/x1gi2mwklg858vqaswbqasg3gnzfclyk-pgtap.drv37 /nix/store/ypgp6sck1rcalskz253f3a3g2vg8dqxn-postgis.drv38 /nix/store/zpy0anvh5rgr1fnrs39j7db1j07adpip-rum.drv39 /nix/store/a5gfyj0k47cxv70v4a1zhhk1998vd290-postgresql-and-plugins-15.19.drv40 /nix/store/69zc44dp9979jf4p9hcpgfdf1wgpw40l-postgresql-and-plugins-15.19.drv41 /nix/store/1nyr8hxhdprfgmxj3y07r35vb4vwpcbc-pgrouting.drv42 /nix/store/25f3g4qlwjv87pi5nckr9mr5901kwr9v-pg_jsonschema.drv43 /nix/store/2z9gqy2kdcqh0l3s21fdvaiwji4bw085-wrappers.drv44 /nix/store/5qbkncy11hxa3hjvxlivyk5jl56cqaca-pgroonga.drv45 /nix/store/67j8ga6fwaypskbxhllbgq14gg17lbgv-plpgsql_check.drv46 /nix/store/a1l87bw0qg8qb986f3iw25zbq2bh1kxl-wal2json.drv47 /nix/store/yrw0zf2hhdw02ib8y80blp0wyckv5j63-hypopg.drv48 /nix/store/fpx02gfczpp7gcdldgabjzhc7pj2b3yq-index_advisor.drv49 /nix/store/g8h2i50jjjbj01nf9na2hjc5p8jilfwq-vector.drv50 /nix/store/g9clk05ymhqn7csk59fpd1iksabh2vp2-safeupdate.drv51 /nix/store/h5axh42309k5kr942f64rxkr35s86nhm-pgtap.drv52 /nix/store/izcyq3yalzyqj7np7qbzynzk3k2ly0bi-supabase_vault.drv53 /nix/store/mdaxp5nsyc1yzfzmbyblarpc0sh9wwap-pg_graphql.drv54 /nix/store/mh8gnpab20pmx5vf0y4mckhswgh49akd-pgaudit.drv55 /nix/store/nx9fmd9gmal97jp7jj7j58hq3a79wdk5-http.drv56 /nix/store/q1dbay5va74kwxzxl0mj6q02899srnx1-plan_filter.drv57 /nix/store/r4vfiabbhgs1g8sj39raqak5w0yz6ks3-pgsodium.drv58 /nix/store/vav4ka95wh6pa1gfmjwqs55zwsg6rbvv-pg_partman.drv59 /nix/store/vgh7yrjnkl0nxm6bv1ssagw53l2zp28w-rum.drv60 /nix/store/ynlanaj7crkl24nh9bi8j5j1yfy8s729-postgis.drv61 /nix/store/zcn7i7hc0lsa7klrz0i0hqlvl695b524-pg_cron.drv62 /nix/store/8zk04h4lfkvx9n3w77wvzxpr6kns48ff-pg_net-0.20.3.drv63 /nix/store/bv2b3hyfiwg59frhybs6cmf9l26byfrs-pg_net-0.13.0.drv64 /nix/store/dxjxg15c0m6vdgy5yswqbm50g4fww2p1-pg_net-0.14.0.drv65 /nix/store/jvalwdcdi2ci9kcx1q2zx6hyla1sa738-pg_net-0.20.0.drv66 /nix/store/v7i610b6q10zpsd2536yvba9pd2xqrr6-pg_net-0.19.5.drv67 /nix/store/zd0hg58y5nwnnwfzy7sd19l7dzx4zvv5-pg_net.drv68 /nix/store/zfqi9c6lx1cs0kby458nlnhvvhhzml2c-pg_repack.drv69 /nix/store/zqvrbpa8h1rmsal3b4r8jphaqwycja93-pg_tle.drv70 /nix/store/m7073j3kxn6vxs53jdm448q51cxiimys-postgresql-and-plugins-17_22.drv71 /nix/store/q8qv7gf9izi4my9mjapggg0fx2dhzlwc-postgresql-and-plugins-17_22.drv72 /nix/store/ggzwf7y9bbwypxs8a44lg59dd3cbp5k5-system-path.drv73 /nix/store/7mf1lcyklc71a89s4mi3r7w8k39ihvya-dbus-1.drv74 /nix/store/wd8irv2ffhnmkp1bdcqcf4x5nyhapq43-X-Restart-Triggers-dbus.drv75 /nix/store/2i01a9qxfbdjlvkl937aq52x148dm5hk-unit-dbus.service.drv76 /nix/store/6axq4j62rji3faz7rvgyjfccczni7z3n-user-units.drv77 /nix/store/y85ggf9qcv7hsaxx3fyr5a14nf67953g-postgresql-orioledb-init.drv78 /nix/store/6dmfl5hj72ck728kvz45gg2241dk81ci-unit-postgresql.service.drv79 /nix/store/9hia6rkh5qzm30dxyfjihl6251cmnv0l-unit-dbus.service.drv80 /nix/store/7p4sg9x4d75pncaxpl0sa51ja5k2bik8-supabase-orioledb-db-init.drv81 /nix/store/dadjlp1c0v94bsq44xmi8yl99z9dwd3n-unit-supabase-db-init.service.drv82 /nix/store/nnswm02aq5rs1v3j77dlnha5mh5c19z7-system-units.drv83 /nix/store/dys7bm2r3m1f5zv7a66ajhqdsxph4zlw-etc.drv84 /nix/store/0mzm2f6fa46w1xld4wk2fb47gg0spks1-activate.drv85 /nix/store/yr25cab0bgg2gdcjr0fkk052aqw4ag84-postgresql-init.drv86 /nix/store/18idp8l89ga0vbjdvp5y33m42h8ypb3n-unit-postgresql.service.drv87 /nix/store/1h355q36hw8cd3dpsd4ydrb2f3mzpq37-rum.drv88 /nix/store/1qxq6npfmh7zfj0qs2ld3a1fpd0sbr7k-pg_repack.drv89 /nix/store/27vwnz41d4gqgak7jrw25h6myicnpc9g-pg_hashids.drv90 /nix/store/sn90bhb87fs1r7szfvpnhakcf5cbqipi-system-path.drv91 /nix/store/rnjj94ch4qaxpyhgvk900hq1rp2ji4cx-dbus-1.drv92 /nix/store/bj8k3q4xx5yxsjpcz0k6pjkann65ifyp-X-Restart-Triggers-dbus.drv93 /nix/store/ljfzjxqwx4kxjwxjjlnpaqdzh0xqd7xr-unit-dbus.service.drv94 /nix/store/jphjq6s3xb6lm1r9a0yllq3wvcijkikd-user-units.drv95 /nix/store/9dhmhlajdjqsz58msmq42lwanwgk4c0z-supabase-db-init.drv96 /nix/store/9189fi92i7805xz024zxxwljw2xfqplf-unit-supabase-db-init.service.drv97 /nix/store/ks9rz4w18q5w6apnl8bszi42p6fqb7w9-unit-dbus.service.drv98 /nix/store/w29pxvjbvdmyac5wz16l2kakq9n2w4dn-system-units.drv99 /nix/store/5i64fsbcnqkbbwyscs590q4x0kckm8vz-etc.drv100 /nix/store/f3zaq5gia1p450hfwx1a5ka9b2crwvpc-activate.drv101 /nix/store/flpw9rfcwf20596nm3x5g91lj4wx6gsa-nixos-system-server-test.drv102 /nix/store/8rlk8y0giv6av6yxjvain89wy868fxzw-postgis.drv103 /nix/store/baf8b2gs6va3sk7kjdxlm4h721szjhmq-pgmq.drv104 /nix/store/h3jfznl8xhwm8wvvxg23yj74srzz3vii-pg_net-0.19.5.drv105 /nix/store/jdx62c5jlcjxsbqjaqi25zwfy2ys9jp5-pg_net-0.13.0.drv106 /nix/store/ky294hja2giinx8655lj1d83j4jq5gjj-pg_net-0.14.0.drv107 /nix/store/ky7414m088qm5h8xn9z7xzw0k08wgcrh-pg_net-0.20.0.drv108 /nix/store/cqdc5q7n6g9pkxy0cjcvkq185rps4bfd-pg_net.drv109 /nix/store/i9c59glkkfckl8igi51prmm5q8q0l9ii-wrappers.drv110 /nix/store/jdxl52i1wbdwgwrddbbq6jk3dy1rsih5-pg_stat_monitor.drv111 /nix/store/kjb0q84944pahkp1dirilg67gg7knp0i-plan_filter.drv112 /nix/store/mp12r50yfdkn8dm3j6icsav4pddpq7ix-pgaudit.drv113 /nix/store/mqhnafzmjc615s8r65m33p2l62pf5kvi-pg_tle.drv114 /nix/store/pp6iq08yhjcnrm9cpgfn8bnlskbj452w-pgroonga.drv115 /nix/store/rqsiiiadw0ryddm9sb0qa26d8c6xzsis-http.drv116 /nix/store/vjn7gz0pab3nkxs3klbqdbi8j68v291p-pgrouting.drv117 /nix/store/xibm7yh8fni2maxnqscqm8mmsswpv9nb-plpgsql_check.drv118 /nix/store/z1c8kqi7q1ixgzsnw9i726rj3jk14b9v-wal2json.drv119 /nix/store/zssagmq5hk8vpnc9iw1q905bpj0jnrfr-vector.drv120 /nix/store/d5s4s970iizz6a8w5ndnpzyw63w1m1qv-postgresql-and-plugins-17.11.drv121 /nix/store/7hla3p20yajypj5w3hnrx38bc3kq14vq-postgresql-and-plugins-17.11.drv122 /nix/store/rp3411xgkcmbnrvxwgg7kxxlhj217519-system-path.drv123 /nix/store/jwcb2kgwrcwds3m6z7byrg26qackyaxf-dbus-1.drv124 /nix/store/hkbib28lgy3sdk60wwh6fnjx17lrpkd0-X-Restart-Triggers-dbus.drv125 /nix/store/zbb4xyx08cfb7d20vxf6chbzvcw94xva-unit-dbus.service.drv126 /nix/store/6w9n69ddwya8kjxyrz8n8p48cnhhv8m2-user-units.drv127 /nix/store/a0nhwyhawfp54kccbpjcvlkybsc46m66-unit-dbus.service.drv128 /nix/store/vl4z7w7y2dciycqgcm6qp86dpgddrqgg-unit-postgresql.service.drv129 /nix/store/319yam8jpgm13yfxs5psx2g1j4zd346h-postgresql-migrate.drv130 /nix/store/xvpj8kcdwibf0zb3lvh74lg9sn132fb6-unit-postgresql-migrate.service.drv131 /nix/store/bk16kzbxqyyqfg6qlmkplrgfhv7k21kl-system-units.drv132 /nix/store/yigqx2853rhqfbmrfci5bzld6c089mrd-etc.drv133 /nix/store/9i17zb3islwpb2pj7iwsw6d08gv9zdi2-activate.drv134 /nix/store/imr0jfl9r75i4l9br1zkqw4li7qls97p-nixos-system-server-test.drv135 /nix/store/zn5pqckvabyvbj8b760an4hwnbp3x1vx-nixos-system-server-test.drv136 /nix/store/l3g0a20fmxqmkdp4radxq4r3xd5jwzjy-closure-info.drv137 /nix/store/q1smldjprgklvy119fkq6b38a23idjc4-run-nixos-vm.drv138 /nix/store/c0y8vb21y52ps11vi8ajzkqyvl7dd7nz-nixos-vm.drv139 /nix/store/2ajcsich9vapbnvfc28pn3di54v0sq9x-nixos-test-driver-pg_repack.drv140 /nix/store/cqiimg6qbcnqf3pkis23iz8f438m4v37-vm-test-run-pg_repack.drv141these 135 paths will be fetched (832.1 MiB download, 3.8 GiB unpacked):142 /nix/store/c77xlgvnnpq61qxm7g7016n6vw2348kk-gdal-3.8.5143 /nix/store/nlxfcaijdj4zf96lcs8jsn0q25yxgsxh-gdal-3.8.5144 /nix/store/pc5dj3mqbky9j88mhl9v6xjbx0q834jh-gdal-3.8.5145 /nix/store/b9vigjjmwmcr7mpsmhsi981qxglh8ndc-http-1.6.1146 /nix/store/mpj00iv7wh4sdfrfz8v1r1r5949cbh34-pg_graphql-1.5.9147 /nix/store/nv72nnsp1ylrk4aag2sr16vsd18y59g9-pg_graphql-1.5.9148 /nix/store/1vkglc00z5sixzbpa8m4avxkwyxr5gxv-pg_graphql-1.6.1149 /nix/store/aqybi8yvcn58h68i065z2hmfwfcvsylb-pg_graphql-1.6.1150 /nix/store/x9b30afbr5ihqk34xp7b173vy9kz1bxh-pg_graphql-1.6.2151 /nix/store/ygq8815kdhr2gxvkrxc5cfaph6c6c7a1-pg_graphql-1.6.2152 /nix/store/qvps4cbvh5ivrbrgls8hybcx5jiyqxmi-pg_repack-1.4.8153 /nix/store/yq285d17sghzlchc9b5kwwi8mnnjz1zl-pg_repack-1.4.8154 /nix/store/50vlc8927fxbwbp7vndf3f1cs2z3vzqf-pg_repack-1.5.0155 /nix/store/c73wvy3iz85fpg2a9i3b0gwl8n4gcwrl-pg_repack-1.5.0156 /nix/store/b1lf5yx9a9ayz2csv73vm79xi7yj8hbp-pg_repack-1.5.1157 /nix/store/ikpbqpw667jjfjrvbkdya39m197q3zl0-pg_repack-1.5.1158 /nix/store/sdn74bzm21xz2f9w2l4jzlk3kmd4kviz-pg_repack-1.5.2159 /nix/store/y78xmqz8yjxssyk5g1x3qrdfsgmbyn0n-pg_repack-1.5.2160 /nix/store/addibh318db5yxinwy8546y4l50h752j-pgaudit-1.6.1161 /nix/store/cd41zl0bs426c7z4lmr666ycl9dmmybh-pgaudit-1.7.0162 /nix/store/cslxh5r6pfb44i056x3rsdnn6m72yhzk-pgaudit-1.7.1163 /nix/store/1py8rr1lnxvm1y3kl3k6vrqc89ga4pkv-pgaudit-17.0164 /nix/store/c3h5qqxj3f661jd41qkws7qdklm8daqm-pgaudit-17.0165 /nix/store/hd3qc5va0av1w0r26ilxvjaj335kjmc8-pgaudit-17.1166 /nix/store/i7q1amsnccv1r3dam5m3hinfgyms6k31-pgaudit-17.1167 /nix/store/8sn9mcj1dl7493ia6dgqr7dk6k345v36-pgroonga-3.0.7168 /nix/store/5k4368w675sgqd6fpxf8gp7chjk08j8g-pgroonga-3.2.5169 /nix/store/6r8rfychwnaxhc6s80drafb8lw2vg7lv-pgroonga-3.2.5170 /nix/store/cxkwj22k0v7k06bw9ljgdzs1frklqi3q-pgroonga-3.2.5171 /nix/store/09i48zwx3h04ax1h7rfrrdw4fzd2i8pj-pgrouting-3.4.1172 /nix/store/bmxiqr1pkrcyv982fpjpp4sw4pmhrlkz-pgrouting-3.4.1173 /nix/store/cl3v2hc1cdfvyngjzklmxipfbxm2pcrw-pgrouting-3.4.1174 /nix/store/pw71ikfs0cw5ndx1b3x3pbn7y1wi39am-pgsodium-3.0.4175 /nix/store/z9gcwl92rxi2ab4mckkpjxfgnbr3nnia-pgsodium-3.0.4176 /nix/store/j24k690yp9jyjladi76lvllw1wzaqwan-pgsodium-3.1.5177 /nix/store/l4b4xsxxiqpn4pwwns89y4255wh2jii9-pgsodium-3.1.5178 /nix/store/assmprqh03pjzdxgyivvsi191h5zxm9l-pgsodium-3.1.6179 /nix/store/hnnzrsqml0nil5xriwh5ng60a27lkj6w-pgsodium-3.1.6180 /nix/store/3qm2q68nmim3i60bljczzy26s0lgkwfr-pgsodium-3.1.7181 /nix/store/xin42rjakyjh2rndzlb2prf55ayn5fc3-pgsodium-3.1.7182 /nix/store/5v2wmpbf55lhh8j5zdx0k6k2pi51lgny-pgsodium-3.1.8183 /nix/store/7049xir17j7vyf6h34qiwz62qh0bynvd-pgsodium-3.1.8184 /nix/store/3vr1kkxiz8x52x8j1h29ylc1w0l1qm07-pgtap-1.3.1185 /nix/store/l8lf1zklikyr97rnff38d8584vw8b43f-pgtap-1.3.1186 /nix/store/z35zmdmzh8q22cvhnjrm2yv65nadb626-pgtap-1.3.1187 /nix/store/b2jcp56jc84mbr9iwccdimphbzb3fsf7-plpgsql_check-2.2188 /nix/store/ad6sm96mja4h2wc7mmbnsr9lk0biwx4f-plpgsql_check-2.7189 /nix/store/yk882rxplwl9d7szypyfbmg7ymv3a3jx-plpgsql_check-2.7190 /nix/store/zk6yzlkx47z6wc38rydxx8wjhkwx87nl-plpgsql_check-2.7191 /nix/store/15sy169848i2q1l48l4fsjf1kwhnblrm-plpgsql_check-2.8192 /nix/store/62x28v1m7p3qp6cv70myrslb222g95dq-plpgsql_check-2.8193 /nix/store/p3mp4krgm398nd48za0amjc5zwwgjsip-plpgsql_check-2.8194 /nix/store/55z1jd1xiw410x3716xi54k7ncvc6278-plv8-3.1.4195 /nix/store/hzrrqdw8nk6b1dbv3gpkncdxrq3vpyhj-plv8-3.1.5196 /nix/store/g5ck6ih86l3ic3ixpkvz81mng62krw8w-postgis-3.3.2197 /nix/store/dlk1ad33d0vh9q3171zfqxlixbjz4c7f-postgis-3.3.7198 /nix/store/nrrx8589qpxarqcnxxk7yfssqc2bs45d-postgis-3.3.7199 /nix/store/l2rxnjwwmjxr8d80z549fkb1p7z2iwbi-rum-1.3200 /nix/store/m64jqg5dmhgqk68zpxc1jg2l8zdq1591-rum-1.3201 /nix/store/ydfs8hxzypxrd1dkvdm5wvp4snllhf9k-rum-1.3202 /nix/store/nanv8c5jrkhq6dcaqgws29ybaar963zp-safeupdate-1.4203 /nix/store/7ifylarp5igsk3wpkxyscmr5khpgxh0d-sfcgal-2.2.0204 /nix/store/x26gjcpyyj9l2akpzhbc1m3031diwl6y-supabase_vault-0.2.8205 /nix/store/2s3j6b063cjk3lpl97wzfrgdnpxpismg-supabase_vault-0.3.1206 /nix/store/mpc7a5x6ylswpax126jf68w4vmkcynjy-supabase_vault-0.3.1207 /nix/store/bjdirzmp9zqha717va1h7qi0pc0llhl8-timescaledb-2.16.1208 /nix/store/7z4lnnwasjc5ckf03ka1zxp6lkwcgjjw-timescaledb-2.9.1209 /nix/store/p7km1d2pimq5g2cp0nbk358v6rvvf8xx-vector-0.4.0210 /nix/store/8dic511dbfddsswj6zq2fn3wb23aqvrm-vector-0.5.1211 /nix/store/nc39b3mnv97xqvw3nlrqidmmnmwf1v4w-vector-0.5.1212 /nix/store/qhad04j8qa3ncr8flbcd9l26q3xxlm8p-vector-0.5.1213 /nix/store/4iv3z6p9pwq6fzm93m99fjd8ys8l7shw-vector-0.6.0214 /nix/store/fhb6ygrfmyy3mis40ccqab1g1ifdsg71-vector-0.6.0215 /nix/store/j0isrpx08xfrb02q1r7rfzzszm2ify1n-vector-0.6.0216 /nix/store/545zc19a8pq380pllc153a7d10mb48qa-vector-0.6.2217 /nix/store/b88i29hws1g9k2h0as8yqvvwigjjywqp-vector-0.6.2218 /nix/store/bzdrz47dwwl4b74r6q6b2zaqlvvxl7yx-vector-0.6.2219 /nix/store/2q0wdsj5gbsxfn496wzsyw3n6m9gh4j8-vector-0.7.0220 /nix/store/iqmhjwddxkyadi9q6l8h2qn3rax63zr3-vector-0.7.0221 /nix/store/lvs2hp1frsyi20fk8wbcrn6fld2xxwg3-vector-0.7.0222 /nix/store/nx3d3vcsmjqnmzyhqfa8wp65wgf41xl7-vector-0.7.4223 /nix/store/pna4jd7vy6k0rs595fqr32105j21859s-vector-0.7.4224 /nix/store/xakinwps0rpc7kkcl2ll6mfmhnwkm7az-vector-0.7.4225 /nix/store/1bsy8n42glczbkpznbznfznb0fxvfv3m-vector-0.8.0226 /nix/store/d4y0adaf5wslnvccjzdzbs71c3rcnx6k-vector-0.8.0227 /nix/store/xywif7hw5h5ba5bnvdvb022dl3c4rghi-vector-0.8.0228 /nix/store/42s9wyq6qykv8g53mfamblzpywpz6x0n-vector-0.8.2229 /nix/store/4mwrnmmmm5krv7hp3fwvanll55gfkmac-vector-0.8.2230 /nix/store/7cklm7mvkqshfvklp8pvvgvy20n6f8sc-vector-0.8.2231 /nix/store/62hr05yh72x91pwbryhgiwwb1vw9jncd-wal2json-2.6232 /nix/store/n19730h9wyrfcnj4x8gjvhaknc95i895-wal2json-2.6233 /nix/store/q40ph33v5z8ibjgv3rwjs1lsgb49y2ax-wal2json-2.6234 /nix/store/pbxj5bz7s4bhwylxbjzyjh02y5rybfyr-wrappers-0.3.0235 /nix/store/n2n10ww41kzpmbp6l06n7hh7g29fdz83-wrappers-0.4.1236 /nix/store/k33zl01mjhqjzjwrvdny4avm9g9qp496-wrappers-0.4.2237 /nix/store/0ny88s7hix1m40srp6x9268w6y2al75z-wrappers-0.4.3238 /nix/store/4qckiynpgxdp32czp3l39gzj479qa2vw-wrappers-0.4.4239 /nix/store/i6pp882w31vpn0hmb02080ay7r0imjq9-wrappers-0.4.4240 /nix/store/jcnwsjsm9gj9as3ws5aa7h925kjyr5hv-wrappers-0.4.4241 /nix/store/9mbppswb56zvld9d1gcjy72d2cp11ysn-wrappers-0.4.5242 /nix/store/aynrlrxq94r9pn1kswsprn31vzyzhk0v-wrappers-0.4.5243 /nix/store/b4ykcbp3mfwsdgwmrpm7qyibqfvhq1xr-wrappers-0.4.5244 /nix/store/0v7fkf0vw37c4f5zr4f4bz2qbhn1cqv1-wrappers-0.4.6245 /nix/store/nx27x8nn1wj883hn2l6gr08m8l5d3z2i-wrappers-0.4.6246 /nix/store/xjxsjj1nj61lb12cr3i9r5wprmpfjrh6-wrappers-0.4.6247 /nix/store/r12xlkig3q1yq8wygr0liqayvz5vrjsn-wrappers-0.5.0248 /nix/store/r44rls58zldj08syhz67sbcl7rpagbkf-wrappers-0.5.0249 /nix/store/rq4ycpi3amjv916572zv5x0khq5wvdjd-wrappers-0.5.0250 /nix/store/79q2wmjs4yvlbdncmdk79685viv3qpmv-wrappers-0.5.3251 /nix/store/lx7c3rzc9vcyhh3dk5sxdcjxjhvlnl0s-wrappers-0.5.3252 /nix/store/ss8rk4ak5hsj1k6awkhcxzrilpz73h27-wrappers-0.5.3253 /nix/store/fpcpk0p0xp411f35nxrzahrq2mwsgfvx-wrappers-0.5.4254 /nix/store/ipqn16y4b5i9cnmx1vc8z9jys1z28lg5-wrappers-0.5.4255 /nix/store/n7dj8dkgh4h26mfx1nzannwrya0kjqhf-wrappers-0.5.4256 /nix/store/chvgw364xjxkgnlrxlmhvyk0gnqljy9f-wrappers-0.5.5257 /nix/store/hhfb45mbbm9d4y14gjrysggjn1cygryd-wrappers-0.5.5258 /nix/store/hqfhk0h4rj0vqh1vkm561waxly6cc7w1-wrappers-0.5.5259 /nix/store/lxcylrr0hj3chx5gbnf1lq4pp49gsm4g-wrappers-0.5.6260 /nix/store/r89q9xp7rn48w6mhasmc15bc7msaah6z-wrappers-0.5.6261 /nix/store/zzfhj6g9mf135i7m18p3h7wvpm19h5zz-wrappers-0.5.6262 /nix/store/hj2wcbblrszjmm89w39x9bigw7i563sw-wrappers-0.5.7263 /nix/store/rpadycy2fl2da1wl8wy0897yfhb2wjfc-wrappers-0.5.7264 /nix/store/ws55h1zcbaf95aqcx1cax86jqa9lr3c6-wrappers-0.5.7265 /nix/store/d6knx45df8lnnb5i12flnkkbpb3vhagh-wrappers-0.6.0266 /nix/store/jf2k5r36x51fcbw987xbwvk47qaaw68z-wrappers-0.6.0267 /nix/store/kqgyk1gz07nfphc66dx8a61gmbdvnkyy-wrappers-0.6.0268 /nix/store/3kl1dhpvskh4jx6nmqwi1bycb673pcwi-wrappers-0.6.1269 /nix/store/3vij4q3rchzcg30l4z6sazhzb4s9sr13-wrappers-0.6.1270 /nix/store/nv1r7alrkp4mnq6j6l2w641dmqsac8cl-wrappers-0.6.1271 /nix/store/an7kvlc76daf1cq5qygcnccm1hv74dc1-wrappers-0.6.2272 /nix/store/dw4b1ffjps5i8aqccdjyjcr6qkvf7865-wrappers-0.6.2273 /nix/store/ns5s2hrc8gvlnmpg4ngzkn90nmx7h7rd-wrappers-0.6.2274 /nix/store/22gbgsj3izxjmqqzv3194j04k1z9xbgg-wrappers-0.6.3275 /nix/store/36nx0n9iavpzspp1r2kn3db434z9hd44-wrappers-0.6.3276 /nix/store/mkylxmc3h6cmd562l020y55q8nmh80nl-wrappers-0.6.3277error: Cannot build '/nix/store/jdx62c5jlcjxsbqjaqi25zwfy2ys9jp5-pg_net-0.13.0.drv'.278 Reason: builder failed with exit code 2.279 Output paths:280 /nix/store/z8m2csva6bci9vlabgjm2wqd19ww393d-pg_net-0.13.0281 Last 25 log lines:282 > | ^~~~~~~~~~~~~~283 > src/util.h:6:11: warning: call to 'Wcurl_easy_setopt_err_long' declared with attribute warning: curl_easy_setopt expects a long argument [-Wattribute-warning]284 > 6 | if (curl_easy_setopt(hdl, opt, prm) != CURLE_OK) \285 > | ^~~~~~~~~~~~~~~~286 > src/core.c:108:3: note: in expansion of macro 'CURL_EZ_SETOPT'287 > 108 | CURL_EZ_SETOPT(curl_ez_handle, CURLOPT_TIMEOUT_MS, timeout_milliseconds);288 > | ^~~~~~~~~~~~~~289 > src/util.h:6:11: warning: call to 'Wcurl_easy_setopt_err_long' declared with attribute warning: curl_easy_setopt expects a long argument [-Wattribute-warning]290 > 6 | if (curl_easy_setopt(hdl, opt, prm) != CURLE_OK) \291 > | ^~~~~~~~~~~~~~~~292 > src/core.c:110:3: note: in expansion of macro 'CURL_EZ_SETOPT'293 > 110 | CURL_EZ_SETOPT(curl_ez_handle, CURLOPT_FOLLOWLOCATION, true);294 > | ^~~~~~~~~~~~~~295 > gcc -Wall -Wmissing-prototypes -Wpointer-arith -Wdeclaration-after-statement -Werror=vla -Wendif-labels -Wmissing-format-attribute -Wimplicit-fallthrough=3 -Wcast-function-type -Wshadow=compatible-local -Wformat-security -fno-strict-aliasing -fwrapv -fexcess-precision=standard -Wno-format-truncation -Wno-stringop-truncation -g -O2 -std=c11 -Werror -Wno-declaration-after-statement -fPIC -fvisibility=hidden -DEXTVERSION=\"0.13.0\" -I. -I./ -I/nix/store/dj25xabr71j1mmxf628lqsn61qd5qcyk-postgresql-17.11/include/server -I/nix/store/dj25xabr71j1mmxf628lqsn61qd5qcyk-postgresql-17.11/include/internal -D_GNU_SOURCE -I/nix/store/5nl2zr46dic7mxcw6cvbq85wa8c2gngh-libxml2-2.15.1-dev/include/libxml2 -I/nix/store/sl10j863s32x7dv5vw6wfx1nh22f3xh2-lz4-1.10.0-dev/include -I/nix/store/di94mxmhhk390zzzv2gvavfwkgww7q6h-zstd-1.5.7-dev/include -I/nix/store/h5hfqhzcqszmsacj26hh3fngwcal04zs-icu4c-75.1-dev/include -c -o src/event.o src/event.c296 > In file included from /nix/store/wflnb8fxmq4lqx3ca91hlpv95vrqkv51-curl-8.17.0-dev/include/curl/curl.h:3333,297 > from /nix/store/wflnb8fxmq4lqx3ca91hlpv95vrqkv51-curl-8.17.0-dev/include/curl/multi.h:51,298 > from src/event.h:4,299 > from src/event.c:6:300 > /nix/store/wflnb8fxmq4lqx3ca91hlpv95vrqkv51-curl-8.17.0-dev/include/curl/multi.h:429:23: error: expected identifier or '(' before '__extension__'301 > 429 | CURL_EXTERN CURLMcode curl_multi_setopt(CURLM *multi_handle,302 > | ^~~~~~~~~~~~~~~~~303 > /nix/store/wflnb8fxmq4lqx3ca91hlpv95vrqkv51-curl-8.17.0-dev/include/curl/multi.h:429:23: error: expected identifier or '(' before ')' token304 > 429 | CURL_EXTERN CURLMcode curl_multi_setopt(CURLM *multi_handle,305 > | ^~~~~~~~~~~~~~~~~306 > make: *** [<builtin>: src/event.o] Error 1307 For full logs, run:308 nix log /nix/store/jdx62c5jlcjxsbqjaqi25zwfy2ys9jp5-pg_net-0.13.0.drv309error: Cannot build '/nix/store/ky294hja2giinx8655lj1d83j4jq5gjj-pg_net-0.14.0.drv'.310 Reason: builder failed with exit code 2.311 Output paths:312 /nix/store/da6kcjzl896sjpnd8rrkfzykfm8chlaz-pg_net-0.14.0313 Last 25 log lines:314 > src/errors.h:6:11: warning: call to 'Wcurl_easy_setopt_err_long' declared with attribute warning: curl_easy_setopt expects a long argument [-Wattribute-warning]315 > 6 | if (curl_easy_setopt(hdl, opt, prm) != CURLE_OK) \316 > | ^~~~~~~~~~~~~~~~317 > src/core.c:134:3: note: in expansion of macro 'EREPORT_CURL_SETOPT'318 > 134 | EREPORT_CURL_SETOPT(curl_ez_handle, CURLOPT_TIMEOUT_MS, cdata->timeout_milliseconds);319 > | ^~~~~~~~~~~~~~~~~~~320 > src/errors.h:6:11: warning: call to 'Wcurl_easy_setopt_err_long' declared with attribute warning: curl_easy_setopt expects a long argument [-Wattribute-warning]321 > 6 | if (curl_easy_setopt(hdl, opt, prm) != CURLE_OK) \322 > | ^~~~~~~~~~~~~~~~323 > src/core.c:136:3: note: in expansion of macro 'EREPORT_CURL_SETOPT'324 > 136 | EREPORT_CURL_SETOPT(curl_ez_handle, CURLOPT_FOLLOWLOCATION, true);325 > | ^~~~~~~~~~~~~~~~~~~326 > gcc -Wall -Wmissing-prototypes -Wpointer-arith -Wdeclaration-after-statement -Werror=vla -Wendif-labels -Wmissing-format-attribute -Wimplicit-fallthrough=3 -Wcast-function-type -Wshadow=compatible-local -Wformat-security -fno-strict-aliasing -fwrapv -fexcess-precision=standard -Wno-format-truncation -Wno-stringop-truncation -g -O2 -std=c11 -Werror -Wno-declaration-after-statement -fPIC -fvisibility=hidden -DEXTVERSION=\"0.14.0\" -I. -I./ -I/nix/store/dj25xabr71j1mmxf628lqsn61qd5qcyk-postgresql-17.11/include/server -I/nix/store/dj25xabr71j1mmxf628lqsn61qd5qcyk-postgresql-17.11/include/internal -D_GNU_SOURCE -I/nix/store/5nl2zr46dic7mxcw6cvbq85wa8c2gngh-libxml2-2.15.1-dev/include/libxml2 -I/nix/store/sl10j863s32x7dv5vw6wfx1nh22f3xh2-lz4-1.10.0-dev/include -I/nix/store/di94mxmhhk390zzzv2gvavfwkgww7q6h-zstd-1.5.7-dev/include -I/nix/store/h5hfqhzcqszmsacj26hh3fngwcal04zs-icu4c-75.1-dev/include -c -o src/errors.o src/errors.c327 > gcc -Wall -Wmissing-prototypes -Wpointer-arith -Wdeclaration-after-statement -Werror=vla -Wendif-labels -Wmissing-format-attribute -Wimplicit-fallthrough=3 -Wcast-function-type -Wshadow=compatible-local -Wformat-security -fno-strict-aliasing -fwrapv -fexcess-precision=standard -Wno-format-truncation -Wno-stringop-truncation -g -O2 -std=c11 -Werror -Wno-declaration-after-statement -fPIC -fvisibility=hidden -DEXTVERSION=\"0.14.0\" -I. -I./ -I/nix/store/dj25xabr71j1mmxf628lqsn61qd5qcyk-postgresql-17.11/include/server -I/nix/store/dj25xabr71j1mmxf628lqsn61qd5qcyk-postgresql-17.11/include/internal -D_GNU_SOURCE -I/nix/store/5nl2zr46dic7mxcw6cvbq85wa8c2gngh-libxml2-2.15.1-dev/include/libxml2 -I/nix/store/sl10j863s32x7dv5vw6wfx1nh22f3xh2-lz4-1.10.0-dev/include -I/nix/store/di94mxmhhk390zzzv2gvavfwkgww7q6h-zstd-1.5.7-dev/include -I/nix/store/h5hfqhzcqszmsacj26hh3fngwcal04zs-icu4c-75.1-dev/include -c -o src/event.o src/event.c328 > In file included from /nix/store/wflnb8fxmq4lqx3ca91hlpv95vrqkv51-curl-8.17.0-dev/include/curl/curl.h:3333,329 > from /nix/store/wflnb8fxmq4lqx3ca91hlpv95vrqkv51-curl-8.17.0-dev/include/curl/multi.h:51,330 > from src/event.h:4,331 > from src/event.c:6:332 > /nix/store/wflnb8fxmq4lqx3ca91hlpv95vrqkv51-curl-8.17.0-dev/include/curl/multi.h:429:23: error: expected identifier or '(' before '__extension__'333 > 429 | CURL_EXTERN CURLMcode curl_multi_setopt(CURLM *multi_handle,334 > | ^~~~~~~~~~~~~~~~~335 > /nix/store/wflnb8fxmq4lqx3ca91hlpv95vrqkv51-curl-8.17.0-dev/include/curl/multi.h:429:23: error: expected identifier or '(' before ')' token336 > 429 | CURL_EXTERN CURLMcode curl_multi_setopt(CURLM *multi_handle,337 > | ^~~~~~~~~~~~~~~~~338 > make: *** [<builtin>: src/event.o] Error 1339 For full logs, run:340 nix log /nix/store/ky294hja2giinx8655lj1d83j4jq5gjj-pg_net-0.14.0.drv341error: Cannot build '/nix/store/ky7414m088qm5h8xn9z7xzw0k08wgcrh-pg_net-0.20.0.drv'.342 Reason: builder failed with exit code 2.343 Output paths:344 /nix/store/div76hg9lzzwipcrl72qfbl1vaps6bqr-pg_net-0.20.0345 Last 22 log lines:346 > Running phase: unpackPhase347 > unpacking source archive /nix/store/3783i7yhcfqnyv5ndli22gcr11ap151m-source348 > source root is source349 > Running phase: patchPhase350 > Running phase: updateAutotoolsGnuConfigScriptsPhase351 > Running phase: configurePhase352 > no configure script, doing nothing353 > Running phase: buildPhase354 > gcc -Wall -Wmissing-prototypes -Wpointer-arith -Wdeclaration-after-statement -Werror=vla -Wendif-labels -Wmissing-format-attribute -Wimplicit-fallthrough=3 -Wcast-function-type -Wshadow=compatible-local -Wformat-security -fno-strict-aliasing -fwrapv -fexcess-precision=standard -Wno-format-truncation -Wno-stringop-truncation -g -O2 -std=c11 -Wextra -Wall -Werror -Wno-declaration-after-statement -Wno-vla -Wno-long-long -Wmissing-variable-declarations -fPIC -fvisibility=hidden -DEXTVERSION=\"0.20.0\" -I. -I./ -I/nix/store/dj25xabr71j1mmxf628lqsn61qd5qcyk-postgresql-17.11/include/server -I/nix/store/dj25xabr71j1mmxf628lqsn61qd5qcyk-postgresql-17.11/include/internal -D_GNU_SOURCE -I/nix/store/5nl2zr46dic7mxcw6cvbq85wa8c2gngh-libxml2-2.15.1-dev/include/libxml2 -I/nix/store/sl10j863s32x7dv5vw6wfx1nh22f3xh2-lz4-1.10.0-dev/include -I/nix/store/di94mxmhhk390zzzv2gvavfwkgww7q6h-zstd-1.5.7-dev/include -I/nix/store/h5hfqhzcqszmsacj26hh3fngwcal04zs-icu4c-75.1-dev/include -c -o src/core.o src/core.c355 > gcc -Wall -Wmissing-prototypes -Wpointer-arith -Wdeclaration-after-statement -Werror=vla -Wendif-labels -Wmissing-format-attribute -Wimplicit-fallthrough=3 -Wcast-function-type -Wshadow=compatible-local -Wformat-security -fno-strict-aliasing -fwrapv -fexcess-precision=standard -Wno-format-truncation -Wno-stringop-truncation -g -O2 -std=c11 -Wextra -Wall -Werror -Wno-declaration-after-statement -Wno-vla -Wno-long-long -Wmissing-variable-declarations -fPIC -fvisibility=hidden -DEXTVERSION=\"0.20.0\" -I. -I./ -I/nix/store/dj25xabr71j1mmxf628lqsn61qd5qcyk-postgresql-17.11/include/server -I/nix/store/dj25xabr71j1mmxf628lqsn61qd5qcyk-postgresql-17.11/include/internal -D_GNU_SOURCE -I/nix/store/5nl2zr46dic7mxcw6cvbq85wa8c2gngh-libxml2-2.15.1-dev/include/libxml2 -I/nix/store/sl10j863s32x7dv5vw6wfx1nh22f3xh2-lz4-1.10.0-dev/include -I/nix/store/di94mxmhhk390zzzv2gvavfwkgww7q6h-zstd-1.5.7-dev/include -I/nix/store/h5hfqhzcqszmsacj26hh3fngwcal04zs-icu4c-75.1-dev/include -c -o src/errors.o src/errors.c356 > gcc -Wall -Wmissing-prototypes -Wpointer-arith -Wdeclaration-after-statement -Werror=vla -Wendif-labels -Wmissing-format-attribute -Wimplicit-fallthrough=3 -Wcast-function-type -Wshadow=compatible-local -Wformat-security -fno-strict-aliasing -fwrapv -fexcess-precision=standard -Wno-format-truncation -Wno-stringop-truncation -g -O2 -std=c11 -Wextra -Wall -Werror -Wno-declaration-after-statement -Wno-vla -Wno-long-long -Wmissing-variable-declarations -fPIC -fvisibility=hidden -DEXTVERSION=\"0.20.0\" -I. -I./ -I/nix/store/dj25xabr71j1mmxf628lqsn61qd5qcyk-postgresql-17.11/include/server -I/nix/store/dj25xabr71j1mmxf628lqsn61qd5qcyk-postgresql-17.11/include/internal -D_GNU_SOURCE -I/nix/store/5nl2zr46dic7mxcw6cvbq85wa8c2gngh-libxml2-2.15.1-dev/include/libxml2 -I/nix/store/sl10j863s32x7dv5vw6wfx1nh22f3xh2-lz4-1.10.0-dev/include -I/nix/store/di94mxmhhk390zzzv2gvavfwkgww7q6h-zstd-1.5.7-dev/include -I/nix/store/h5hfqhzcqszmsacj26hh3fngwcal04zs-icu4c-75.1-dev/include -c -o src/event.o src/event.c357 > In file included from /nix/store/wflnb8fxmq4lqx3ca91hlpv95vrqkv51-curl-8.17.0-dev/include/curl/curl.h:3333,358 > from /nix/store/wflnb8fxmq4lqx3ca91hlpv95vrqkv51-curl-8.17.0-dev/include/curl/multi.h:51,359 > from src/event.h:4,360 > from src/event.c:6:361 > /nix/store/wflnb8fxmq4lqx3ca91hlpv95vrqkv51-curl-8.17.0-dev/include/curl/multi.h:429:23: error: expected identifier or '(' before '__extension__'362 > 429 | CURL_EXTERN CURLMcode curl_multi_setopt(CURLM *multi_handle,363 > | ^~~~~~~~~~~~~~~~~364 > /nix/store/wflnb8fxmq4lqx3ca91hlpv95vrqkv51-curl-8.17.0-dev/include/curl/multi.h:429:23: error: expected identifier or '(' before ')' token365 > 429 | CURL_EXTERN CURLMcode curl_multi_setopt(CURLM *multi_handle,366 > | ^~~~~~~~~~~~~~~~~367 > make: *** [<builtin>: src/event.o] Error 1368 For full logs, run:369 nix log /nix/store/ky7414m088qm5h8xn9z7xzw0k08wgcrh-pg_net-0.20.0.drv370error: Cannot build '/nix/store/ymx9gp4jhvd7qpjvk95vw2m6ycb0jal7-pg_net-0.13.0.drv'.371 Reason: builder failed with exit code 2.372 Output paths:373 /nix/store/pxjg6rykpbbhl7xmwasvyb94bc1v5w3r-pg_net-0.13.0374 Last 25 log lines:375 > | ^~~~~~~~~~~~~~376 > src/util.h:6:11: warning: call to 'Wcurl_easy_setopt_err_long' declared with attribute warning: curl_easy_setopt expects a long argument [-Wattribute-warning]377 > 6 | if (curl_easy_setopt(hdl, opt, prm) != CURLE_OK) \378 > | ^~~~~~~~~~~~~~~~379 > src/core.c:108:3: note: in expansion of macro 'CURL_EZ_SETOPT'380 > 108 | CURL_EZ_SETOPT(curl_ez_handle, CURLOPT_TIMEOUT_MS, timeout_milliseconds);381 > | ^~~~~~~~~~~~~~382 > src/util.h:6:11: warning: call to 'Wcurl_easy_setopt_err_long' declared with attribute warning: curl_easy_setopt expects a long argument [-Wattribute-warning]383 > 6 | if (curl_easy_setopt(hdl, opt, prm) != CURLE_OK) \384 > | ^~~~~~~~~~~~~~~~385 > src/core.c:110:3: note: in expansion of macro 'CURL_EZ_SETOPT'386 > 110 | CURL_EZ_SETOPT(curl_ez_handle, CURLOPT_FOLLOWLOCATION, true);387 > | ^~~~~~~~~~~~~~388 > gcc -Wall -Wmissing-prototypes -Wpointer-arith -Wdeclaration-after-statement -Werror=vla -Wendif-labels -Wmissing-format-attribute -Wimplicit-fallthrough=3 -Wcast-function-type -Wformat-security -fno-strict-aliasing -fwrapv -fexcess-precision=standard -Wno-deprecated-non-prototype -Wno-format-truncation -Wno-stringop-truncation -g -O2 -std=gnu17 -std=c11 -Werror -Wno-declaration-after-statement -fPIC -DEXTVERSION=\"0.13.0\" -I. -I./ -I/nix/store/804f042cyc4dca4vwl2fmh1rhfy0sij9-postgresql-15.19/include/server -I/nix/store/804f042cyc4dca4vwl2fmh1rhfy0sij9-postgresql-15.19/include/internal -D_GNU_SOURCE -I/nix/store/5nl2zr46dic7mxcw6cvbq85wa8c2gngh-libxml2-2.15.1-dev/include/libxml2 -I/nix/store/sl10j863s32x7dv5vw6wfx1nh22f3xh2-lz4-1.10.0-dev/include -I/nix/store/di94mxmhhk390zzzv2gvavfwkgww7q6h-zstd-1.5.7-dev/include -I/nix/store/h5hfqhzcqszmsacj26hh3fngwcal04zs-icu4c-75.1-dev/include -c -o src/event.o src/event.c389 > In file included from /nix/store/wflnb8fxmq4lqx3ca91hlpv95vrqkv51-curl-8.17.0-dev/include/curl/curl.h:3333,390 > from /nix/store/wflnb8fxmq4lqx3ca91hlpv95vrqkv51-curl-8.17.0-dev/include/curl/multi.h:51,391 > from src/event.h:4,392 > from src/event.c:6:393 > /nix/store/wflnb8fxmq4lqx3ca91hlpv95vrqkv51-curl-8.17.0-dev/include/curl/multi.h:429:23: error: expected identifier or '(' before '__extension__'394 > 429 | CURL_EXTERN CURLMcode curl_multi_setopt(CURLM *multi_handle,395 > | ^~~~~~~~~~~~~~~~~396 > /nix/store/wflnb8fxmq4lqx3ca91hlpv95vrqkv51-curl-8.17.0-dev/include/curl/multi.h:429:23: error: expected identifier or '(' before ')' token397 > 429 | CURL_EXTERN CURLMcode curl_multi_setopt(CURLM *multi_handle,398 > | ^~~~~~~~~~~~~~~~~399 > make: *** [<builtin>: src/event.o] Error 1400 For full logs, run:401 nix log /nix/store/ymx9gp4jhvd7qpjvk95vw2m6ycb0jal7-pg_net-0.13.0.drv402error: Cannot build '/nix/store/h3jfznl8xhwm8wvvxg23yj74srzz3vii-pg_net-0.19.5.drv'.403 Reason: builder failed with exit code 2.404 Output paths:405 /nix/store/yc457kag2jhvws0021nbq7nsws86glnl-pg_net-0.19.5406 Last 22 log lines:407 > Running phase: unpackPhase408 > unpacking source archive /nix/store/5zgdqy3bz93jyn79pizxc1hks0cdcadw-source409 > source root is source410 > Running phase: patchPhase411 > Running phase: updateAutotoolsGnuConfigScriptsPhase412 > Running phase: configurePhase413 > no configure script, doing nothing414 > Running phase: buildPhase415 > gcc -Wall -Wmissing-prototypes -Wpointer-arith -Wdeclaration-after-statement -Werror=vla -Wendif-labels -Wmissing-format-attribute -Wimplicit-fallthrough=3 -Wcast-function-type -Wshadow=compatible-local -Wformat-security -fno-strict-aliasing -fwrapv -fexcess-precision=standard -Wno-format-truncation -Wno-stringop-truncation -g -O2 -std=c11 -Wextra -Wall -Werror -Wno-declaration-after-statement -Wno-vla -Wno-long-long -Wmissing-variable-declarations -fPIC -fvisibility=hidden -DEXTVERSION=\"0.19.5\" -I. -I./ -I/nix/store/dj25xabr71j1mmxf628lqsn61qd5qcyk-postgresql-17.11/include/server -I/nix/store/dj25xabr71j1mmxf628lqsn61qd5qcyk-postgresql-17.11/include/internal -D_GNU_SOURCE -I/nix/store/5nl2zr46dic7mxcw6cvbq85wa8c2gngh-libxml2-2.15.1-dev/include/libxml2 -I/nix/store/sl10j863s32x7dv5vw6wfx1nh22f3xh2-lz4-1.10.0-dev/include -I/nix/store/di94mxmhhk390zzzv2gvavfwkgww7q6h-zstd-1.5.7-dev/include -I/nix/store/h5hfqhzcqszmsacj26hh3fngwcal04zs-icu4c-75.1-dev/include -c -o src/core.o src/core.c416 > gcc -Wall -Wmissing-prototypes -Wpointer-arith -Wdeclaration-after-statement -Werror=vla -Wendif-labels -Wmissing-format-attribute -Wimplicit-fallthrough=3 -Wcast-function-type -Wshadow=compatible-local -Wformat-security -fno-strict-aliasing -fwrapv -fexcess-precision=standard -Wno-format-truncation -Wno-stringop-truncation -g -O2 -std=c11 -Wextra -Wall -Werror -Wno-declaration-after-statement -Wno-vla -Wno-long-long -Wmissing-variable-declarations -fPIC -fvisibility=hidden -DEXTVERSION=\"0.19.5\" -I. -I./ -I/nix/store/dj25xabr71j1mmxf628lqsn61qd5qcyk-postgresql-17.11/include/server -I/nix/store/dj25xabr71j1mmxf628lqsn61qd5qcyk-postgresql-17.11/include/internal -D_GNU_SOURCE -I/nix/store/5nl2zr46dic7mxcw6cvbq85wa8c2gngh-libxml2-2.15.1-dev/include/libxml2 -I/nix/store/sl10j863s32x7dv5vw6wfx1nh22f3xh2-lz4-1.10.0-dev/include -I/nix/store/di94mxmhhk390zzzv2gvavfwkgww7q6h-zstd-1.5.7-dev/include -I/nix/store/h5hfqhzcqszmsacj26hh3fngwcal04zs-icu4c-75.1-dev/include -c -o src/errors.o src/errors.c417 > gcc -Wall -Wmissing-prototypes -Wpointer-arith -Wdeclaration-after-statement -Werror=vla -Wendif-labels -Wmissing-format-attribute -Wimplicit-fallthrough=3 -Wcast-function-type -Wshadow=compatible-local -Wformat-security -fno-strict-aliasing -fwrapv -fexcess-precision=standard -Wno-format-truncation -Wno-stringop-truncation -g -O2 -std=c11 -Wextra -Wall -Werror -Wno-declaration-after-statement -Wno-vla -Wno-long-long -Wmissing-variable-declarations -fPIC -fvisibility=hidden -DEXTVERSION=\"0.19.5\" -I. -I./ -I/nix/store/dj25xabr71j1mmxf628lqsn61qd5qcyk-postgresql-17.11/include/server -I/nix/store/dj25xabr71j1mmxf628lqsn61qd5qcyk-postgresql-17.11/include/internal -D_GNU_SOURCE -I/nix/store/5nl2zr46dic7mxcw6cvbq85wa8c2gngh-libxml2-2.15.1-dev/include/libxml2 -I/nix/store/sl10j863s32x7dv5vw6wfx1nh22f3xh2-lz4-1.10.0-dev/include -I/nix/store/di94mxmhhk390zzzv2gvavfwkgww7q6h-zstd-1.5.7-dev/include -I/nix/store/h5hfqhzcqszmsacj26hh3fngwcal04zs-icu4c-75.1-dev/include -c -o src/event.o src/event.c418 > In file included from /nix/store/wflnb8fxmq4lqx3ca91hlpv95vrqkv51-curl-8.17.0-dev/include/curl/curl.h:3333,419 > from /nix/store/wflnb8fxmq4lqx3ca91hlpv95vrqkv51-curl-8.17.0-dev/include/curl/multi.h:51,420 > from src/event.h:4,421 > from src/event.c:6:422 > /nix/store/wflnb8fxmq4lqx3ca91hlpv95vrqkv51-curl-8.17.0-dev/include/curl/multi.h:429:23: error: expected identifier or '(' before '__extension__'423 > 429 | CURL_EXTERN CURLMcode curl_multi_setopt(CURLM *multi_handle,424 > | ^~~~~~~~~~~~~~~~~425 > /nix/store/wflnb8fxmq4lqx3ca91hlpv95vrqkv51-curl-8.17.0-dev/include/curl/multi.h:429:23: error: expected identifier or '(' before ')' token426 > 429 | CURL_EXTERN CURLMcode curl_multi_setopt(CURLM *multi_handle,427 > | ^~~~~~~~~~~~~~~~~428 > make: *** [<builtin>: src/event.o] Error 1429 For full logs, run:430 nix log /nix/store/h3jfznl8xhwm8wvvxg23yj74srzz3vii-pg_net-0.19.5.drv431error: Cannot build '/nix/store/cqdc5q7n6g9pkxy0cjcvkq185rps4bfd-pg_net.drv'.432 Reason: 4 dependencies failed.433 Output paths:434 /nix/store/4sc9iw7bqgw1y6834l2h4w200hvc8b79-pg_net435error: Cannot build '/nix/store/d5s4s970iizz6a8w5ndnpzyw63w1m1qv-postgresql-and-plugins-17.11.drv'.436 Reason: 1 dependency failed.437 Output paths:438 /nix/store/dlsqc392rqmvj64617g73zcbvclgch0b-postgresql-and-plugins-17.11439error: Cannot build '/nix/store/7hla3p20yajypj5w3hnrx38bc3kq14vq-postgresql-and-plugins-17.11.drv'.440 Reason: 1 dependency failed.441 Output paths:442 /nix/store/j9fc5s30v77k7ycb6icimvdhkb7ss17i-postgresql-and-plugins-17.11443error: Cannot build '/nix/store/hfwkzpr1kplwaywhvayqm6j4gsva8n5n-pg_net-0.20.0.drv'.444 Reason: builder failed with exit code 2.445 Output paths:446 /nix/store/scsfkgabhfzpzf64a6cgvkx2zglb6vji-pg_net-0.20.0447 Last 22 log lines:448 > Running phase: unpackPhase449 > unpacking source archive /nix/store/3783i7yhcfqnyv5ndli22gcr11ap151m-source450 > source root is source451 > Running phase: patchPhase452 > Running phase: updateAutotoolsGnuConfigScriptsPhase453 > Running phase: configurePhase454 > no configure script, doing nothing455 > Running phase: buildPhase456 > gcc -Wall -Wmissing-prototypes -Wpointer-arith -Wdeclaration-after-statement -Werror=vla -Wendif-labels -Wmissing-format-attribute -Wimplicit-fallthrough=3 -Wcast-function-type -Wformat-security -fno-strict-aliasing -fwrapv -fexcess-precision=standard -Wno-deprecated-non-prototype -Wno-format-truncation -Wno-stringop-truncation -g -O2 -std=gnu17 -std=c11 -Wextra -Wall -Werror -Wno-declaration-after-statement -Wno-vla -Wno-long-long -Wmissing-variable-declarations -fPIC -DEXTVERSION=\"0.20.0\" -I. -I./ -I/nix/store/804f042cyc4dca4vwl2fmh1rhfy0sij9-postgresql-15.19/include/server -I/nix/store/804f042cyc4dca4vwl2fmh1rhfy0sij9-postgresql-15.19/include/internal -D_GNU_SOURCE -I/nix/store/5nl2zr46dic7mxcw6cvbq85wa8c2gngh-libxml2-2.15.1-dev/include/libxml2 -I/nix/store/sl10j863s32x7dv5vw6wfx1nh22f3xh2-lz4-1.10.0-dev/include -I/nix/store/di94mxmhhk390zzzv2gvavfwkgww7q6h-zstd-1.5.7-dev/include -I/nix/store/h5hfqhzcqszmsacj26hh3fngwcal04zs-icu4c-75.1-dev/include -c -o src/core.o src/core.c457 > gcc -Wall -Wmissing-prototypes -Wpointer-arith -Wdeclaration-after-statement -Werror=vla -Wendif-labels -Wmissing-format-attribute -Wimplicit-fallthrough=3 -Wcast-function-type -Wformat-security -fno-strict-aliasing -fwrapv -fexcess-precision=standard -Wno-deprecated-non-prototype -Wno-format-truncation -Wno-stringop-truncation -g -O2 -std=gnu17 -std=c11 -Wextra -Wall -Werror -Wno-declaration-after-statement -Wno-vla -Wno-long-long -Wmissing-variable-declarations -fPIC -DEXTVERSION=\"0.20.0\" -I. -I./ -I/nix/store/804f042cyc4dca4vwl2fmh1rhfy0sij9-postgresql-15.19/include/server -I/nix/store/804f042cyc4dca4vwl2fmh1rhfy0sij9-postgresql-15.19/include/internal -D_GNU_SOURCE -I/nix/store/5nl2zr46dic7mxcw6cvbq85wa8c2gngh-libxml2-2.15.1-dev/include/libxml2 -I/nix/store/sl10j863s32x7dv5vw6wfx1nh22f3xh2-lz4-1.10.0-dev/include -I/nix/store/di94mxmhhk390zzzv2gvavfwkgww7q6h-zstd-1.5.7-dev/include -I/nix/store/h5hfqhzcqszmsacj26hh3fngwcal04zs-icu4c-75.1-dev/include -c -o src/errors.o src/errors.c458 > gcc -Wall -Wmissing-prototypes -Wpointer-arith -Wdeclaration-after-statement -Werror=vla -Wendif-labels -Wmissing-format-attribute -Wimplicit-fallthrough=3 -Wcast-function-type -Wformat-security -fno-strict-aliasing -fwrapv -fexcess-precision=standard -Wno-deprecated-non-prototype -Wno-format-truncation -Wno-stringop-truncation -g -O2 -std=gnu17 -std=c11 -Wextra -Wall -Werror -Wno-declaration-after-statement -Wno-vla -Wno-long-long -Wmissing-variable-declarations -fPIC -DEXTVERSION=\"0.20.0\" -I. -I./ -I/nix/store/804f042cyc4dca4vwl2fmh1rhfy0sij9-postgresql-15.19/include/server -I/nix/store/804f042cyc4dca4vwl2fmh1rhfy0sij9-postgresql-15.19/include/internal -D_GNU_SOURCE -I/nix/store/5nl2zr46dic7mxcw6cvbq85wa8c2gngh-libxml2-2.15.1-dev/include/libxml2 -I/nix/store/sl10j863s32x7dv5vw6wfx1nh22f3xh2-lz4-1.10.0-dev/include -I/nix/store/di94mxmhhk390zzzv2gvavfwkgww7q6h-zstd-1.5.7-dev/include -I/nix/store/h5hfqhzcqszmsacj26hh3fngwcal04zs-icu4c-75.1-dev/include -c -o src/event.o src/event.c459 > In file included from /nix/store/wflnb8fxmq4lqx3ca91hlpv95vrqkv51-curl-8.17.0-dev/include/curl/curl.h:3333,460 > from /nix/store/wflnb8fxmq4lqx3ca91hlpv95vrqkv51-curl-8.17.0-dev/include/curl/multi.h:51,461 > from src/event.h:4,462 > from src/event.c:6:463 > /nix/store/wflnb8fxmq4lqx3ca91hlpv95vrqkv51-curl-8.17.0-dev/include/curl/multi.h:429:23: error: expected identifier or '(' before '__extension__'464 > 429 | CURL_EXTERN CURLMcode curl_multi_setopt(CURLM *multi_handle,465 > | ^~~~~~~~~~~~~~~~~466 > /nix/store/wflnb8fxmq4lqx3ca91hlpv95vrqkv51-curl-8.17.0-dev/include/curl/multi.h:429:23: error: expected identifier or '(' before ')' token467 > 429 | CURL_EXTERN CURLMcode curl_multi_setopt(CURLM *multi_handle,468 > | ^~~~~~~~~~~~~~~~~469 > make: *** [<builtin>: src/event.o] Error 1470 For full logs, run:471 nix log /nix/store/hfwkzpr1kplwaywhvayqm6j4gsva8n5n-pg_net-0.20.0.drv472error: Cannot build '/nix/store/v7i610b6q10zpsd2536yvba9pd2xqrr6-pg_net-0.19.5.drv'.473 Reason: builder failed with exit code 2.474 Output paths:475 /nix/store/pzmf3gl6j9iwmkqjfvwvsb11fh4i1rz2-pg_net-0.19.5476 Last 22 log lines:477 > Running phase: unpackPhase478 > unpacking source archive /nix/store/5zgdqy3bz93jyn79pizxc1hks0cdcadw-source479 > source root is source480 > Running phase: patchPhase481 > Running phase: updateAutotoolsGnuConfigScriptsPhase482 > Running phase: configurePhase483 > no configure script, doing nothing484 > Running phase: buildPhase485 > gcc -Wall -Wmissing-prototypes -Wpointer-arith -Wdeclaration-after-statement -Werror=vla -Wendif-labels -Wmissing-format-attribute -Wimplicit-fallthrough=3 -Wcast-function-type -Wshadow=compatible-local -Wformat-security -fno-strict-aliasing -fwrapv -fexcess-precision=standard -Wno-format-truncation -Wno-stringop-truncation -g -O2 -std=c11 -Wextra -Wall -Werror -Wno-declaration-after-statement -Wno-vla -Wno-long-long -Wmissing-variable-declarations -fPIC -fvisibility=hidden -DEXTVERSION=\"0.19.5\" -I. -I./ -I/nix/store/qmc7y6nc0qxg50ywm46x4iaqq5knz702-postgresql-17_22/include/server -I/nix/store/qmc7y6nc0qxg50ywm46x4iaqq5knz702-postgresql-17_22/include/internal -D_GNU_SOURCE -I/nix/store/5nl2zr46dic7mxcw6cvbq85wa8c2gngh-libxml2-2.15.1-dev/include/libxml2 -I/nix/store/sl10j863s32x7dv5vw6wfx1nh22f3xh2-lz4-1.10.0-dev/include -I/nix/store/di94mxmhhk390zzzv2gvavfwkgww7q6h-zstd-1.5.7-dev/include -I/nix/store/h5hfqhzcqszmsacj26hh3fngwcal04zs-icu4c-75.1-dev/include -c -o src/core.o src/core.c486 > gcc -Wall -Wmissing-prototypes -Wpointer-arith -Wdeclaration-after-statement -Werror=vla -Wendif-labels -Wmissing-format-attribute -Wimplicit-fallthrough=3 -Wcast-function-type -Wshadow=compatible-local -Wformat-security -fno-strict-aliasing -fwrapv -fexcess-precision=standard -Wno-format-truncation -Wno-stringop-truncation -g -O2 -std=c11 -Wextra -Wall -Werror -Wno-declaration-after-statement -Wno-vla -Wno-long-long -Wmissing-variable-declarations -fPIC -fvisibility=hidden -DEXTVERSION=\"0.19.5\" -I. -I./ -I/nix/store/qmc7y6nc0qxg50ywm46x4iaqq5knz702-postgresql-17_22/include/server -I/nix/store/qmc7y6nc0qxg50ywm46x4iaqq5knz702-postgresql-17_22/include/internal -D_GNU_SOURCE -I/nix/store/5nl2zr46dic7mxcw6cvbq85wa8c2gngh-libxml2-2.15.1-dev/include/libxml2 -I/nix/store/sl10j863s32x7dv5vw6wfx1nh22f3xh2-lz4-1.10.0-dev/include -I/nix/store/di94mxmhhk390zzzv2gvavfwkgww7q6h-zstd-1.5.7-dev/include -I/nix/store/h5hfqhzcqszmsacj26hh3fngwcal04zs-icu4c-75.1-dev/include -c -o src/errors.o src/errors.c487 > gcc -Wall -Wmissing-prototypes -Wpointer-arith -Wdeclaration-after-statement -Werror=vla -Wendif-labels -Wmissing-format-attribute -Wimplicit-fallthrough=3 -Wcast-function-type -Wshadow=compatible-local -Wformat-security -fno-strict-aliasing -fwrapv -fexcess-precision=standard -Wno-format-truncation -Wno-stringop-truncation -g -O2 -std=c11 -Wextra -Wall -Werror -Wno-declaration-after-statement -Wno-vla -Wno-long-long -Wmissing-variable-declarations -fPIC -fvisibility=hidden -DEXTVERSION=\"0.19.5\" -I. -I./ -I/nix/store/qmc7y6nc0qxg50ywm46x4iaqq5knz702-postgresql-17_22/include/server -I/nix/store/qmc7y6nc0qxg50ywm46x4iaqq5knz702-postgresql-17_22/include/internal -D_GNU_SOURCE -I/nix/store/5nl2zr46dic7mxcw6cvbq85wa8c2gngh-libxml2-2.15.1-dev/include/libxml2 -I/nix/store/sl10j863s32x7dv5vw6wfx1nh22f3xh2-lz4-1.10.0-dev/include -I/nix/store/di94mxmhhk390zzzv2gvavfwkgww7q6h-zstd-1.5.7-dev/include -I/nix/store/h5hfqhzcqszmsacj26hh3fngwcal04zs-icu4c-75.1-dev/include -c -o src/event.o src/event.c488 > In file included from /nix/store/wflnb8fxmq4lqx3ca91hlpv95vrqkv51-curl-8.17.0-dev/include/curl/curl.h:3333,489 > from /nix/store/wflnb8fxmq4lqx3ca91hlpv95vrqkv51-curl-8.17.0-dev/include/curl/multi.h:51,490 > from src/event.h:4,491 > from src/event.c:6:492 > /nix/store/wflnb8fxmq4lqx3ca91hlpv95vrqkv51-curl-8.17.0-dev/include/curl/multi.h:429:23: error: expected identifier or '(' before '__extension__'493 > 429 | CURL_EXTERN CURLMcode curl_multi_setopt(CURLM *multi_handle,494 > | ^~~~~~~~~~~~~~~~~495 > /nix/store/wflnb8fxmq4lqx3ca91hlpv95vrqkv51-curl-8.17.0-dev/include/curl/multi.h:429:23: error: expected identifier or '(' before ')' token496 > 429 | CURL_EXTERN CURLMcode curl_multi_setopt(CURLM *multi_handle,497 > | ^~~~~~~~~~~~~~~~~498 > make: *** [<builtin>: src/event.o] Error 1499 For full logs, run:500 nix log /nix/store/v7i610b6q10zpsd2536yvba9pd2xqrr6-pg_net-0.19.5.drv501error: Cannot build '/nix/store/jvalwdcdi2ci9kcx1q2zx6hyla1sa738-pg_net-0.20.0.drv'.502 Reason: builder failed with exit code 2.503 Output paths:504 /nix/store/rqjwkm6vikims9d8b7f0a6x4n2qbkq4s-pg_net-0.20.0505 Last 22 log lines:506 > Running phase: unpackPhase507 > unpacking source archive /nix/store/3783i7yhcfqnyv5ndli22gcr11ap151m-source508 > source root is source509 > Running phase: patchPhase510 > Running phase: updateAutotoolsGnuConfigScriptsPhase511 > Running phase: configurePhase512 > no configure script, doing nothing513 > Running phase: buildPhase514 > gcc -Wall -Wmissing-prototypes -Wpointer-arith -Wdeclaration-after-statement -Werror=vla -Wendif-labels -Wmissing-format-attribute -Wimplicit-fallthrough=3 -Wcast-function-type -Wshadow=compatible-local -Wformat-security -fno-strict-aliasing -fwrapv -fexcess-precision=standard -Wno-format-truncation -Wno-stringop-truncation -g -O2 -std=c11 -Wextra -Wall -Werror -Wno-declaration-after-statement -Wno-vla -Wno-long-long -Wmissing-variable-declarations -fPIC -fvisibility=hidden -DEXTVERSION=\"0.20.0\" -I. -I./ -I/nix/store/qmc7y6nc0qxg50ywm46x4iaqq5knz702-postgresql-17_22/include/server -I/nix/store/qmc7y6nc0qxg50ywm46x4iaqq5knz702-postgresql-17_22/include/internal -D_GNU_SOURCE -I/nix/store/5nl2zr46dic7mxcw6cvbq85wa8c2gngh-libxml2-2.15.1-dev/include/libxml2 -I/nix/store/sl10j863s32x7dv5vw6wfx1nh22f3xh2-lz4-1.10.0-dev/include -I/nix/store/di94mxmhhk390zzzv2gvavfwkgww7q6h-zstd-1.5.7-dev/include -I/nix/store/h5hfqhzcqszmsacj26hh3fngwcal04zs-icu4c-75.1-dev/include -c -o src/core.o src/core.c515 > gcc -Wall -Wmissing-prototypes -Wpointer-arith -Wdeclaration-after-statement -Werror=vla -Wendif-labels -Wmissing-format-attribute -Wimplicit-fallthrough=3 -Wcast-function-type -Wshadow=compatible-local -Wformat-security -fno-strict-aliasing -fwrapv -fexcess-precision=standard -Wno-format-truncation -Wno-stringop-truncation -g -O2 -std=c11 -Wextra -Wall -Werror -Wno-declaration-after-statement -Wno-vla -Wno-long-long -Wmissing-variable-declarations -fPIC -fvisibility=hidden -DEXTVERSION=\"0.20.0\" -I. -I./ -I/nix/store/qmc7y6nc0qxg50ywm46x4iaqq5knz702-postgresql-17_22/include/server -I/nix/store/qmc7y6nc0qxg50ywm46x4iaqq5knz702-postgresql-17_22/include/internal -D_GNU_SOURCE -I/nix/store/5nl2zr46dic7mxcw6cvbq85wa8c2gngh-libxml2-2.15.1-dev/include/libxml2 -I/nix/store/sl10j863s32x7dv5vw6wfx1nh22f3xh2-lz4-1.10.0-dev/include -I/nix/store/di94mxmhhk390zzzv2gvavfwkgww7q6h-zstd-1.5.7-dev/include -I/nix/store/h5hfqhzcqszmsacj26hh3fngwcal04zs-icu4c-75.1-dev/include -c -o src/errors.o src/errors.c516 > gcc -Wall -Wmissing-prototypes -Wpointer-arith -Wdeclaration-after-statement -Werror=vla -Wendif-labels -Wmissing-format-attribute -Wimplicit-fallthrough=3 -Wcast-function-type -Wshadow=compatible-local -Wformat-security -fno-strict-aliasing -fwrapv -fexcess-precision=standard -Wno-format-truncation -Wno-stringop-truncation -g -O2 -std=c11 -Wextra -Wall -Werror -Wno-declaration-after-statement -Wno-vla -Wno-long-long -Wmissing-variable-declarations -fPIC -fvisibility=hidden -DEXTVERSION=\"0.20.0\" -I. -I./ -I/nix/store/qmc7y6nc0qxg50ywm46x4iaqq5knz702-postgresql-17_22/include/server -I/nix/store/qmc7y6nc0qxg50ywm46x4iaqq5knz702-postgresql-17_22/include/internal -D_GNU_SOURCE -I/nix/store/5nl2zr46dic7mxcw6cvbq85wa8c2gngh-libxml2-2.15.1-dev/include/libxml2 -I/nix/store/sl10j863s32x7dv5vw6wfx1nh22f3xh2-lz4-1.10.0-dev/include -I/nix/store/di94mxmhhk390zzzv2gvavfwkgww7q6h-zstd-1.5.7-dev/include -I/nix/store/h5hfqhzcqszmsacj26hh3fngwcal04zs-icu4c-75.1-dev/include -c -o src/event.o src/event.c517 > In file included from /nix/store/wflnb8fxmq4lqx3ca91hlpv95vrqkv51-curl-8.17.0-dev/include/curl/curl.h:3333,518 > from /nix/store/wflnb8fxmq4lqx3ca91hlpv95vrqkv51-curl-8.17.0-dev/include/curl/multi.h:51,519 > from src/event.h:4,520 > from src/event.c:6:521 > /nix/store/wflnb8fxmq4lqx3ca91hlpv95vrqkv51-curl-8.17.0-dev/include/curl/multi.h:429:23: error: expected identifier or '(' before '__extension__'522 > 429 | CURL_EXTERN CURLMcode curl_multi_setopt(CURLM *multi_handle,523 > | ^~~~~~~~~~~~~~~~~524 > /nix/store/wflnb8fxmq4lqx3ca91hlpv95vrqkv51-curl-8.17.0-dev/include/curl/multi.h:429:23: error: expected identifier or '(' before ')' token525 > 429 | CURL_EXTERN CURLMcode curl_multi_setopt(CURLM *multi_handle,526 > | ^~~~~~~~~~~~~~~~~527 > make: *** [<builtin>: src/event.o] Error 1528 For full logs, run:529 nix log /nix/store/jvalwdcdi2ci9kcx1q2zx6hyla1sa738-pg_net-0.20.0.drv530error: Cannot build '/nix/store/7b5ar71808xp6cc9vi64vcr3gxhaq9w2-pg_net-0.14.0.drv'.531 Reason: builder failed with exit code 2.532 Output paths:533 /nix/store/2vyqm50vp9dxrrm1lidjzvr6difmnnqc-pg_net-0.14.0534 Last 25 log lines:535 > src/errors.h:6:11: warning: call to 'Wcurl_easy_setopt_err_long' declared with attribute warning: curl_easy_setopt expects a long argument [-Wattribute-warning]536 > 6 | if (curl_easy_setopt(hdl, opt, prm) != CURLE_OK) \537 > | ^~~~~~~~~~~~~~~~538 > src/core.c:134:3: note: in expansion of macro 'EREPORT_CURL_SETOPT'539 > 134 | EREPORT_CURL_SETOPT(curl_ez_handle, CURLOPT_TIMEOUT_MS, cdata->timeout_milliseconds);540 > | ^~~~~~~~~~~~~~~~~~~541 > src/errors.h:6:11: warning: call to 'Wcurl_easy_setopt_err_long' declared with attribute warning: curl_easy_setopt expects a long argument [-Wattribute-warning]542 > 6 | if (curl_easy_setopt(hdl, opt, prm) != CURLE_OK) \543 > | ^~~~~~~~~~~~~~~~544 > src/core.c:136:3: note: in expansion of macro 'EREPORT_CURL_SETOPT'545 > 136 | EREPORT_CURL_SETOPT(curl_ez_handle, CURLOPT_FOLLOWLOCATION, true);546 > | ^~~~~~~~~~~~~~~~~~~547 > gcc -Wall -Wmissing-prototypes -Wpointer-arith -Wdeclaration-after-statement -Werror=vla -Wendif-labels -Wmissing-format-attribute -Wimplicit-fallthrough=3 -Wcast-function-type -Wformat-security -fno-strict-aliasing -fwrapv -fexcess-precision=standard -Wno-deprecated-non-prototype -Wno-format-truncation -Wno-stringop-truncation -g -O2 -std=gnu17 -std=c11 -Werror -Wno-declaration-after-statement -fPIC -DEXTVERSION=\"0.14.0\" -I. -I./ -I/nix/store/804f042cyc4dca4vwl2fmh1rhfy0sij9-postgresql-15.19/include/server -I/nix/store/804f042cyc4dca4vwl2fmh1rhfy0sij9-postgresql-15.19/include/internal -D_GNU_SOURCE -I/nix/store/5nl2zr46dic7mxcw6cvbq85wa8c2gngh-libxml2-2.15.1-dev/include/libxml2 -I/nix/store/sl10j863s32x7dv5vw6wfx1nh22f3xh2-lz4-1.10.0-dev/include -I/nix/store/di94mxmhhk390zzzv2gvavfwkgww7q6h-zstd-1.5.7-dev/include -I/nix/store/h5hfqhzcqszmsacj26hh3fngwcal04zs-icu4c-75.1-dev/include -c -o src/errors.o src/errors.c548 > gcc -Wall -Wmissing-prototypes -Wpointer-arith -Wdeclaration-after-statement -Werror=vla -Wendif-labels -Wmissing-format-attribute -Wimplicit-fallthrough=3 -Wcast-function-type -Wformat-security -fno-strict-aliasing -fwrapv -fexcess-precision=standard -Wno-deprecated-non-prototype -Wno-format-truncation -Wno-stringop-truncation -g -O2 -std=gnu17 -std=c11 -Werror -Wno-declaration-after-statement -fPIC -DEXTVERSION=\"0.14.0\" -I. -I./ -I/nix/store/804f042cyc4dca4vwl2fmh1rhfy0sij9-postgresql-15.19/include/server -I/nix/store/804f042cyc4dca4vwl2fmh1rhfy0sij9-postgresql-15.19/include/internal -D_GNU_SOURCE -I/nix/store/5nl2zr46dic7mxcw6cvbq85wa8c2gngh-libxml2-2.15.1-dev/include/libxml2 -I/nix/store/sl10j863s32x7dv5vw6wfx1nh22f3xh2-lz4-1.10.0-dev/include -I/nix/store/di94mxmhhk390zzzv2gvavfwkgww7q6h-zstd-1.5.7-dev/include -I/nix/store/h5hfqhzcqszmsacj26hh3fngwcal04zs-icu4c-75.1-dev/include -c -o src/event.o src/event.c549 > In file included from /nix/store/wflnb8fxmq4lqx3ca91hlpv95vrqkv51-curl-8.17.0-dev/include/curl/curl.h:3333,550 > from /nix/store/wflnb8fxmq4lqx3ca91hlpv95vrqkv51-curl-8.17.0-dev/include/curl/multi.h:51,551 > from src/event.h:4,552 > from src/event.c:6:553 > /nix/store/wflnb8fxmq4lqx3ca91hlpv95vrqkv51-curl-8.17.0-dev/include/curl/multi.h:429:23: error: expected identifier or '(' before '__extension__'554 > 429 | CURL_EXTERN CURLMcode curl_multi_setopt(CURLM *multi_handle,555 > | ^~~~~~~~~~~~~~~~~556 > /nix/store/wflnb8fxmq4lqx3ca91hlpv95vrqkv51-curl-8.17.0-dev/include/curl/multi.h:429:23: error: expected identifier or '(' before ')' token557 > 429 | CURL_EXTERN CURLMcode curl_multi_setopt(CURLM *multi_handle,558 > | ^~~~~~~~~~~~~~~~~559 > make: *** [<builtin>: src/event.o] Error 1560 For full logs, run:561 nix log /nix/store/7b5ar71808xp6cc9vi64vcr3gxhaq9w2-pg_net-0.14.0.drv562error: Cannot build '/nix/store/dxjxg15c0m6vdgy5yswqbm50g4fww2p1-pg_net-0.14.0.drv'.563 Reason: builder failed with exit code 2.564 Output paths:565 /nix/store/xqh65xhxx9wcmpgwvzh7kkpf9zs0y72x-pg_net-0.14.0566 Last 25 log lines:567 > src/errors.h:6:11: warning: call to 'Wcurl_easy_setopt_err_long' declared with attribute warning: curl_easy_setopt expects a long argument [-Wattribute-warning]568 > 6 | if (curl_easy_setopt(hdl, opt, prm) != CURLE_OK) \569 > | ^~~~~~~~~~~~~~~~570 > src/core.c:134:3: note: in expansion of macro 'EREPORT_CURL_SETOPT'571 > 134 | EREPORT_CURL_SETOPT(curl_ez_handle, CURLOPT_TIMEOUT_MS, cdata->timeout_milliseconds);572 > | ^~~~~~~~~~~~~~~~~~~573 > src/errors.h:6:11: warning: call to 'Wcurl_easy_setopt_err_long' declared with attribute warning: curl_easy_setopt expects a long argument [-Wattribute-warning]574 > 6 | if (curl_easy_setopt(hdl, opt, prm) != CURLE_OK) \575 > | ^~~~~~~~~~~~~~~~576 > src/core.c:136:3: note: in expansion of macro 'EREPORT_CURL_SETOPT'577 > 136 | EREPORT_CURL_SETOPT(curl_ez_handle, CURLOPT_FOLLOWLOCATION, true);578 > | ^~~~~~~~~~~~~~~~~~~579 > gcc -Wall -Wmissing-prototypes -Wpointer-arith -Wdeclaration-after-statement -Werror=vla -Wendif-labels -Wmissing-format-attribute -Wimplicit-fallthrough=3 -Wcast-function-type -Wshadow=compatible-local -Wformat-security -fno-strict-aliasing -fwrapv -fexcess-precision=standard -Wno-format-truncation -Wno-stringop-truncation -g -O2 -std=c11 -Werror -Wno-declaration-after-statement -fPIC -fvisibility=hidden -DEXTVERSION=\"0.14.0\" -I. -I./ -I/nix/store/qmc7y6nc0qxg50ywm46x4iaqq5knz702-postgresql-17_22/include/server -I/nix/store/qmc7y6nc0qxg50ywm46x4iaqq5knz702-postgresql-17_22/include/internal -D_GNU_SOURCE -I/nix/store/5nl2zr46dic7mxcw6cvbq85wa8c2gngh-libxml2-2.15.1-dev/include/libxml2 -I/nix/store/sl10j863s32x7dv5vw6wfx1nh22f3xh2-lz4-1.10.0-dev/include -I/nix/store/di94mxmhhk390zzzv2gvavfwkgww7q6h-zstd-1.5.7-dev/include -I/nix/store/h5hfqhzcqszmsacj26hh3fngwcal04zs-icu4c-75.1-dev/include -c -o src/errors.o src/errors.c580 > gcc -Wall -Wmissing-prototypes -Wpointer-arith -Wdeclaration-after-statement -Werror=vla -Wendif-labels -Wmissing-format-attribute -Wimplicit-fallthrough=3 -Wcast-function-type -Wshadow=compatible-local -Wformat-security -fno-strict-aliasing -fwrapv -fexcess-precision=standard -Wno-format-truncation -Wno-stringop-truncation -g -O2 -std=c11 -Werror -Wno-declaration-after-statement -fPIC -fvisibility=hidden -DEXTVERSION=\"0.14.0\" -I. -I./ -I/nix/store/qmc7y6nc0qxg50ywm46x4iaqq5knz702-postgresql-17_22/include/server -I/nix/store/qmc7y6nc0qxg50ywm46x4iaqq5knz702-postgresql-17_22/include/internal -D_GNU_SOURCE -I/nix/store/5nl2zr46dic7mxcw6cvbq85wa8c2gngh-libxml2-2.15.1-dev/include/libxml2 -I/nix/store/sl10j863s32x7dv5vw6wfx1nh22f3xh2-lz4-1.10.0-dev/include -I/nix/store/di94mxmhhk390zzzv2gvavfwkgww7q6h-zstd-1.5.7-dev/include -I/nix/store/h5hfqhzcqszmsacj26hh3fngwcal04zs-icu4c-75.1-dev/include -c -o src/event.o src/event.c581 > In file included from /nix/store/wflnb8fxmq4lqx3ca91hlpv95vrqkv51-curl-8.17.0-dev/include/curl/curl.h:3333,582 > from /nix/store/wflnb8fxmq4lqx3ca91hlpv95vrqkv51-curl-8.17.0-dev/include/curl/multi.h:51,583 > from src/event.h:4,584 > from src/event.c:6:585 > /nix/store/wflnb8fxmq4lqx3ca91hlpv95vrqkv51-curl-8.17.0-dev/include/curl/multi.h:429:23: error: expected identifier or '(' before '__extension__'586 > 429 | CURL_EXTERN CURLMcode curl_multi_setopt(CURLM *multi_handle,587 > | ^~~~~~~~~~~~~~~~~588 > /nix/store/wflnb8fxmq4lqx3ca91hlpv95vrqkv51-curl-8.17.0-dev/include/curl/multi.h:429:23: error: expected identifier or '(' before ')' token589 > 429 | CURL_EXTERN CURLMcode curl_multi_setopt(CURLM *multi_handle,590 > | ^~~~~~~~~~~~~~~~~591 > make: *** [<builtin>: src/event.o] Error 1592 For full logs, run:593 nix log /nix/store/dxjxg15c0m6vdgy5yswqbm50g4fww2p1-pg_net-0.14.0.drv594error: Cannot build '/nix/store/bv2b3hyfiwg59frhybs6cmf9l26byfrs-pg_net-0.13.0.drv'.595 Reason: builder failed with exit code 2.596 Output paths:597 /nix/store/78qw5358gp449syn03ah921j442fw14j-pg_net-0.13.0598 Last 25 log lines:599 > | ^~~~~~~~~~~~~~600 > src/util.h:6:11: warning: call to 'Wcurl_easy_setopt_err_long' declared with attribute warning: curl_easy_setopt expects a long argument [-Wattribute-warning]601 > 6 | if (curl_easy_setopt(hdl, opt, prm) != CURLE_OK) \602 > | ^~~~~~~~~~~~~~~~603 > src/core.c:108:3: note: in expansion of macro 'CURL_EZ_SETOPT'604 > 108 | CURL_EZ_SETOPT(curl_ez_handle, CURLOPT_TIMEOUT_MS, timeout_milliseconds);605 > | ^~~~~~~~~~~~~~606 > src/util.h:6:11: warning: call to 'Wcurl_easy_setopt_err_long' declared with attribute warning: curl_easy_setopt expects a long argument [-Wattribute-warning]607 > 6 | if (curl_easy_setopt(hdl, opt, prm) != CURLE_OK) \608 > | ^~~~~~~~~~~~~~~~609 > src/core.c:110:3: note: in expansion of macro 'CURL_EZ_SETOPT'610 > 110 | CURL_EZ_SETOPT(curl_ez_handle, CURLOPT_FOLLOWLOCATION, true);611 > | ^~~~~~~~~~~~~~612 > gcc -Wall -Wmissing-prototypes -Wpointer-arith -Wdeclaration-after-statement -Werror=vla -Wendif-labels -Wmissing-format-attribute -Wimplicit-fallthrough=3 -Wcast-function-type -Wshadow=compatible-local -Wformat-security -fno-strict-aliasing -fwrapv -fexcess-precision=standard -Wno-format-truncation -Wno-stringop-truncation -g -O2 -std=c11 -Werror -Wno-declaration-after-statement -fPIC -fvisibility=hidden -DEXTVERSION=\"0.13.0\" -I. -I./ -I/nix/store/qmc7y6nc0qxg50ywm46x4iaqq5knz702-postgresql-17_22/include/server -I/nix/store/qmc7y6nc0qxg50ywm46x4iaqq5knz702-postgresql-17_22/include/internal -D_GNU_SOURCE -I/nix/store/5nl2zr46dic7mxcw6cvbq85wa8c2gngh-libxml2-2.15.1-dev/include/libxml2 -I/nix/store/sl10j863s32x7dv5vw6wfx1nh22f3xh2-lz4-1.10.0-dev/include -I/nix/store/di94mxmhhk390zzzv2gvavfwkgww7q6h-zstd-1.5.7-dev/include -I/nix/store/h5hfqhzcqszmsacj26hh3fngwcal04zs-icu4c-75.1-dev/include -c -o src/event.o src/event.c613 > In file included from /nix/store/wflnb8fxmq4lqx3ca91hlpv95vrqkv51-curl-8.17.0-dev/include/curl/curl.h:3333,614 > from /nix/store/wflnb8fxmq4lqx3ca91hlpv95vrqkv51-curl-8.17.0-dev/include/curl/multi.h:51,615 > from src/event.h:4,616 > from src/event.c:6:617 > /nix/store/wflnb8fxmq4lqx3ca91hlpv95vrqkv51-curl-8.17.0-dev/include/curl/multi.h:429:23: error: expected identifier or '(' before '__extension__'618 > 429 | CURL_EXTERN CURLMcode curl_multi_setopt(CURLM *multi_handle,619 > | ^~~~~~~~~~~~~~~~~620 > /nix/store/wflnb8fxmq4lqx3ca91hlpv95vrqkv51-curl-8.17.0-dev/include/curl/multi.h:429:23: error: expected identifier or '(' before ')' token621 > 429 | CURL_EXTERN CURLMcode curl_multi_setopt(CURLM *multi_handle,622 > | ^~~~~~~~~~~~~~~~~623 > make: *** [<builtin>: src/event.o] Error 1624 For full logs, run:625 nix log /nix/store/bv2b3hyfiwg59frhybs6cmf9l26byfrs-pg_net-0.13.0.drv626error: Cannot build '/nix/store/zd0hg58y5nwnnwfzy7sd19l7dzx4zvv5-pg_net.drv'.627 Reason: 4 dependencies failed.628 Output paths:629 /nix/store/5j8is0c6fp325l5akxcq6digg430r2fy-pg_net630error: Cannot build '/nix/store/m7073j3kxn6vxs53jdm448q51cxiimys-postgresql-and-plugins-17_22.drv'.631 Reason: 1 dependency failed.632 Output paths:633 /nix/store/z04smpdjsr0zxxl7phxyvwwh4ycfq6c5-postgresql-and-plugins-17_22634error: Cannot build '/nix/store/q8qv7gf9izi4my9mjapggg0fx2dhzlwc-postgresql-and-plugins-17_22.drv'.635 Reason: 1 dependency failed.636 Output paths:637 /nix/store/y845ymwkrl6d1g0swpxgxwk72nyclj1s-postgresql-and-plugins-17_22638error: Cannot build '/nix/store/y85ggf9qcv7hsaxx3fyr5a14nf67953g-postgresql-orioledb-init.drv'.639 Reason: 1 dependency failed.640 Output paths:641 /nix/store/ljganhrp9i6y9sfsqv77nzm8ylql0ial-postgresql-orioledb-init642error: Cannot build '/nix/store/7p4sg9x4d75pncaxpl0sa51ja5k2bik8-supabase-orioledb-db-init.drv'.643 Reason: 1 dependency failed.644 Output paths:645 /nix/store/584vyxv0pxm2ks5a423n8i4n4jjfbmza-supabase-orioledb-db-init646error: Cannot build '/nix/store/6dmfl5hj72ck728kvz45gg2241dk81ci-unit-postgresql.service.drv'.647 Reason: 2 dependencies failed.648 Output paths:649 /nix/store/4d86ahvbvwk5brsw0hnkci0nq2i5hzbs-unit-postgresql.service650error: Cannot build '/nix/store/dadjlp1c0v94bsq44xmi8yl99z9dwd3n-unit-supabase-db-init.service.drv'.651 Reason: 1 dependency failed.652 Output paths:653 /nix/store/224g1r7756ryqw509vkfqxila6hi91bb-unit-supabase-db-init.service654error: Cannot build '/nix/store/ggfg6al5fkdp0r1jsc3iabgz0p7g6l1m-pg_net-0.7.drv'.655 Reason: builder failed with exit code 2.656 Output paths:657 /nix/store/pkfapf0li10b8b6nrhwm8880g4d2i8y5-pg_net-0.7658 Last 25 log lines:659 > | ^~~~~~~~~~~~~~660 > src/util.h:6:11: warning: call to 'Wcurl_easy_setopt_err_long' declared with attribute warning: curl_easy_setopt expects a long argument [-Wattribute-warning]661 > 6 | if (curl_easy_setopt(hdl, opt, prm) != CURLE_OK) \662 > | ^~~~~~~~~~~~~~~~663 > src/core.c:108:3: note: in expansion of macro 'CURL_EZ_SETOPT'664 > 108 | CURL_EZ_SETOPT(curl_ez_handle, CURLOPT_TIMEOUT_MS, timeout_milliseconds);665 > | ^~~~~~~~~~~~~~666 > src/util.h:6:11: warning: call to 'Wcurl_easy_setopt_err_long' declared with attribute warning: curl_easy_setopt expects a long argument [-Wattribute-warning]667 > 6 | if (curl_easy_setopt(hdl, opt, prm) != CURLE_OK) \668 > | ^~~~~~~~~~~~~~~~669 > src/core.c:110:3: note: in expansion of macro 'CURL_EZ_SETOPT'670 > 110 | CURL_EZ_SETOPT(curl_ez_handle, CURLOPT_FOLLOWLOCATION, true);671 > | ^~~~~~~~~~~~~~672 > gcc -Wall -Wmissing-prototypes -Wpointer-arith -Wdeclaration-after-statement -Werror=vla -Wendif-labels -Wmissing-format-attribute -Wimplicit-fallthrough=3 -Wcast-function-type -Wformat-security -fno-strict-aliasing -fwrapv -fexcess-precision=standard -Wno-deprecated-non-prototype -Wno-format-truncation -Wno-stringop-truncation -g -O2 -std=gnu17 -std=c11 -Werror -Wno-declaration-after-statement -fPIC -DEXTVERSION=\"0.13.0\" -I. -I./ -I/nix/store/804f042cyc4dca4vwl2fmh1rhfy0sij9-postgresql-15.19/include/server -I/nix/store/804f042cyc4dca4vwl2fmh1rhfy0sij9-postgresql-15.19/include/internal -D_GNU_SOURCE -I/nix/store/5nl2zr46dic7mxcw6cvbq85wa8c2gngh-libxml2-2.15.1-dev/include/libxml2 -I/nix/store/sl10j863s32x7dv5vw6wfx1nh22f3xh2-lz4-1.10.0-dev/include -I/nix/store/di94mxmhhk390zzzv2gvavfwkgww7q6h-zstd-1.5.7-dev/include -I/nix/store/h5hfqhzcqszmsacj26hh3fngwcal04zs-icu4c-75.1-dev/include -c -o src/event.o src/event.c673 > In file included from /nix/store/wflnb8fxmq4lqx3ca91hlpv95vrqkv51-curl-8.17.0-dev/include/curl/curl.h:3333,674 > from /nix/store/wflnb8fxmq4lqx3ca91hlpv95vrqkv51-curl-8.17.0-dev/include/curl/multi.h:51,675 > from src/event.h:4,676 > from src/event.c:6:677 > /nix/store/wflnb8fxmq4lqx3ca91hlpv95vrqkv51-curl-8.17.0-dev/include/curl/multi.h:429:23: error: expected identifier or '(' before '__extension__'678 > 429 | CURL_EXTERN CURLMcode curl_multi_setopt(CURLM *multi_handle,679 > | ^~~~~~~~~~~~~~~~~680 > /nix/store/wflnb8fxmq4lqx3ca91hlpv95vrqkv51-curl-8.17.0-dev/include/curl/multi.h:429:23: error: expected identifier or '(' before ')' token681 > 429 | CURL_EXTERN CURLMcode curl_multi_setopt(CURLM *multi_handle,682 > | ^~~~~~~~~~~~~~~~~683 > make: *** [<builtin>: src/event.o] Error 1684 For full logs, run:685 nix log /nix/store/ggfg6al5fkdp0r1jsc3iabgz0p7g6l1m-pg_net-0.7.drv686error: Cannot build '/nix/store/5v6a4ssacxc4snck5dzagkmqhcsh2swz-pg_net-0.19.5.drv'.687 Reason: builder failed with exit code 2.688 Output paths:689 /nix/store/xcsw4jyz7w5071r5drjiify20gjvij99-pg_net-0.19.5690 Last 22 log lines:691 > Running phase: unpackPhase692 > unpacking source archive /nix/store/5zgdqy3bz93jyn79pizxc1hks0cdcadw-source693 > source root is source694 > Running phase: patchPhase695 > Running phase: updateAutotoolsGnuConfigScriptsPhase696 > Running phase: configurePhase697 > no configure script, doing nothing698 > Running phase: buildPhase699 > gcc -Wall -Wmissing-prototypes -Wpointer-arith -Wdeclaration-after-statement -Werror=vla -Wendif-labels -Wmissing-format-attribute -Wimplicit-fallthrough=3 -Wcast-function-type -Wformat-security -fno-strict-aliasing -fwrapv -fexcess-precision=standard -Wno-deprecated-non-prototype -Wno-format-truncation -Wno-stringop-truncation -g -O2 -std=gnu17 -std=c11 -Wextra -Wall -Werror -Wno-declaration-after-statement -Wno-vla -Wno-long-long -Wmissing-variable-declarations -fPIC -DEXTVERSION=\"0.19.5\" -I. -I./ -I/nix/store/804f042cyc4dca4vwl2fmh1rhfy0sij9-postgresql-15.19/include/server -I/nix/store/804f042cyc4dca4vwl2fmh1rhfy0sij9-postgresql-15.19/include/internal -D_GNU_SOURCE -I/nix/store/5nl2zr46dic7mxcw6cvbq85wa8c2gngh-libxml2-2.15.1-dev/include/libxml2 -I/nix/store/sl10j863s32x7dv5vw6wfx1nh22f3xh2-lz4-1.10.0-dev/include -I/nix/store/di94mxmhhk390zzzv2gvavfwkgww7q6h-zstd-1.5.7-dev/include -I/nix/store/h5hfqhzcqszmsacj26hh3fngwcal04zs-icu4c-75.1-dev/include -c -o src/core.o src/core.c700 > gcc -Wall -Wmissing-prototypes -Wpointer-arith -Wdeclaration-after-statement -Werror=vla -Wendif-labels -Wmissing-format-attribute -Wimplicit-fallthrough=3 -Wcast-function-type -Wformat-security -fno-strict-aliasing -fwrapv -fexcess-precision=standard -Wno-deprecated-non-prototype -Wno-format-truncation -Wno-stringop-truncation -g -O2 -std=gnu17 -std=c11 -Wextra -Wall -Werror -Wno-declaration-after-statement -Wno-vla -Wno-long-long -Wmissing-variable-declarations -fPIC -DEXTVERSION=\"0.19.5\" -I. -I./ -I/nix/store/804f042cyc4dca4vwl2fmh1rhfy0sij9-postgresql-15.19/include/server -I/nix/store/804f042cyc4dca4vwl2fmh1rhfy0sij9-postgresql-15.19/include/internal -D_GNU_SOURCE -I/nix/store/5nl2zr46dic7mxcw6cvbq85wa8c2gngh-libxml2-2.15.1-dev/include/libxml2 -I/nix/store/sl10j863s32x7dv5vw6wfx1nh22f3xh2-lz4-1.10.0-dev/include -I/nix/store/di94mxmhhk390zzzv2gvavfwkgww7q6h-zstd-1.5.7-dev/include -I/nix/store/h5hfqhzcqszmsacj26hh3fngwcal04zs-icu4c-75.1-dev/include -c -o src/errors.o src/errors.c701 > gcc -Wall -Wmissing-prototypes -Wpointer-arith -Wdeclaration-after-statement -Werror=vla -Wendif-labels -Wmissing-format-attribute -Wimplicit-fallthrough=3 -Wcast-function-type -Wformat-security -fno-strict-aliasing -fwrapv -fexcess-precision=standard -Wno-deprecated-non-prototype -Wno-format-truncation -Wno-stringop-truncation -g -O2 -std=gnu17 -std=c11 -Wextra -Wall -Werror -Wno-declaration-after-statement -Wno-vla -Wno-long-long -Wmissing-variable-declarations -fPIC -DEXTVERSION=\"0.19.5\" -I. -I./ -I/nix/store/804f042cyc4dca4vwl2fmh1rhfy0sij9-postgresql-15.19/include/server -I/nix/store/804f042cyc4dca4vwl2fmh1rhfy0sij9-postgresql-15.19/include/internal -D_GNU_SOURCE -I/nix/store/5nl2zr46dic7mxcw6cvbq85wa8c2gngh-libxml2-2.15.1-dev/include/libxml2 -I/nix/store/sl10j863s32x7dv5vw6wfx1nh22f3xh2-lz4-1.10.0-dev/include -I/nix/store/di94mxmhhk390zzzv2gvavfwkgww7q6h-zstd-1.5.7-dev/include -I/nix/store/h5hfqhzcqszmsacj26hh3fngwcal04zs-icu4c-75.1-dev/include -c -o src/event.o src/event.c702 > In file included from /nix/store/wflnb8fxmq4lqx3ca91hlpv95vrqkv51-curl-8.17.0-dev/include/curl/curl.h:3333,703 > from /nix/store/wflnb8fxmq4lqx3ca91hlpv95vrqkv51-curl-8.17.0-dev/include/curl/multi.h:51,704 > from src/event.h:4,705 > from src/event.c:6:706 > /nix/store/wflnb8fxmq4lqx3ca91hlpv95vrqkv51-curl-8.17.0-dev/include/curl/multi.h:429:23: error: expected identifier or '(' before '__extension__'707 > 429 | CURL_EXTERN CURLMcode curl_multi_setopt(CURLM *multi_handle,708 > | ^~~~~~~~~~~~~~~~~709 > /nix/store/wflnb8fxmq4lqx3ca91hlpv95vrqkv51-curl-8.17.0-dev/include/curl/multi.h:429:23: error: expected identifier or '(' before ')' token710 > 429 | CURL_EXTERN CURLMcode curl_multi_setopt(CURLM *multi_handle,711 > | ^~~~~~~~~~~~~~~~~712 > make: *** [<builtin>: src/event.o] Error 1713 For full logs, run:714 nix log /nix/store/5v6a4ssacxc4snck5dzagkmqhcsh2swz-pg_net-0.19.5.drv715error: Cannot build '/nix/store/94hi7qqfg86lfxqnyqizx334my0yjbh3-pg_net.drv'.716 Reason: 5 dependencies failed.717 Output paths:718 /nix/store/88g5knkc68im4z0plvckvdf0ag9pl97y-pg_net719error: Cannot build '/nix/store/a5gfyj0k47cxv70v4a1zhhk1998vd290-postgresql-and-plugins-15.19.drv'.720 Reason: 1 dependency failed.721 Output paths:722 /nix/store/zn5pxdcd7zf2nviqxmbqb3whv0b89njc-postgresql-and-plugins-15.19723error: Cannot build '/nix/store/69zc44dp9979jf4p9hcpgfdf1wgpw40l-postgresql-and-plugins-15.19.drv'.724 Reason: 1 dependency failed.725 Output paths:726 /nix/store/hhm9gzfpx0h3lp8ld4wvl64kwnddl1yd-postgresql-and-plugins-15.19727error: Cannot build '/nix/store/yr25cab0bgg2gdcjr0fkk052aqw4ag84-postgresql-init.drv'.728 Reason: 1 dependency failed.729 Output paths:730 /nix/store/7nv58lyapj4mqdczihsi6cfmcydjazv0-postgresql-init731error: Cannot build '/nix/store/319yam8jpgm13yfxs5psx2g1j4zd346h-postgresql-migrate.drv'.732 Reason: 2 dependencies failed.733 Output paths:734 /nix/store/rpg8r2qwvwslgphbrd164k6alxbq4zpq-postgresql-migrate735error: Cannot build '/nix/store/9dhmhlajdjqsz58msmq42lwanwgk4c0z-supabase-db-init.drv'.736 Reason: 1 dependency failed.737 Output paths:738 /nix/store/04kjr2y1f7hkywc7dmww3n56f9awljyv-supabase-db-init739error: Cannot build '/nix/store/ggzwf7y9bbwypxs8a44lg59dd3cbp5k5-system-path.drv'.740 Reason: 2 dependencies failed.741 Output paths:742 /nix/store/2jflmsikx3zpi2kl04372bz76n24mmmh-system-path743error: Cannot build '/nix/store/rp3411xgkcmbnrvxwgg7kxxlhj217519-system-path.drv'.744 Reason: 2 dependencies failed.745 Output paths:746 /nix/store/kx4lvchs53hma4qg0i96hchxf6l84a5d-system-path747error: Cannot build '/nix/store/sn90bhb87fs1r7szfvpnhakcf5cbqipi-system-path.drv'.748 Reason: 1 dependency failed.749 Output paths:750 /nix/store/d1l9p7cxy6frga61c961vbakykybwla0-system-path751error: Cannot build '/nix/store/7mf1lcyklc71a89s4mi3r7w8k39ihvya-dbus-1.drv'.752 Reason: 1 dependency failed.753 Output paths:754 /nix/store/kw6ni7kh3277pz2yj4mabcb1y91fj4fm-dbus-1755error: Cannot build '/nix/store/jwcb2kgwrcwds3m6z7byrg26qackyaxf-dbus-1.drv'.756 Reason: 1 dependency failed.757 Output paths:758 /nix/store/fz2sb148fkcajn05ynvjfm5frqpx68m1-dbus-1759error: Cannot build '/nix/store/rnjj94ch4qaxpyhgvk900hq1rp2ji4cx-dbus-1.drv'.760 Reason: 1 dependency failed.761 Output paths:762 /nix/store/9an5r6jm2y6kpbk4r0b8sibw0vkf19vj-dbus-1763error: Cannot build '/nix/store/xvpj8kcdwibf0zb3lvh74lg9sn132fb6-unit-postgresql-migrate.service.drv'.764 Reason: 1 dependency failed.765 Output paths:766 /nix/store/l0w9p74lwhi21rjz4554f0qafxjgl47r-unit-postgresql-migrate.service767error: Cannot build '/nix/store/18idp8l89ga0vbjdvp5y33m42h8ypb3n-unit-postgresql.service.drv'.768 Reason: 2 dependencies failed.769 Output paths:770 /nix/store/107kzs2gwas10ryhvr2x3ch174m6f6i3-unit-postgresql.service771error: Cannot build '/nix/store/vl4z7w7y2dciycqgcm6qp86dpgddrqgg-unit-postgresql.service.drv'.772 Reason: 2 dependencies failed.773 Output paths:774 /nix/store/k5gqg28zclcqsxfm34fyz0vqq6nrhmj9-unit-postgresql.service775error: Cannot build '/nix/store/9189fi92i7805xz024zxxwljw2xfqplf-unit-supabase-db-init.service.drv'.776 Reason: 1 dependency failed.777 Output paths:778 /nix/store/n1bvlic1id0sybb254vs4nzw75kv51jn-unit-supabase-db-init.service779error: Cannot build '/nix/store/bj8k3q4xx5yxsjpcz0k6pjkann65ifyp-X-Restart-Triggers-dbus.drv'.780 Reason: 1 dependency failed.781 Output paths:782 /nix/store/m5s8iv4fvwca77nj8x9gzi2kbkbhkwj5-X-Restart-Triggers-dbus783error: Cannot build '/nix/store/hkbib28lgy3sdk60wwh6fnjx17lrpkd0-X-Restart-Triggers-dbus.drv'.784 Reason: 1 dependency failed.785 Output paths:786 /nix/store/dykpq6m9x904fkf5li1wl1g95ijg9ag2-X-Restart-Triggers-dbus787error: Cannot build '/nix/store/wd8irv2ffhnmkp1bdcqcf4x5nyhapq43-X-Restart-Triggers-dbus.drv'.788 Reason: 1 dependency failed.789 Output paths:790 /nix/store/v0cz3xq1yacg7hy4vw9qbq7krai8szxa-X-Restart-Triggers-dbus791error: Cannot build '/nix/store/2i01a9qxfbdjlvkl937aq52x148dm5hk-unit-dbus.service.drv'.792 Reason: 1 dependency failed.793 Output paths:794 /nix/store/5a52fh7fc53ay515sc03ffina2qnx016-unit-dbus.service795error: Cannot build '/nix/store/9hia6rkh5qzm30dxyfjihl6251cmnv0l-unit-dbus.service.drv'.796 Reason: 1 dependency failed.797 Output paths:798 /nix/store/4rc70981za6xs4ngbzz75kjzm3w511wc-unit-dbus.service799error: Cannot build '/nix/store/a0nhwyhawfp54kccbpjcvlkybsc46m66-unit-dbus.service.drv'.800 Reason: 1 dependency failed.801 Output paths:802 /nix/store/pm59aikr1pgkii8lbjgy9c339k6gkk70-unit-dbus.service803error: Cannot build '/nix/store/ks9rz4w18q5w6apnl8bszi42p6fqb7w9-unit-dbus.service.drv'.804 Reason: 1 dependency failed.805 Output paths:806 /nix/store/4ivywhvyw3mwb077ypjyzzkgmkm6hdzi-unit-dbus.service807error: Cannot build '/nix/store/ljfzjxqwx4kxjwxjjlnpaqdzh0xqd7xr-unit-dbus.service.drv'.808 Reason: 1 dependency failed.809 Output paths:810 /nix/store/2ah9ks1byg1x3j9kg1x6mbbmykxgl9s1-unit-dbus.service811error: Cannot build '/nix/store/zbb4xyx08cfb7d20vxf6chbzvcw94xva-unit-dbus.service.drv'.812 Reason: 1 dependency failed.813 Output paths:814 /nix/store/dykdj7nvn6dhqk3a88l90a3kcvz0x5vp-unit-dbus.service815error: Cannot build '/nix/store/bk16kzbxqyyqfg6qlmkplrgfhv7k21kl-system-units.drv'.816 Reason: 3 dependencies failed.817 Output paths:818 /nix/store/5hc8xp1vv3vx3vl70cngxm69f7xq9v25-system-units819error: Cannot build '/nix/store/nnswm02aq5rs1v3j77dlnha5mh5c19z7-system-units.drv'.820 Reason: 3 dependencies failed.821 Output paths:822 /nix/store/xc89nsmmxclandfqqfs4kks5mh5m9iya-system-units823error: Cannot build '/nix/store/w29pxvjbvdmyac5wz16l2kakq9n2w4dn-system-units.drv'.824 Reason: 3 dependencies failed.825 Output paths:826 /nix/store/2wkv7zmc05vlyn9797agk3w3grgyiyqp-system-units827error: Cannot build '/nix/store/6axq4j62rji3faz7rvgyjfccczni7z3n-user-units.drv'.828 Reason: 1 dependency failed.829 Output paths:830 /nix/store/y2f4sk4ka6ihz6v4q0hbli1bipmxgrlf-user-units831error: Cannot build '/nix/store/6w9n69ddwya8kjxyrz8n8p48cnhhv8m2-user-units.drv'.832 Reason: 1 dependency failed.833 Output paths:834 /nix/store/d63ihld7njm0bz4m9s6bz2bj5bg4kmqm-user-units835error: Cannot build '/nix/store/jphjq6s3xb6lm1r9a0yllq3wvcijkikd-user-units.drv'.836 Reason: 1 dependency failed.837 Output paths:838 /nix/store/9kr2570q5fkwfrvcvd5r7vr4p5n9bn1r-user-units839error: Cannot build '/nix/store/5i64fsbcnqkbbwyscs590q4x0kckm8vz-etc.drv'.840 Reason: 4 dependencies failed.841 Output paths:842 /nix/store/id8grildviwmlw31q8w30fyk3c4cyhlw-etc843error: Cannot build '/nix/store/dys7bm2r3m1f5zv7a66ajhqdsxph4zlw-etc.drv'.844 Reason: 4 dependencies failed.845 Output paths:846 /nix/store/nsbdx81bppdz5a7lyzsbv7s97qh52vlp-etc847error: Cannot build '/nix/store/yigqx2853rhqfbmrfci5bzld6c089mrd-etc.drv'.848 Reason: 4 dependencies failed.849 Output paths:850 /nix/store/j65wr0g6yjn70yxfwvwvm8n6xb4zlp97-etc851error: Cannot build '/nix/store/0mzm2f6fa46w1xld4wk2fb47gg0spks1-activate.drv'.852 Reason: 1 dependency failed.853 Output paths:854 /nix/store/dz71l6nx8zwrr604q4bqkbj3mnb19y78-activate855error: Cannot build '/nix/store/9i17zb3islwpb2pj7iwsw6d08gv9zdi2-activate.drv'.856 Reason: 1 dependency failed.857 Output paths:858 /nix/store/lplwwpzas08vvhnpcpq2wsxa0iwzykyv-activate859error: Cannot build '/nix/store/f3zaq5gia1p450hfwx1a5ka9b2crwvpc-activate.drv'.860 Reason: 1 dependency failed.861 Output paths:862 /nix/store/fs4g4l5vxpi515v6ki5mm5bff92cxjm8-activate863error: Cannot build '/nix/store/flpw9rfcwf20596nm3x5g91lj4wx6gsa-nixos-system-server-test.drv'.864 Reason: 3 dependencies failed.865 Output paths:866 /nix/store/b2y0ydacc3q228q5ng7sx3ahix9jmmrc-nixos-system-server-test867error: Cannot build '/nix/store/imr0jfl9r75i4l9br1zkqw4li7qls97p-nixos-system-server-test.drv'.868 Reason: 3 dependencies failed.869 Output paths:870 /nix/store/fp9xi6s4v3xhr3cvihbgvly7dvjxbr9b-nixos-system-server-test871error: Cannot build '/nix/store/zn5pqckvabyvbj8b760an4hwnbp3x1vx-nixos-system-server-test.drv'.872 Reason: 5 dependencies failed.873 Output paths:874 /nix/store/4a0v768sma96paf065lwj3c0baxbwwmq-nixos-system-server-test875error: Cannot build '/nix/store/l3g0a20fmxqmkdp4radxq4r3xd5jwzjy-closure-info.drv'.876 Reason: 1 dependency failed.877 Output paths:878 /nix/store/zb01z9b1jjvd3kxr2rxhgrayzjbjp6sp-closure-info879error: Cannot build '/nix/store/q1smldjprgklvy119fkq6b38a23idjc4-run-nixos-vm.drv'.880 Reason: 2 dependencies failed.881 Output paths:882 /nix/store/21alg8q3cb7j8dv42jy2rkmk2zixr935-run-nixos-vm883error: Cannot build '/nix/store/c0y8vb21y52ps11vi8ajzkqyvl7dd7nz-nixos-vm.drv'.884 Reason: 2 dependencies failed.885 Output paths:886 /nix/store/hl9ffgp199r4ciynbkr96ykzq247zy1w-nixos-vm887error: Cannot build '/nix/store/2ajcsich9vapbnvfc28pn3di54v0sq9x-nixos-test-driver-pg_repack.drv'.888 Reason: 2 dependencies failed.889 Output paths:890 /nix/store/anvcz679fn3lqizc0dwicbdd0l9hl4qx-nixos-test-driver-pg_repack891error: Cannot build '/nix/store/cqiimg6qbcnqf3pkis23iz8f438m4v37-vm-test-run-pg_repack.drv'.892 Reason: 1 dependency failed.893 Output paths:894 /nix/store/5hf7d8lfh5vr0wzx27llimqrfnnbjqhl-vm-test-run-pg_repack