setup
checks.aarch64-linux.ext-postgis
· build #133
· raw
1these 235 derivations will be built:2 /nix/store/0cmixqwsz3vb82j49j1mhvyk8crg4dcw-wrappers-0.6.0.drv3 /nix/store/f4fxzxll7q3m5cy6rib758j63zcky8dk-supabase_vault-0.2.8.drv4 /nix/store/0dxji73cc07dbqk8nny6y5mkf5qr6kl8-supabase_vault.drv5 /nix/store/fl27cr5qdrq44nk61x5yjlqxsrc8mg3n-pgsodium-3.0.4.drv6 /nix/store/jl20dg8fxlmlv84f7cda9xa6mq8y46sr-pgsodium-3.1.7.drv7 /nix/store/pvz0jf5drhdz4jj5k592kxbdgk4lm52r-pgsodium-3.1.6.drv8 /nix/store/zdz6b4s43i332x3xlvjivc7p4csihzba-pgsodium-3.1.5.drv9 /nix/store/0h7mnh8was4m19z53z0dmakrp0c9271q-pgsodium.drv10 /nix/store/0i6b8yy32fc4mgfm75w94gw9ja033kw5-wrappers-0.5.5.drv11 /nix/store/h1vl8vpk154yppn5lcqms2680igi0mmj-postgis-3.3.2.drv12 /nix/store/2ylkw9crapb58vd5g0vj602jfyb1p3r6-postgis.drv13 /nix/store/58cinn47vbvwr1wxdkspmvi9cj27b07h-safeupdate-1.4.drv14 /nix/store/6c0mnd757hvxppfyrsf4cb1wgnbd4111-safeupdate.drv15 /nix/store/k4swwy7459wf558rbrraclsr4sjccz0h-pgmq-1.4.4.drv16 /nix/store/8zsadvm8mv18kpy4qy724ps2jlbsik0w-pgmq.drv17 /nix/store/4wk9vb1q3kdnhj8hsq8pwgbp82glwg9w-timescaledb-2.9.1.drv18 /nix/store/9wzj3wh6sczzk849dmjwvmnkshggakxp-timescaledb.drv19 /nix/store/2nmg9sxx50xmndps3714hbvwjyd5rqv0-vector-0.8.2.drv20 /nix/store/alajylsl9b90m65n0ps0mkbkw679x4sn-vector-0.6.2.drv21 /nix/store/jmilv9h5p0v4grgqnhfn22i7zl352ybh-vector-0.7.4.drv22 /nix/store/q3mdjvqpw4xbwcjy5y1ps1igxsjvx133-vector-0.7.0.drv23 /nix/store/v5dnr617av2jgk6kpddxbxxqjqgl5kzg-vector-0.8.0.drv24 /nix/store/z40s48rz55qgpw6g6wiqi68hkfas4h1l-vector-0.6.0.drv25 /nix/store/9zndhfzc45vrfn297g1hav7m6ba3rlzk-vector.drv26 /nix/store/c08rdgxba5n6zhyp78l8sd6fhnbc4a4c-pgsodium-3.1.7.drv27 /nix/store/hh2jpg5qdwgdwzi96qcay1a5ffhi0f4i-pgsodium-3.1.6.drv28 /nix/store/jwrjvb9m50v44sla4jpig83jab7zn17x-pgsodium-3.1.8.drv29 /nix/store/m1xdmpffkflwgdin5ljvfh72wxq5lxpx-pgsodium-3.1.5.drv30 /nix/store/a9laaq557mna86dm87lq3211xy5h2zyl-pgsodium.drv31 /nix/store/i0gq8yqxp5h7l782n2ki94b1d62m6zsg-plpgsql_check-2.2.drv32 /nix/store/q117a7mx5d5bzln8xg24fh1vfzq7bsz4-plpgsql_check-2.7.drv33 /nix/store/rj6qw8pwvr91cy6qyp8xibrw4arrpj9j-plpgsql_check-2.8.drv34 /nix/store/c782i897gj20c0r8bmphf8p6r5s5wdli-plpgsql_check.drv35 /nix/store/b139hl0gpc9icb6j6q28gl1chw7i9260-rum-1.3.drv36 /nix/store/csvzp35khfq15v5g275y14094s58v10k-rum.drv37 /nix/store/c2pcswnd4yfp02pas6a7grpm0fmk70wx-supabase_vault-0.3.1.drv38 /nix/store/jb3j93i6ljmvqkv5cnv3lh3d9zn4zcjz-supabase_vault-0.2.8.drv39 /nix/store/gc3nb7r1a8rbf6f8yf4zs2nnb65awkxq-supabase_vault.drv40 /nix/store/xim497rkcncpxb5vvyli3j4jnziyybgy-pgroonga-3.0.7.drv41 /nix/store/gdd3j67qcdibplv1d440a6gsix87s5xs-pgroonga.drv42 /nix/store/ihx5q75k74a4cqq4k9bwnl5yin262kq2-pgrouting-3.4.1.drv43 /nix/store/hf9dly2ryx969lw950ld454fqfa6c41r-pgrouting.drv44 /nix/store/82vdx9lfkbv67j79qzi9yzvqrj043w52-wal2json-2.6.drv45 /nix/store/iz713zhjyn0lym6ls12i9vxca9cxf4hi-wal2json.drv46 /nix/store/7lzcc5d36122752hpjb6lij6sc2ai2a0-plv8-3.1.5.drv47 /nix/store/87brzrl1nsm8z4my02aldnxd8fb0i69x-plv8-3.1.4.drv48 /nix/store/k6nh1vivj2dgh0jk2mpsiy4p5v6sjyzk-plv8.drv49 /nix/store/0n0iaya9csx9by2pimrx1yglzw8dp4zs-pg_net-0.13.0.drv50 /nix/store/7iq4z475k625nsn9wc9nf4vxa7x1f1qd-pg_net-0.19.5.drv51 /nix/store/cfrc2vk3cgabx1447j2n7s3zxraq6395-pg_net-0.14.0.drv52 /nix/store/iwq28h7yniccm9ra8q6dc0wma0l6hnqn-pg_net-0.6.drv53 /nix/store/nw3d144zhshkgx1z66g9g2wg5829w36n-pg_net-0.7.1.drv54 /nix/store/nwcnf7x9i2zdx48936w9ixsnxzhbab16-pg_net-0.20.0.drv55 /nix/store/rfdqkjkjdwz7ydrwlfn9cdy68zz9z6rf-pg_net-0.7.drv56 /nix/store/whvqb38akl195470ks3jads9kmq2i9gj-pg_net-0.8.0.drv57 /nix/store/zy29jzcj1bsz7760wbmlg78czaddsrni-pg_net-0.20.3.drv58 /nix/store/q7ak647qv213m4vc4fnr43i09azs1b0p-pg_net.drv59 /nix/store/21s45rg3i2jfhdarxmqf3dr79allgdgh-wrappers-0.4.5.drv60 /nix/store/56j6z0f3g50m72cj7ynr22p9fdml79q9-wrappers-0.5.3.drv61 /nix/store/9m4hgq2s9z1cy1508wymdcl2n1w3ky5h-wrappers-0.6.2.drv62 /nix/store/f3b53aqd65czxnbbash43yraza54ds7k-wrappers-0.4.3.drv63 /nix/store/fpcwzjw9wdhbljjpcjlbz4w6236qzl70-wrappers-0.3.0.drv64 /nix/store/iimlppn24xgvgjvnm4xp8z9bxl4p4p1d-wrappers-0.4.1.drv65 /nix/store/l3ww3jfvj5l8bp25p66wrjziy8m0vi23-wrappers-0.5.0.drv66 /nix/store/ns9rs9anq0rsl3sh1rhxmqcsll7lkjd0-wrappers-0.5.6.drv67 /nix/store/nvjw377g2m07i1z93mngr72qhpjmafvy-wrappers-0.4.6.drv68 /nix/store/qzn17ml7z84zcmcw96j0z0f6m9j6y7qm-wrappers-0.5.4.drv69 /nix/store/xbhixx8nl4iifcfi17lpavbs9cxcg5ka-wrappers-0.6.1.drv70 /nix/store/y06jjr5k7hk7zs8gzilg4g50b184va6a-wrappers-0.4.2.drv71 /nix/store/y1qh08g7i9w1x2s10rq7ammigljy82kw-wrappers-0.4.4.drv72 /nix/store/z1yzqa9qzq4ri1f58lngsljs0abhgjz5-wrappers-0.5.7.drv73 /nix/store/xcq8s20l2ynk52356w6nqkdw7379h4g4-wrappers.drv74 /nix/store/3m1k34jx4kw90mcghzrp83c2dfhrwab8-pg_repack-1.5.1.drv75 /nix/store/iwgg2la44vzaaa2ja2xyaydck2jab651-pg_repack-1.5.2.drv76 /nix/store/xd0qgx5kfkw00jgxs1v9rm4ksfdjky95-pg_repack.drv77 /nix/store/fakh4z5ssr1vhknp3xv3ch232i3ph2ax-postgresql-and-plugins-15.19.drv78 /nix/store/4z7sbcap8vdzfs1smz81k2crr4sgm640-postgresql-and-plugins-15.19.drv79 /nix/store/q4qvxkwv7rl1jac9sf5aap56gjx0n5mb-system-path.drv80 /nix/store/9in45xg9fcahx70h7alf6jg08sin568q-dbus-1.drv81 /nix/store/jffmpfrihfl3k6lfgdc4ii4a62343h7x-X-Restart-Triggers-dbus.drv82 /nix/store/0jyfsa7sd5nhfiwbk0i0i0k7bbgigy6z-unit-dbus.service.drv83 /nix/store/0nn0jglvy3w5hd868rilks6acxx242hj-pg_net-0.19.5.drv84 /nix/store/0q3jswlrym436vq3yzd7nmxpfpc7zbw7-wrappers-0.5.6.drv85 /nix/store/1k3nzf8206jy6jjwdb50jn8rij79dvvj-plan_filter-0.1.drv86 /nix/store/17zhj6r14i4xx0fmzclykpcnyicwhbga-plan_filter.drv87 /nix/store/18746y4c8pvpm3al2bydwcn29pgwkjij-pg_repack-1.4.8.drv88 /nix/store/1hza0wxglhyl1641a3yki78kp045s8x2-wrappers-0.5.7.drv89 /nix/store/1mkhz1wanb7sx61imr6wqda0cqnvnj8q-wal2json-2.6.drv90 /nix/store/1r4ihdrrxnxp1kc97akzkb6yf0rhj5fy-wal2json-2.6.drv91 /nix/store/2wp2aqp71l4218m1z0aas6789yx18sv3-pgrouting-3.4.1.drv92 /nix/store/564f4p7z536irjy1x7a6i39nk3n3g2r2-pgrouting.drv93 /nix/store/k4qjk97aggz30jlgv2hdqka8fy8z07pg-supabase_vault-0.3.1.drv94 /nix/store/z8jynkjsnrfphim33c02aci4n6i2s9la-supabase_vault-0.2.8.drv95 /nix/store/8ir53vjiqz9rhip8arbxd2b58d0j67w0-supabase_vault.drv96 /nix/store/9sv9z7i53r40xnrigr8aywi98izk30rb-wal2json.drv97 /nix/store/g3yy08xhp6kakigznjmymrvasv6xhzz4-rum-1.3.drv98 /nix/store/apcx516gwjdivwb00nzvgwwq26mp6kbp-rum.drv99 /nix/store/ynjdlqr0w8h7ici1xdnsr79mwnzmyyri-pgroonga-3.2.5.drv100 /nix/store/c7b5vgzvlwgra3bhwq5fjzl0cg8lxq53-pgroonga.drv101 /nix/store/axpz1dvivwnmwkkcs392nj9cp1zs4x4h-pg_repack-1.4.8.drv102 /nix/store/gpxphj5cc5qbfjvp1kckicqwibgb6870-pg_repack-1.5.0.drv103 /nix/store/nynlpdydjmjk2fk2fsjz9bws5n6pjjyv-pg_repack-1.5.1.drv104 /nix/store/sa036niivyjgc2rqi9xh890msxh349l9-pg_repack-1.5.2.drv105 /nix/store/f4jr9drjzv7wfj2rxqg6fxg4ki5xv8aq-pg_repack.drv106 /nix/store/3cgs2dl0nwcsnwa5j7vkkp9vnqrax686-wrappers-0.6.0.drv107 /nix/store/74dcpcc376carhrdcf8ka4zmkawz1yv6-wrappers-0.5.4.drv108 /nix/store/92vrj7bj8hswwppxa34pv4a5mcishcns-wrappers-0.4.4.drv109 /nix/store/96l1zwmvz2ffcdfraaalfc6lvhah4kbz-wrappers-0.5.5.drv110 /nix/store/adcv6z66z4kpsasjjh1mcxa915lbdppl-wrappers-0.4.5.drv111 /nix/store/b4n3d1kid5pcaqfl3fjnjmc425dgg1p1-wrappers-0.5.0.drv112 /nix/store/jcd2gw4vawwnh0pmxhl4pl3ll6adggx5-wrappers-0.6.2.drv113 /nix/store/vxwdlzq8s4jj92x0jpc4sl9drjywlalq-wrappers-0.6.3.drv114 /nix/store/xwhq66cqc0ms922bxlcgc1jwff6kqv8g-wrappers-0.5.3.drv115 /nix/store/y6kq63cxxc5v5jh87mv9wpbvk0p4ayfg-wrappers-0.6.1.drv116 /nix/store/zdyyj4cgmfdl46zb5ycwmwr6d30w6mbx-wrappers-0.4.6.drv117 /nix/store/fn58ja37h9fw7mszrd75faxdb0999f0i-wrappers.drv118 /nix/store/9yiwshvqw6zii2gdbjn3whic00kdi2kk-vector-0.7.4.drv119 /nix/store/gd4y86918lqw8gzxg8nqrz8sy2dqq9fb-vector-0.7.0.drv120 /nix/store/gdgmh15k0z47wvlyk7n79hg9mm7jzisl-vector-0.6.2.drv121 /nix/store/hs3bxh6aa4yj96k9qp50af7qy1jchwk3-vector-0.6.0.drv122 /nix/store/j5mchw8xwd04x2c28fmf7pccna5x7y95-vector-0.8.2.drv123 /nix/store/qa8qkhza8bf74v69dzxgqvy2mjf799yl-vector-0.8.0.drv124 /nix/store/g5mv4minlqr25pj8gqhzcns6w7bwzaph-vector.drv125 /nix/store/lkbp0bzzg49y6z9h7ms156q0jsiq6qh4-safeupdate-1.4.drv126 /nix/store/icwncd52zxyvvybn79pvj2s9day934p8-safeupdate.drv127 /nix/store/9kmiqqmclsl8d77yd54al2d2wlwc6dp1-pgsodium-3.0.4.drv128 /nix/store/ckl9zg69wqkncwizrd6lln7h5492wwn6-pgsodium-3.1.6.drv129 /nix/store/lhi0y1xi9i9i1c8kg95nfhdw95j3dz3r-pgsodium-3.1.5.drv130 /nix/store/msmzmvngp6cx4yl0dwgzp3iv7bv796wg-pgsodium-3.1.8.drv131 /nix/store/zwypkv0vf8m8ybs536jq5wglvhfwdx8y-pgsodium-3.1.7.drv132 /nix/store/l68xzbdq736nzdnwvr9q3x29wcngcsj1-pgsodium.drv133 /nix/store/apd0c6nk3x333r1xj0sl2m3cr96pbizv-postgis-3.3.7.drv134 /nix/store/r12320b80inhy5aq434asc4sa8w6bn0g-postgis.drv135 /nix/store/36hfvpcvdxj64718i9mhil3db8835a6q-plpgsql_check-2.7.drv136 /nix/store/9lpr8r6zwzid07ihmr89rnxqcwv0yfja-plpgsql_check-2.8.drv137 /nix/store/rly88629k74w1nj10q0l6mg2jvd3nr1g-plpgsql_check.drv138 /nix/store/83ycsfk9ivb7sah3lq89d8hy5rxj5vpp-pg_net-0.20.3.drv139 /nix/store/a0ldx82cv1chkbdks86c8mjp8ps4lfgn-pg_net-0.20.0.drv140 /nix/store/lbqp8bfrqa2xm82ma6wyq1gijyajh6kh-pg_net-0.13.0.drv141 /nix/store/rdglczxf0sk4hhwsppqw13zl43vf5wr0-pg_net-0.14.0.drv142 /nix/store/w7547z9slhcibw4s6cwkag6w1f49317s-pg_net-0.20.4.drv143 /nix/store/vvs47f973jig6lflvm7cidm6m20glpy5-pg_net.drv144 /nix/store/y1p5dlzmilwxqbf3a4c7hl6gp9p84wsl-pgmq-1.5.1.drv145 /nix/store/y5rgrfmhzrjr0j6zil7ksqdbcglh0s8i-pgmq.drv146 /nix/store/2fndab8axk4hz4s30ijaxnpa1bc9z1dc-postgresql-and-plugins-17_22.drv147 /nix/store/2h15dgac1417g71pjrb4aqcz8yabiv21-plpgsql_check-2.7.drv148 /nix/store/2i3blwmkdwv0753xgc4pb1rm16gk4jmv-wrappers-0.5.6.drv149 /nix/store/381ghgpkv0l9lnv0f1v2jxfg04cspiih-rum-1.3.drv150 /nix/store/3dxfnbp09hx3zc5q8mmvb54v0nb1lrid-plpgsql_check-2.8.drv151 /nix/store/48mqx57r48j330b49mc32k7bvy6445c2-wal2json.drv152 /nix/store/msp1w36fm572jxlq4yj3ilwksxa0qpag-safeupdate-1.4.drv153 /nix/store/fl0xvi8swv20jz0vkfsm12znd6mp9naq-safeupdate.drv154 /nix/store/k4lajdzpb6zgp35ib3yfg5hk7p7kj1z3-rum.drv155 /nix/store/8p8fsl25zwlaqwhknw8myg0lfhi6rhsg-wrappers-0.6.0.drv156 /nix/store/a9l3bgzraqwg33ax5gcmbqwrkrrxxnag-wrappers-0.4.5.drv157 /nix/store/fh5b65jxgdyzwrs2g7y12ffnk1yhxczn-wrappers-0.5.7.drv158 /nix/store/h81r7798azz2nz8s3pxp1drpa02ma2m8-wrappers-0.5.4.drv159 /nix/store/hlpygbdz705888l5vwvvnz96901jdbkn-wrappers-0.5.5.drv160 /nix/store/kcan9i952k07b3pm1fnq4s0f7pfn7yx9-wrappers-0.5.3.drv161 /nix/store/pvzl31ydc0nhwqmrw9agqqbmk4v4ycr8-wrappers-0.6.3.drv162 /nix/store/q0lgs5nhw27p302wa3gp300l19ad95f0-wrappers-0.4.4.drv163 /nix/store/rfn5rhjy53sq47kjz5qfawd9pz9a38l1-wrappers-0.5.0.drv164 /nix/store/sg3hglpfqxg0bdxvkn36jnvpd752brga-wrappers-0.4.6.drv165 /nix/store/sn2m8z01kbz72vbl839b4qdhql2lf67m-wrappers-0.6.1.drv166 /nix/store/w5gnd7pybydask3lizsy3lirm83jxx56-wrappers-0.6.2.drv167 /nix/store/kplnvybrmx8df99qr3hsafbkky7hfg3v-wrappers.drv168 /nix/store/ibl9nbmh9mbqgqqfkrq7vgqzbsxj392q-pgmq-1.5.1.drv169 /nix/store/kv8jjb4gkylvk18qlsxl5lp9k29b1d31-pgmq.drv170 /nix/store/hnhqkd9jnn7w4z0z0jacwjwg9x016gyl-pg_repack-1.5.0.drv171 /nix/store/x14ai73x9yl5ckncl830rpbqxpjvvbg5-pg_repack-1.5.2.drv172 /nix/store/m6b5d5vphi1v49cpgr7ff07zvzfri21p-pg_repack.drv173 /nix/store/q8n9c44w9m7lggw81a93q8rvr4jgmslx-plan_filter-0.1.drv174 /nix/store/n1y2c26wz7wmff6xrz6ggk6zvsgma4bk-plan_filter.drv175 /nix/store/8byjp94z4bcpvgpc2s8ga2rqg9c3xc55-pgrouting-3.4.1.drv176 /nix/store/qs7fc4p2b8g3zc4cd29vi1wck7acipz9-pgrouting.drv177 /nix/store/v635079aqf2hhpg4xnhm2226g7khvdav-plpgsql_check.drv178 /nix/store/84hgdiz6hjkzk0cm5bd3vqsbx45n9zkh-vector-0.8.0.drv179 /nix/store/92n1zijp3izg793lrskmws7kyjz1xg5h-vector-0.6.2.drv180 /nix/store/bxnxr2z670m9ri1dc66149krs7h60dnc-vector-0.7.0.drv181 /nix/store/nyx1ahbyki15bmvygqzj2s1nnbmbi8ig-vector-0.7.4.drv182 /nix/store/za0ss4y8awhkng526g581wdnh0azibcf-vector-0.8.2.drv183 /nix/store/x3iqn55b29mih079vypw11gf008gj74l-vector.drv184 /nix/store/al6g5cvx86v4ljmh3sg6hmlsl3ab3bwf-pg_net-0.20.3.drv185 /nix/store/b1pyvgjyn940h95bbnsp15qmb0qli5gd-pg_net-0.20.0.drv186 /nix/store/g6nfp5n056kw2jvfzldzxrrrxfpfcka0-pg_net-0.13.0.drv187 /nix/store/xwiwd8fzjgv67zb2ji446a8vxjj3s7bs-pg_net-0.14.0.drv188 /nix/store/yf5z0qi17vprkjz68rqyp804sx929g9n-pg_net-0.19.5.drv189 /nix/store/y02vszvrhs7b6kn8llgwzdmnmhqiymzk-pg_net.drv190 /nix/store/mrfs1y0f5l367m93gpss7lp0jg6nz3bf-postgis-3.3.7.drv191 /nix/store/yskfmp4z518h4ff0mli70gsirhsli1ns-postgis.drv192 /nix/store/nj44phx30461wf1ac6n8fg8cc58agpgv-postgresql-and-plugins-17.11.drv193 /nix/store/rn61yq57k8lhdkx7al266vkbandycwv7-postgresql-and-plugins-17.11.drv194 /nix/store/czird9kid1f479i75r0fcy4ivzd3zzs8-system-path.drv195 /nix/store/i0ygxsqq6na1vsqmbklzxrj1xy5ypk6x-dbus-1.drv196 /nix/store/xnzsv2ymk0qx1fdsm8ssls8mlq8852wc-X-Restart-Triggers-dbus.drv197 /nix/store/5q0f5sx5mas5cc56azv1g9pm53yfrmgc-unit-dbus.service.drv198 /nix/store/a03cbyqm7arwjx83nc7jiwxkbbifg33w-user-units.drv199 /nix/store/acfna74pf7f063994dvxzqkrrhi623c4-unit-dbus.service.drv200 /nix/store/rjsqz027b1xj9q5dymzvs3wbqn2dv53m-postgresql-init.drv201 /nix/store/n0j0873l4a8mlkz6x1bffr3skhaarc7q-unit-postgresql.service.drv202 /nix/store/wmsihsmjyk0h8yjj86lpmijxpzqwk8gg-postgresql-migrate.drv203 /nix/store/pml1z1qw471w7nshf5dxp826pysqs3fz-unit-postgresql-migrate.service.drv204 /nix/store/vrslgxqykax3yi5mlrpiq0v1rq1ilnic-system-units.drv205 /nix/store/p6pnncmb31ibp4zxf61fbkkb0fmq4xai-etc.drv206 /nix/store/x6cijf4csfmd0dc8sqmiajj5dwi4h3dg-activate.drv207 /nix/store/cgyqy4j1g2s9zbh87ddwhr7wn9rssarl-nixos-system-server-test.drv208 /nix/store/w85w5162f9zdpi7g98sjlk186hrrm57p-postgresql-and-plugins-17_22.drv209 /nix/store/amy1ji0k53n9qihnqys9hvlc60bncr1y-system-path.drv210 /nix/store/7ynly7nv4iq2wvhmmg6p100h3wr2dpxd-dbus-1.drv211 /nix/store/v749g53p5djbqg3y7kfvdsw5g535j0js-X-Restart-Triggers-dbus.drv212 /nix/store/n7wg70ga6zm8b0prwd4np0azpi732zji-unit-dbus.service.drv213 /nix/store/bmn9rg4vrb07wyj1ls41afzdzcmhdqcm-user-units.drv214 /nix/store/jika4rfg3aj00vq2nfqx2i6nild4nvd5-unit-dbus.service.drv215 /nix/store/8r4vw45si1w8qby225b0amhay9ybj6c5-postgresql-orioledb-init.drv216 /nix/store/pgysndf7sfj9ifxk4sy1w8qfx2ln1ws6-unit-postgresql.service.drv217 /nix/store/9i9flpkzn6d3cvhin3s644150jhvcazf-supabase-orioledb-db-init.drv218 /nix/store/s4qicdb2kbzvf3lf6m8xidm4lndgs2yl-unit-supabase-db-init.service.drv219 /nix/store/dgm1f7y3gvjqjfv7r4gfa7pjffgzr4nj-system-units.drv220 /nix/store/sc9b344gbckg6fqywin6bhhs882d6mxa-etc.drv221 /nix/store/k4pazrfsvz1hsx7l4d0jsxvan5b3dq49-activate.drv222 /nix/store/m7z7bg6jaainvrfsikwclppim5yf6kn3-nixos-system-server-test.drv223 /nix/store/70bg25srcrfnwivfph4bhslzhigdgpxw-unit-dbus.service.drv224 /nix/store/cpy2j0c5ribiykpjaig0axzryxzh1g69-user-units.drv225 /nix/store/qbfmigmm8fk4v5nhvb8h71hmhmdaky0g-supabase-db-init.drv226 /nix/store/ggfylf6a7iwk3pn3r08m30684z8rrq5l-unit-supabase-db-init.service.drv227 /nix/store/qsr1582sizlpmavcla4x0gbp3q52g4pd-unit-postgresql.service.drv228 /nix/store/ydkqsx664pp5ndcfl70c84mvxgixix01-system-units.drv229 /nix/store/y3dck3diii9z9x0w771pz541gjd0zwh3-etc.drv230 /nix/store/srl146pjpar66ijj6l2zw99pmy6wpkl9-activate.drv231 /nix/store/sjl12wxd1wb23d9hzlzyqrq731lbrgpb-nixos-system-server-test.drv232 /nix/store/qv2lxny9548lwqjzpi75n12qpyc0fm56-closure-info.drv233 /nix/store/8vx14rz8lihgxgq3s0daqnbhbvnsf97x-run-nixos-vm.drv234 /nix/store/63q2a748lli2nxvrk228r5l81997jmzh-nixos-vm.drv235 /nix/store/5sd5z8bi95zz9c9m7drwwc5r5gasm6g9-nixos-test-driver-postgis.drv236 /nix/store/gjqlih1fff3c1f6yvcnfjbv2s194n967-vm-test-run-postgis.drv237error: build of '/nix/store/0n0iaya9csx9by2pimrx1yglzw8dp4zs-pg_net-0.13.0.drv' on 'ssh-ng://nixbot-remote-build@78.232.36.247' failed: Cannot build '/nix/store/0n0iaya9csx9by2pimrx1yglzw8dp4zs-pg_net-0.13.0.drv'.238 Reason: builder failed with exit code 2.239 Output paths:240 /nix/store/14dkr1mhbrh869r2k75r03ngw6q7c4ma-pg_net-0.13.0241 Last 25 log lines:242 > | ^~~~~~~~~~~~~~243 > src/util.h:6:11: warning: call to 'Wcurl_easy_setopt_err_long' declared with attribute warning: curl_easy_setopt expects a long argument [-Wattribute-warning]244 > 6 | if (curl_easy_setopt(hdl, opt, prm) != CURLE_OK) \245 > | ^~~~~~~~~~~~~~~~246 > src/core.c:108:3: note: in expansion of macro 'CURL_EZ_SETOPT'247 > 108 | CURL_EZ_SETOPT(curl_ez_handle, CURLOPT_TIMEOUT_MS, timeout_milliseconds);248 > | ^~~~~~~~~~~~~~249 > src/util.h:6:11: warning: call to 'Wcurl_easy_setopt_err_long' declared with attribute warning: curl_easy_setopt expects a long argument [-Wattribute-warning]250 > 6 | if (curl_easy_setopt(hdl, opt, prm) != CURLE_OK) \251 > | ^~~~~~~~~~~~~~~~252 > src/core.c:110:3: note: in expansion of macro 'CURL_EZ_SETOPT'253 > 110 | CURL_EZ_SETOPT(curl_ez_handle, CURLOPT_FOLLOWLOCATION, true);254 > | ^~~~~~~~~~~~~~255 > gcc -Wall -Wmissing-prototypes -Wpointer-arith -Wdeclaration-after-statement -Werror=vla -Wendif-labels -Wmissing-format-attribute -Wimplicit-fallthrough=3 -Wcast-function-type -Wformat-security -fno-strict-aliasing -fwrapv -fexcess-precision=standard -Wno-deprecated-non-prototype -Wno-format-truncation -Wno-stringop-truncation -g -O2 -std=gnu17 -std=c11 -Werror -Wno-declaration-after-statement -fPIC -DEXTVERSION=\"0.13.0\" -I. -I./ -I/nix/store/48l45fvi99n90x6p9i4cs1lmzby6cb73-postgresql-15.19/include/server -I/nix/store/48l45fvi99n90x6p9i4cs1lmzby6cb73-postgresql-15.19/include/internal -D_GNU_SOURCE -I/nix/store/p17klc3qq4nl9ihfwqfpi8cnqvcf92xz-libxml2-2.15.1-dev/include/libxml2 -I/nix/store/mglbi4dy4kpx7v1dcgf6iincp5x38hsc-lz4-1.10.0-dev/include -I/nix/store/g41q9md9rdcr3lkydi6f8zd6fza3h1q4-zstd-1.5.7-dev/include -I/nix/store/n2vnr7ycfk6midbzxcwd28qj3bgb50cz-icu4c-75.1-dev/include -c -o src/event.o src/event.c256 > In file included from /nix/store/jviasb44hibgh09829gbmbssbz2jjnhz-curl-8.17.0-dev/include/curl/curl.h:3333,257 > from /nix/store/jviasb44hibgh09829gbmbssbz2jjnhz-curl-8.17.0-dev/include/curl/multi.h:51,258 > from src/event.h:4,259 > from src/event.c:6:260 > /nix/store/jviasb44hibgh09829gbmbssbz2jjnhz-curl-8.17.0-dev/include/curl/multi.h:429:23: error: expected identifier or '(' before '__extension__'261 > 429 | CURL_EXTERN CURLMcode curl_multi_setopt(CURLM *multi_handle,262 > | ^~~~~~~~~~~~~~~~~263 > /nix/store/jviasb44hibgh09829gbmbssbz2jjnhz-curl-8.17.0-dev/include/curl/multi.h:429:23: error: expected identifier or '(' before ')' token264 > 429 | CURL_EXTERN CURLMcode curl_multi_setopt(CURLM *multi_handle,265 > | ^~~~~~~~~~~~~~~~~266 > make: *** [<builtin>: src/event.o] Error 1267 For full logs, run:268 nix log /nix/store/0n0iaya9csx9by2pimrx1yglzw8dp4zs-pg_net-0.13.0.drv269error: Cannot build '/nix/store/0n0iaya9csx9by2pimrx1yglzw8dp4zs-pg_net-0.13.0.drv'.270 Reason: builder failed with exit code 1.271 Output paths:272 /nix/store/14dkr1mhbrh869r2k75r03ngw6q7c4ma-pg_net-0.13.0273error: build of '/nix/store/g6nfp5n056kw2jvfzldzxrrrxfpfcka0-pg_net-0.13.0.drv' on 'ssh-ng://nixbot-remote-build@78.232.36.247' failed: Cannot build '/nix/store/g6nfp5n056kw2jvfzldzxrrrxfpfcka0-pg_net-0.13.0.drv'.274 Reason: builder failed with exit code 2.275 Output paths:276 /nix/store/0z6qc5i8vhckm5s9j7br24f5kfxsgds5-pg_net-0.13.0277 Last 25 log lines:278 > | ^~~~~~~~~~~~~~279 > src/util.h:6:11: warning: call to 'Wcurl_easy_setopt_err_long' declared with attribute warning: curl_easy_setopt expects a long argument [-Wattribute-warning]280 > 6 | if (curl_easy_setopt(hdl, opt, prm) != CURLE_OK) \281 > | ^~~~~~~~~~~~~~~~282 > src/core.c:108:3: note: in expansion of macro 'CURL_EZ_SETOPT'283 > 108 | CURL_EZ_SETOPT(curl_ez_handle, CURLOPT_TIMEOUT_MS, timeout_milliseconds);284 > | ^~~~~~~~~~~~~~285 > src/util.h:6:11: warning: call to 'Wcurl_easy_setopt_err_long' declared with attribute warning: curl_easy_setopt expects a long argument [-Wattribute-warning]286 > 6 | if (curl_easy_setopt(hdl, opt, prm) != CURLE_OK) \287 > | ^~~~~~~~~~~~~~~~288 > src/core.c:110:3: note: in expansion of macro 'CURL_EZ_SETOPT'289 > 110 | CURL_EZ_SETOPT(curl_ez_handle, CURLOPT_FOLLOWLOCATION, true);290 > | ^~~~~~~~~~~~~~291 > gcc -Wall -Wmissing-prototypes -Wpointer-arith -Wdeclaration-after-statement -Werror=vla -Wendif-labels -Wmissing-format-attribute -Wimplicit-fallthrough=3 -Wcast-function-type -Wshadow=compatible-local -Wformat-security -fno-strict-aliasing -fwrapv -fexcess-precision=standard -Wno-format-truncation -Wno-stringop-truncation -g -O2 -std=c11 -Werror -Wno-declaration-after-statement -fPIC -fvisibility=hidden -DEXTVERSION=\"0.13.0\" -I. -I./ -I/nix/store/9q4p23a2y63xn8safzzn6lbn07bnkshs-postgresql-17.11/include/server -I/nix/store/9q4p23a2y63xn8safzzn6lbn07bnkshs-postgresql-17.11/include/internal -D_GNU_SOURCE -I/nix/store/p17klc3qq4nl9ihfwqfpi8cnqvcf92xz-libxml2-2.15.1-dev/include/libxml2 -I/nix/store/mglbi4dy4kpx7v1dcgf6iincp5x38hsc-lz4-1.10.0-dev/include -I/nix/store/g41q9md9rdcr3lkydi6f8zd6fza3h1q4-zstd-1.5.7-dev/include -I/nix/store/n2vnr7ycfk6midbzxcwd28qj3bgb50cz-icu4c-75.1-dev/include -c -o src/event.o src/event.c292 > In file included from /nix/store/jviasb44hibgh09829gbmbssbz2jjnhz-curl-8.17.0-dev/include/curl/curl.h:3333,293 > from /nix/store/jviasb44hibgh09829gbmbssbz2jjnhz-curl-8.17.0-dev/include/curl/multi.h:51,294 > from src/event.h:4,295 > from src/event.c:6:296 > /nix/store/jviasb44hibgh09829gbmbssbz2jjnhz-curl-8.17.0-dev/include/curl/multi.h:429:23: error: expected identifier or '(' before '__extension__'297 > 429 | CURL_EXTERN CURLMcode curl_multi_setopt(CURLM *multi_handle,298 > | ^~~~~~~~~~~~~~~~~299 > /nix/store/jviasb44hibgh09829gbmbssbz2jjnhz-curl-8.17.0-dev/include/curl/multi.h:429:23: error: expected identifier or '(' before ')' token300 > 429 | CURL_EXTERN CURLMcode curl_multi_setopt(CURLM *multi_handle,301 > | ^~~~~~~~~~~~~~~~~302 > make: *** [<builtin>: src/event.o] Error 1303 For full logs, run:304 nix log /nix/store/g6nfp5n056kw2jvfzldzxrrrxfpfcka0-pg_net-0.13.0.drv305error: Cannot build '/nix/store/g6nfp5n056kw2jvfzldzxrrrxfpfcka0-pg_net-0.13.0.drv'.306 Reason: builder failed with exit code 1.307 Output paths:308 /nix/store/0z6qc5i8vhckm5s9j7br24f5kfxsgds5-pg_net-0.13.0309error: build of '/nix/store/lbqp8bfrqa2xm82ma6wyq1gijyajh6kh-pg_net-0.13.0.drv' on 'ssh-ng://nixbot-remote-build@78.232.36.247' failed: Cannot build '/nix/store/lbqp8bfrqa2xm82ma6wyq1gijyajh6kh-pg_net-0.13.0.drv'.310 Reason: builder failed with exit code 2.311 Output paths:312 /nix/store/517wbr5c7xb4fvch9kn0zim5j3hnjzpa-pg_net-0.13.0313 Last 25 log lines:314 > | ^~~~~~~~~~~~~~315 > src/util.h:6:11: warning: call to 'Wcurl_easy_setopt_err_long' declared with attribute warning: curl_easy_setopt expects a long argument [-Wattribute-warning]316 > 6 | if (curl_easy_setopt(hdl, opt, prm) != CURLE_OK) \317 > | ^~~~~~~~~~~~~~~~318 > src/core.c:108:3: note: in expansion of macro 'CURL_EZ_SETOPT'319 > 108 | CURL_EZ_SETOPT(curl_ez_handle, CURLOPT_TIMEOUT_MS, timeout_milliseconds);320 > | ^~~~~~~~~~~~~~321 > src/util.h:6:11: warning: call to 'Wcurl_easy_setopt_err_long' declared with attribute warning: curl_easy_setopt expects a long argument [-Wattribute-warning]322 > 6 | if (curl_easy_setopt(hdl, opt, prm) != CURLE_OK) \323 > | ^~~~~~~~~~~~~~~~324 > src/core.c:110:3: note: in expansion of macro 'CURL_EZ_SETOPT'325 > 110 | CURL_EZ_SETOPT(curl_ez_handle, CURLOPT_FOLLOWLOCATION, true);326 > | ^~~~~~~~~~~~~~327 > gcc -Wall -Wmissing-prototypes -Wpointer-arith -Wdeclaration-after-statement -Werror=vla -Wendif-labels -Wmissing-format-attribute -Wimplicit-fallthrough=3 -Wcast-function-type -Wshadow=compatible-local -Wformat-security -fno-strict-aliasing -fwrapv -fexcess-precision=standard -Wno-format-truncation -Wno-stringop-truncation -moutline-atomics -g -O2 -std=c11 -Werror -Wno-declaration-after-statement -fPIC -fvisibility=hidden -DEXTVERSION=\"0.13.0\" -I. -I./ -I/nix/store/wq2kfr0rkb0hdmf1iwi3mi8pxycakzmq-postgresql-17_22/include/server -I/nix/store/wq2kfr0rkb0hdmf1iwi3mi8pxycakzmq-postgresql-17_22/include/internal -D_GNU_SOURCE -I/nix/store/p17klc3qq4nl9ihfwqfpi8cnqvcf92xz-libxml2-2.15.1-dev/include/libxml2 -I/nix/store/mglbi4dy4kpx7v1dcgf6iincp5x38hsc-lz4-1.10.0-dev/include -I/nix/store/g41q9md9rdcr3lkydi6f8zd6fza3h1q4-zstd-1.5.7-dev/include -I/nix/store/n2vnr7ycfk6midbzxcwd28qj3bgb50cz-icu4c-75.1-dev/include -c -o src/event.o src/event.c328 > In file included from /nix/store/jviasb44hibgh09829gbmbssbz2jjnhz-curl-8.17.0-dev/include/curl/curl.h:3333,329 > from /nix/store/jviasb44hibgh09829gbmbssbz2jjnhz-curl-8.17.0-dev/include/curl/multi.h:51,330 > from src/event.h:4,331 > from src/event.c:6:332 > /nix/store/jviasb44hibgh09829gbmbssbz2jjnhz-curl-8.17.0-dev/include/curl/multi.h:429:23: error: expected identifier or '(' before '__extension__'333 > 429 | CURL_EXTERN CURLMcode curl_multi_setopt(CURLM *multi_handle,334 > | ^~~~~~~~~~~~~~~~~335 > /nix/store/jviasb44hibgh09829gbmbssbz2jjnhz-curl-8.17.0-dev/include/curl/multi.h:429:23: error: expected identifier or '(' before ')' token336 > 429 | CURL_EXTERN CURLMcode curl_multi_setopt(CURLM *multi_handle,337 > | ^~~~~~~~~~~~~~~~~338 > make: *** [<builtin>: src/event.o] Error 1339 For full logs, run:340 nix log /nix/store/lbqp8bfrqa2xm82ma6wyq1gijyajh6kh-pg_net-0.13.0.drv341error: Cannot build '/nix/store/lbqp8bfrqa2xm82ma6wyq1gijyajh6kh-pg_net-0.13.0.drv'.342 Reason: builder failed with exit code 1.343 Output paths:344 /nix/store/517wbr5c7xb4fvch9kn0zim5j3hnjzpa-pg_net-0.13.0345error: build of '/nix/store/cfrc2vk3cgabx1447j2n7s3zxraq6395-pg_net-0.14.0.drv' on 'ssh-ng://nixbot-remote-build@78.232.36.247' failed: Cannot build '/nix/store/cfrc2vk3cgabx1447j2n7s3zxraq6395-pg_net-0.14.0.drv'.346 Reason: builder failed with exit code 2.347 Output paths:348 /nix/store/m4c4b79prkz8x60agzy6dy9bn0cdcy0d-pg_net-0.14.0349 Last 25 log lines:350 > src/errors.h:6:11: warning: call to 'Wcurl_easy_setopt_err_long' declared with attribute warning: curl_easy_setopt expects a long argument [-Wattribute-warning]351 > 6 | if (curl_easy_setopt(hdl, opt, prm) != CURLE_OK) \352 > | ^~~~~~~~~~~~~~~~353 > src/core.c:134:3: note: in expansion of macro 'EREPORT_CURL_SETOPT'354 > 134 | EREPORT_CURL_SETOPT(curl_ez_handle, CURLOPT_TIMEOUT_MS, cdata->timeout_milliseconds);355 > | ^~~~~~~~~~~~~~~~~~~356 > src/errors.h:6:11: warning: call to 'Wcurl_easy_setopt_err_long' declared with attribute warning: curl_easy_setopt expects a long argument [-Wattribute-warning]357 > 6 | if (curl_easy_setopt(hdl, opt, prm) != CURLE_OK) \358 > | ^~~~~~~~~~~~~~~~359 > src/core.c:136:3: note: in expansion of macro 'EREPORT_CURL_SETOPT'360 > 136 | EREPORT_CURL_SETOPT(curl_ez_handle, CURLOPT_FOLLOWLOCATION, true);361 > | ^~~~~~~~~~~~~~~~~~~362 > gcc -Wall -Wmissing-prototypes -Wpointer-arith -Wdeclaration-after-statement -Werror=vla -Wendif-labels -Wmissing-format-attribute -Wimplicit-fallthrough=3 -Wcast-function-type -Wformat-security -fno-strict-aliasing -fwrapv -fexcess-precision=standard -Wno-deprecated-non-prototype -Wno-format-truncation -Wno-stringop-truncation -g -O2 -std=gnu17 -std=c11 -Werror -Wno-declaration-after-statement -fPIC -DEXTVERSION=\"0.14.0\" -I. -I./ -I/nix/store/48l45fvi99n90x6p9i4cs1lmzby6cb73-postgresql-15.19/include/server -I/nix/store/48l45fvi99n90x6p9i4cs1lmzby6cb73-postgresql-15.19/include/internal -D_GNU_SOURCE -I/nix/store/p17klc3qq4nl9ihfwqfpi8cnqvcf92xz-libxml2-2.15.1-dev/include/libxml2 -I/nix/store/mglbi4dy4kpx7v1dcgf6iincp5x38hsc-lz4-1.10.0-dev/include -I/nix/store/g41q9md9rdcr3lkydi6f8zd6fza3h1q4-zstd-1.5.7-dev/include -I/nix/store/n2vnr7ycfk6midbzxcwd28qj3bgb50cz-icu4c-75.1-dev/include -c -o src/errors.o src/errors.c363 > gcc -Wall -Wmissing-prototypes -Wpointer-arith -Wdeclaration-after-statement -Werror=vla -Wendif-labels -Wmissing-format-attribute -Wimplicit-fallthrough=3 -Wcast-function-type -Wformat-security -fno-strict-aliasing -fwrapv -fexcess-precision=standard -Wno-deprecated-non-prototype -Wno-format-truncation -Wno-stringop-truncation -g -O2 -std=gnu17 -std=c11 -Werror -Wno-declaration-after-statement -fPIC -DEXTVERSION=\"0.14.0\" -I. -I./ -I/nix/store/48l45fvi99n90x6p9i4cs1lmzby6cb73-postgresql-15.19/include/server -I/nix/store/48l45fvi99n90x6p9i4cs1lmzby6cb73-postgresql-15.19/include/internal -D_GNU_SOURCE -I/nix/store/p17klc3qq4nl9ihfwqfpi8cnqvcf92xz-libxml2-2.15.1-dev/include/libxml2 -I/nix/store/mglbi4dy4kpx7v1dcgf6iincp5x38hsc-lz4-1.10.0-dev/include -I/nix/store/g41q9md9rdcr3lkydi6f8zd6fza3h1q4-zstd-1.5.7-dev/include -I/nix/store/n2vnr7ycfk6midbzxcwd28qj3bgb50cz-icu4c-75.1-dev/include -c -o src/event.o src/event.c364 > In file included from /nix/store/jviasb44hibgh09829gbmbssbz2jjnhz-curl-8.17.0-dev/include/curl/curl.h:3333,365 > from /nix/store/jviasb44hibgh09829gbmbssbz2jjnhz-curl-8.17.0-dev/include/curl/multi.h:51,366 > from src/event.h:4,367 > from src/event.c:6:368 > /nix/store/jviasb44hibgh09829gbmbssbz2jjnhz-curl-8.17.0-dev/include/curl/multi.h:429:23: error: expected identifier or '(' before '__extension__'369 > 429 | CURL_EXTERN CURLMcode curl_multi_setopt(CURLM *multi_handle,370 > | ^~~~~~~~~~~~~~~~~371 > /nix/store/jviasb44hibgh09829gbmbssbz2jjnhz-curl-8.17.0-dev/include/curl/multi.h:429:23: error: expected identifier or '(' before ')' token372 > 429 | CURL_EXTERN CURLMcode curl_multi_setopt(CURLM *multi_handle,373 > | ^~~~~~~~~~~~~~~~~374 > make: *** [<builtin>: src/event.o] Error 1375 For full logs, run:376 nix log /nix/store/cfrc2vk3cgabx1447j2n7s3zxraq6395-pg_net-0.14.0.drv377error: Cannot build '/nix/store/cfrc2vk3cgabx1447j2n7s3zxraq6395-pg_net-0.14.0.drv'.378 Reason: builder failed with exit code 1.379 Output paths:380 /nix/store/m4c4b79prkz8x60agzy6dy9bn0cdcy0d-pg_net-0.14.0381error: build of '/nix/store/rdglczxf0sk4hhwsppqw13zl43vf5wr0-pg_net-0.14.0.drv' on 'ssh-ng://nixbot-remote-build@78.232.36.247' failed: Cannot build '/nix/store/rdglczxf0sk4hhwsppqw13zl43vf5wr0-pg_net-0.14.0.drv'.382 Reason: builder failed with exit code 2.383 Output paths:384 /nix/store/dljg9dqcggn0gx9wwgbw43zdg392qhq2-pg_net-0.14.0385 Last 25 log lines:386 > src/errors.h:6:11: warning: call to 'Wcurl_easy_setopt_err_long' declared with attribute warning: curl_easy_setopt expects a long argument [-Wattribute-warning]387 > 6 | if (curl_easy_setopt(hdl, opt, prm) != CURLE_OK) \388 > | ^~~~~~~~~~~~~~~~389 > src/core.c:134:3: note: in expansion of macro 'EREPORT_CURL_SETOPT'390 > 134 | EREPORT_CURL_SETOPT(curl_ez_handle, CURLOPT_TIMEOUT_MS, cdata->timeout_milliseconds);391 > | ^~~~~~~~~~~~~~~~~~~392 > src/errors.h:6:11: warning: call to 'Wcurl_easy_setopt_err_long' declared with attribute warning: curl_easy_setopt expects a long argument [-Wattribute-warning]393 > 6 | if (curl_easy_setopt(hdl, opt, prm) != CURLE_OK) \394 > | ^~~~~~~~~~~~~~~~395 > src/core.c:136:3: note: in expansion of macro 'EREPORT_CURL_SETOPT'396 > 136 | EREPORT_CURL_SETOPT(curl_ez_handle, CURLOPT_FOLLOWLOCATION, true);397 > | ^~~~~~~~~~~~~~~~~~~398 > gcc -Wall -Wmissing-prototypes -Wpointer-arith -Wdeclaration-after-statement -Werror=vla -Wendif-labels -Wmissing-format-attribute -Wimplicit-fallthrough=3 -Wcast-function-type -Wshadow=compatible-local -Wformat-security -fno-strict-aliasing -fwrapv -fexcess-precision=standard -Wno-format-truncation -Wno-stringop-truncation -moutline-atomics -g -O2 -std=c11 -Werror -Wno-declaration-after-statement -fPIC -fvisibility=hidden -DEXTVERSION=\"0.14.0\" -I. -I./ -I/nix/store/wq2kfr0rkb0hdmf1iwi3mi8pxycakzmq-postgresql-17_22/include/server -I/nix/store/wq2kfr0rkb0hdmf1iwi3mi8pxycakzmq-postgresql-17_22/include/internal -D_GNU_SOURCE -I/nix/store/p17klc3qq4nl9ihfwqfpi8cnqvcf92xz-libxml2-2.15.1-dev/include/libxml2 -I/nix/store/mglbi4dy4kpx7v1dcgf6iincp5x38hsc-lz4-1.10.0-dev/include -I/nix/store/g41q9md9rdcr3lkydi6f8zd6fza3h1q4-zstd-1.5.7-dev/include -I/nix/store/n2vnr7ycfk6midbzxcwd28qj3bgb50cz-icu4c-75.1-dev/include -c -o src/errors.o src/errors.c399 > gcc -Wall -Wmissing-prototypes -Wpointer-arith -Wdeclaration-after-statement -Werror=vla -Wendif-labels -Wmissing-format-attribute -Wimplicit-fallthrough=3 -Wcast-function-type -Wshadow=compatible-local -Wformat-security -fno-strict-aliasing -fwrapv -fexcess-precision=standard -Wno-format-truncation -Wno-stringop-truncation -moutline-atomics -g -O2 -std=c11 -Werror -Wno-declaration-after-statement -fPIC -fvisibility=hidden -DEXTVERSION=\"0.14.0\" -I. -I./ -I/nix/store/wq2kfr0rkb0hdmf1iwi3mi8pxycakzmq-postgresql-17_22/include/server -I/nix/store/wq2kfr0rkb0hdmf1iwi3mi8pxycakzmq-postgresql-17_22/include/internal -D_GNU_SOURCE -I/nix/store/p17klc3qq4nl9ihfwqfpi8cnqvcf92xz-libxml2-2.15.1-dev/include/libxml2 -I/nix/store/mglbi4dy4kpx7v1dcgf6iincp5x38hsc-lz4-1.10.0-dev/include -I/nix/store/g41q9md9rdcr3lkydi6f8zd6fza3h1q4-zstd-1.5.7-dev/include -I/nix/store/n2vnr7ycfk6midbzxcwd28qj3bgb50cz-icu4c-75.1-dev/include -c -o src/event.o src/event.c400 > In file included from /nix/store/jviasb44hibgh09829gbmbssbz2jjnhz-curl-8.17.0-dev/include/curl/curl.h:3333,401 > from /nix/store/jviasb44hibgh09829gbmbssbz2jjnhz-curl-8.17.0-dev/include/curl/multi.h:51,402 > from src/event.h:4,403 > from src/event.c:6:404 > /nix/store/jviasb44hibgh09829gbmbssbz2jjnhz-curl-8.17.0-dev/include/curl/multi.h:429:23: error: expected identifier or '(' before '__extension__'405 > 429 | CURL_EXTERN CURLMcode curl_multi_setopt(CURLM *multi_handle,406 > | ^~~~~~~~~~~~~~~~~407 > /nix/store/jviasb44hibgh09829gbmbssbz2jjnhz-curl-8.17.0-dev/include/curl/multi.h:429:23: error: expected identifier or '(' before ')' token408 > 429 | CURL_EXTERN CURLMcode curl_multi_setopt(CURLM *multi_handle,409 > | ^~~~~~~~~~~~~~~~~410 > make: *** [<builtin>: src/event.o] Error 1411 For full logs, run:412 nix log /nix/store/rdglczxf0sk4hhwsppqw13zl43vf5wr0-pg_net-0.14.0.drv413error: Cannot build '/nix/store/rdglczxf0sk4hhwsppqw13zl43vf5wr0-pg_net-0.14.0.drv'.414 Reason: builder failed with exit code 1.415 Output paths:416 /nix/store/dljg9dqcggn0gx9wwgbw43zdg392qhq2-pg_net-0.14.0417error: build of '/nix/store/xwiwd8fzjgv67zb2ji446a8vxjj3s7bs-pg_net-0.14.0.drv' on 'ssh-ng://nixbot-remote-build@78.232.36.247' failed: Cannot build '/nix/store/xwiwd8fzjgv67zb2ji446a8vxjj3s7bs-pg_net-0.14.0.drv'.418 Reason: builder failed with exit code 2.419 Output paths:420 /nix/store/0bq877r81wz036mv2my23krgmx5r2xkg-pg_net-0.14.0421 Last 25 log lines:422 > src/errors.h:6:11: warning: call to 'Wcurl_easy_setopt_err_long' declared with attribute warning: curl_easy_setopt expects a long argument [-Wattribute-warning]423 > 6 | if (curl_easy_setopt(hdl, opt, prm) != CURLE_OK) \424 > | ^~~~~~~~~~~~~~~~425 > src/core.c:134:3: note: in expansion of macro 'EREPORT_CURL_SETOPT'426 > 134 | EREPORT_CURL_SETOPT(curl_ez_handle, CURLOPT_TIMEOUT_MS, cdata->timeout_milliseconds);427 > | ^~~~~~~~~~~~~~~~~~~428 > src/errors.h:6:11: warning: call to 'Wcurl_easy_setopt_err_long' declared with attribute warning: curl_easy_setopt expects a long argument [-Wattribute-warning]429 > 6 | if (curl_easy_setopt(hdl, opt, prm) != CURLE_OK) \430 > | ^~~~~~~~~~~~~~~~431 > src/core.c:136:3: note: in expansion of macro 'EREPORT_CURL_SETOPT'432 > 136 | EREPORT_CURL_SETOPT(curl_ez_handle, CURLOPT_FOLLOWLOCATION, true);433 > | ^~~~~~~~~~~~~~~~~~~434 > gcc -Wall -Wmissing-prototypes -Wpointer-arith -Wdeclaration-after-statement -Werror=vla -Wendif-labels -Wmissing-format-attribute -Wimplicit-fallthrough=3 -Wcast-function-type -Wshadow=compatible-local -Wformat-security -fno-strict-aliasing -fwrapv -fexcess-precision=standard -Wno-format-truncation -Wno-stringop-truncation -g -O2 -std=c11 -Werror -Wno-declaration-after-statement -fPIC -fvisibility=hidden -DEXTVERSION=\"0.14.0\" -I. -I./ -I/nix/store/9q4p23a2y63xn8safzzn6lbn07bnkshs-postgresql-17.11/include/server -I/nix/store/9q4p23a2y63xn8safzzn6lbn07bnkshs-postgresql-17.11/include/internal -D_GNU_SOURCE -I/nix/store/p17klc3qq4nl9ihfwqfpi8cnqvcf92xz-libxml2-2.15.1-dev/include/libxml2 -I/nix/store/mglbi4dy4kpx7v1dcgf6iincp5x38hsc-lz4-1.10.0-dev/include -I/nix/store/g41q9md9rdcr3lkydi6f8zd6fza3h1q4-zstd-1.5.7-dev/include -I/nix/store/n2vnr7ycfk6midbzxcwd28qj3bgb50cz-icu4c-75.1-dev/include -c -o src/errors.o src/errors.c435 > gcc -Wall -Wmissing-prototypes -Wpointer-arith -Wdeclaration-after-statement -Werror=vla -Wendif-labels -Wmissing-format-attribute -Wimplicit-fallthrough=3 -Wcast-function-type -Wshadow=compatible-local -Wformat-security -fno-strict-aliasing -fwrapv -fexcess-precision=standard -Wno-format-truncation -Wno-stringop-truncation -g -O2 -std=c11 -Werror -Wno-declaration-after-statement -fPIC -fvisibility=hidden -DEXTVERSION=\"0.14.0\" -I. -I./ -I/nix/store/9q4p23a2y63xn8safzzn6lbn07bnkshs-postgresql-17.11/include/server -I/nix/store/9q4p23a2y63xn8safzzn6lbn07bnkshs-postgresql-17.11/include/internal -D_GNU_SOURCE -I/nix/store/p17klc3qq4nl9ihfwqfpi8cnqvcf92xz-libxml2-2.15.1-dev/include/libxml2 -I/nix/store/mglbi4dy4kpx7v1dcgf6iincp5x38hsc-lz4-1.10.0-dev/include -I/nix/store/g41q9md9rdcr3lkydi6f8zd6fza3h1q4-zstd-1.5.7-dev/include -I/nix/store/n2vnr7ycfk6midbzxcwd28qj3bgb50cz-icu4c-75.1-dev/include -c -o src/event.o src/event.c436 > In file included from /nix/store/jviasb44hibgh09829gbmbssbz2jjnhz-curl-8.17.0-dev/include/curl/curl.h:3333,437 > from /nix/store/jviasb44hibgh09829gbmbssbz2jjnhz-curl-8.17.0-dev/include/curl/multi.h:51,438 > from src/event.h:4,439 > from src/event.c:6:440 > /nix/store/jviasb44hibgh09829gbmbssbz2jjnhz-curl-8.17.0-dev/include/curl/multi.h:429:23: error: expected identifier or '(' before '__extension__'441 > 429 | CURL_EXTERN CURLMcode curl_multi_setopt(CURLM *multi_handle,442 > | ^~~~~~~~~~~~~~~~~443 > /nix/store/jviasb44hibgh09829gbmbssbz2jjnhz-curl-8.17.0-dev/include/curl/multi.h:429:23: error: expected identifier or '(' before ')' token444 > 429 | CURL_EXTERN CURLMcode curl_multi_setopt(CURLM *multi_handle,445 > | ^~~~~~~~~~~~~~~~~446 > make: *** [<builtin>: src/event.o] Error 1447 For full logs, run:448 nix log /nix/store/xwiwd8fzjgv67zb2ji446a8vxjj3s7bs-pg_net-0.14.0.drv449error: Cannot build '/nix/store/xwiwd8fzjgv67zb2ji446a8vxjj3s7bs-pg_net-0.14.0.drv'.450 Reason: builder failed with exit code 1.451 Output paths:452 /nix/store/0bq877r81wz036mv2my23krgmx5r2xkg-pg_net-0.14.0453error: build of '/nix/store/0nn0jglvy3w5hd868rilks6acxx242hj-pg_net-0.19.5.drv' on 'ssh-ng://nixbot-remote-build@78.232.36.247' failed: Cannot build '/nix/store/0nn0jglvy3w5hd868rilks6acxx242hj-pg_net-0.19.5.drv'.454 Reason: builder failed with exit code 2.455 Output paths:456 /nix/store/4301s7p0rsq58k2f9hrs6ar4c2a8ya3d-pg_net-0.19.5457 Last 22 log lines:458 > Running phase: unpackPhase459 > unpacking source archive /nix/store/5zgdqy3bz93jyn79pizxc1hks0cdcadw-source460 > source root is source461 > Running phase: patchPhase462 > Running phase: updateAutotoolsGnuConfigScriptsPhase463 > Running phase: configurePhase464 > no configure script, doing nothing465 > Running phase: buildPhase466 > gcc -Wall -Wmissing-prototypes -Wpointer-arith -Wdeclaration-after-statement -Werror=vla -Wendif-labels -Wmissing-format-attribute -Wimplicit-fallthrough=3 -Wcast-function-type -Wshadow=compatible-local -Wformat-security -fno-strict-aliasing -fwrapv -fexcess-precision=standard -Wno-format-truncation -Wno-stringop-truncation -moutline-atomics -g -O2 -std=c11 -Wextra -Wall -Werror -Wno-declaration-after-statement -Wno-vla -Wno-long-long -Wmissing-variable-declarations -fPIC -fvisibility=hidden -DEXTVERSION=\"0.19.5\" -I. -I./ -I/nix/store/wq2kfr0rkb0hdmf1iwi3mi8pxycakzmq-postgresql-17_22/include/server -I/nix/store/wq2kfr0rkb0hdmf1iwi3mi8pxycakzmq-postgresql-17_22/include/internal -D_GNU_SOURCE -I/nix/store/p17klc3qq4nl9ihfwqfpi8cnqvcf92xz-libxml2-2.15.1-dev/include/libxml2 -I/nix/store/mglbi4dy4kpx7v1dcgf6iincp5x38hsc-lz4-1.10.0-dev/include -I/nix/store/g41q9md9rdcr3lkydi6f8zd6fza3h1q4-zstd-1.5.7-dev/include -I/nix/store/n2vnr7ycfk6midbzxcwd28qj3bgb50cz-icu4c-75.1-dev/include -c -o src/core.o src/core.c467 > gcc -Wall -Wmissing-prototypes -Wpointer-arith -Wdeclaration-after-statement -Werror=vla -Wendif-labels -Wmissing-format-attribute -Wimplicit-fallthrough=3 -Wcast-function-type -Wshadow=compatible-local -Wformat-security -fno-strict-aliasing -fwrapv -fexcess-precision=standard -Wno-format-truncation -Wno-stringop-truncation -moutline-atomics -g -O2 -std=c11 -Wextra -Wall -Werror -Wno-declaration-after-statement -Wno-vla -Wno-long-long -Wmissing-variable-declarations -fPIC -fvisibility=hidden -DEXTVERSION=\"0.19.5\" -I. -I./ -I/nix/store/wq2kfr0rkb0hdmf1iwi3mi8pxycakzmq-postgresql-17_22/include/server -I/nix/store/wq2kfr0rkb0hdmf1iwi3mi8pxycakzmq-postgresql-17_22/include/internal -D_GNU_SOURCE -I/nix/store/p17klc3qq4nl9ihfwqfpi8cnqvcf92xz-libxml2-2.15.1-dev/include/libxml2 -I/nix/store/mglbi4dy4kpx7v1dcgf6iincp5x38hsc-lz4-1.10.0-dev/include -I/nix/store/g41q9md9rdcr3lkydi6f8zd6fza3h1q4-zstd-1.5.7-dev/include -I/nix/store/n2vnr7ycfk6midbzxcwd28qj3bgb50cz-icu4c-75.1-dev/include -c -o src/errors.o src/errors.c468 > gcc -Wall -Wmissing-prototypes -Wpointer-arith -Wdeclaration-after-statement -Werror=vla -Wendif-labels -Wmissing-format-attribute -Wimplicit-fallthrough=3 -Wcast-function-type -Wshadow=compatible-local -Wformat-security -fno-strict-aliasing -fwrapv -fexcess-precision=standard -Wno-format-truncation -Wno-stringop-truncation -moutline-atomics -g -O2 -std=c11 -Wextra -Wall -Werror -Wno-declaration-after-statement -Wno-vla -Wno-long-long -Wmissing-variable-declarations -fPIC -fvisibility=hidden -DEXTVERSION=\"0.19.5\" -I. -I./ -I/nix/store/wq2kfr0rkb0hdmf1iwi3mi8pxycakzmq-postgresql-17_22/include/server -I/nix/store/wq2kfr0rkb0hdmf1iwi3mi8pxycakzmq-postgresql-17_22/include/internal -D_GNU_SOURCE -I/nix/store/p17klc3qq4nl9ihfwqfpi8cnqvcf92xz-libxml2-2.15.1-dev/include/libxml2 -I/nix/store/mglbi4dy4kpx7v1dcgf6iincp5x38hsc-lz4-1.10.0-dev/include -I/nix/store/g41q9md9rdcr3lkydi6f8zd6fza3h1q4-zstd-1.5.7-dev/include -I/nix/store/n2vnr7ycfk6midbzxcwd28qj3bgb50cz-icu4c-75.1-dev/include -c -o src/event.o src/event.c469 > In file included from /nix/store/jviasb44hibgh09829gbmbssbz2jjnhz-curl-8.17.0-dev/include/curl/curl.h:3333,470 > from /nix/store/jviasb44hibgh09829gbmbssbz2jjnhz-curl-8.17.0-dev/include/curl/multi.h:51,471 > from src/event.h:4,472 > from src/event.c:6:473 > /nix/store/jviasb44hibgh09829gbmbssbz2jjnhz-curl-8.17.0-dev/include/curl/multi.h:429:23: error: expected identifier or '(' before '__extension__'474 > 429 | CURL_EXTERN CURLMcode curl_multi_setopt(CURLM *multi_handle,475 > | ^~~~~~~~~~~~~~~~~476 > /nix/store/jviasb44hibgh09829gbmbssbz2jjnhz-curl-8.17.0-dev/include/curl/multi.h:429:23: error: expected identifier or '(' before ')' token477 > 429 | CURL_EXTERN CURLMcode curl_multi_setopt(CURLM *multi_handle,478 > | ^~~~~~~~~~~~~~~~~479 > make: *** [<builtin>: src/event.o] Error 1480 For full logs, run:481 nix log /nix/store/0nn0jglvy3w5hd868rilks6acxx242hj-pg_net-0.19.5.drv482error: Cannot build '/nix/store/0nn0jglvy3w5hd868rilks6acxx242hj-pg_net-0.19.5.drv'.483 Reason: builder failed with exit code 1.484 Output paths:485 /nix/store/4301s7p0rsq58k2f9hrs6ar4c2a8ya3d-pg_net-0.19.5486error: build of '/nix/store/7iq4z475k625nsn9wc9nf4vxa7x1f1qd-pg_net-0.19.5.drv' on 'ssh-ng://nixbot-remote-build@78.232.36.247' failed: Cannot build '/nix/store/7iq4z475k625nsn9wc9nf4vxa7x1f1qd-pg_net-0.19.5.drv'.487 Reason: builder failed with exit code 2.488 Output paths:489 /nix/store/mx90q334pqf6iwkyb9vk1wzl5nhmqmiv-pg_net-0.19.5490 Last 22 log lines:491 > Running phase: unpackPhase492 > unpacking source archive /nix/store/5zgdqy3bz93jyn79pizxc1hks0cdcadw-source493 > source root is source494 > Running phase: patchPhase495 > Running phase: updateAutotoolsGnuConfigScriptsPhase496 > Running phase: configurePhase497 > no configure script, doing nothing498 > Running phase: buildPhase499 > gcc -Wall -Wmissing-prototypes -Wpointer-arith -Wdeclaration-after-statement -Werror=vla -Wendif-labels -Wmissing-format-attribute -Wimplicit-fallthrough=3 -Wcast-function-type -Wformat-security -fno-strict-aliasing -fwrapv -fexcess-precision=standard -Wno-deprecated-non-prototype -Wno-format-truncation -Wno-stringop-truncation -g -O2 -std=gnu17 -std=c11 -Wextra -Wall -Werror -Wno-declaration-after-statement -Wno-vla -Wno-long-long -Wmissing-variable-declarations -fPIC -DEXTVERSION=\"0.19.5\" -I. -I./ -I/nix/store/48l45fvi99n90x6p9i4cs1lmzby6cb73-postgresql-15.19/include/server -I/nix/store/48l45fvi99n90x6p9i4cs1lmzby6cb73-postgresql-15.19/include/internal -D_GNU_SOURCE -I/nix/store/p17klc3qq4nl9ihfwqfpi8cnqvcf92xz-libxml2-2.15.1-dev/include/libxml2 -I/nix/store/mglbi4dy4kpx7v1dcgf6iincp5x38hsc-lz4-1.10.0-dev/include -I/nix/store/g41q9md9rdcr3lkydi6f8zd6fza3h1q4-zstd-1.5.7-dev/include -I/nix/store/n2vnr7ycfk6midbzxcwd28qj3bgb50cz-icu4c-75.1-dev/include -c -o src/core.o src/core.c500 > gcc -Wall -Wmissing-prototypes -Wpointer-arith -Wdeclaration-after-statement -Werror=vla -Wendif-labels -Wmissing-format-attribute -Wimplicit-fallthrough=3 -Wcast-function-type -Wformat-security -fno-strict-aliasing -fwrapv -fexcess-precision=standard -Wno-deprecated-non-prototype -Wno-format-truncation -Wno-stringop-truncation -g -O2 -std=gnu17 -std=c11 -Wextra -Wall -Werror -Wno-declaration-after-statement -Wno-vla -Wno-long-long -Wmissing-variable-declarations -fPIC -DEXTVERSION=\"0.19.5\" -I. -I./ -I/nix/store/48l45fvi99n90x6p9i4cs1lmzby6cb73-postgresql-15.19/include/server -I/nix/store/48l45fvi99n90x6p9i4cs1lmzby6cb73-postgresql-15.19/include/internal -D_GNU_SOURCE -I/nix/store/p17klc3qq4nl9ihfwqfpi8cnqvcf92xz-libxml2-2.15.1-dev/include/libxml2 -I/nix/store/mglbi4dy4kpx7v1dcgf6iincp5x38hsc-lz4-1.10.0-dev/include -I/nix/store/g41q9md9rdcr3lkydi6f8zd6fza3h1q4-zstd-1.5.7-dev/include -I/nix/store/n2vnr7ycfk6midbzxcwd28qj3bgb50cz-icu4c-75.1-dev/include -c -o src/errors.o src/errors.c501 > gcc -Wall -Wmissing-prototypes -Wpointer-arith -Wdeclaration-after-statement -Werror=vla -Wendif-labels -Wmissing-format-attribute -Wimplicit-fallthrough=3 -Wcast-function-type -Wformat-security -fno-strict-aliasing -fwrapv -fexcess-precision=standard -Wno-deprecated-non-prototype -Wno-format-truncation -Wno-stringop-truncation -g -O2 -std=gnu17 -std=c11 -Wextra -Wall -Werror -Wno-declaration-after-statement -Wno-vla -Wno-long-long -Wmissing-variable-declarations -fPIC -DEXTVERSION=\"0.19.5\" -I. -I./ -I/nix/store/48l45fvi99n90x6p9i4cs1lmzby6cb73-postgresql-15.19/include/server -I/nix/store/48l45fvi99n90x6p9i4cs1lmzby6cb73-postgresql-15.19/include/internal -D_GNU_SOURCE -I/nix/store/p17klc3qq4nl9ihfwqfpi8cnqvcf92xz-libxml2-2.15.1-dev/include/libxml2 -I/nix/store/mglbi4dy4kpx7v1dcgf6iincp5x38hsc-lz4-1.10.0-dev/include -I/nix/store/g41q9md9rdcr3lkydi6f8zd6fza3h1q4-zstd-1.5.7-dev/include -I/nix/store/n2vnr7ycfk6midbzxcwd28qj3bgb50cz-icu4c-75.1-dev/include -c -o src/event.o src/event.c502 > In file included from /nix/store/jviasb44hibgh09829gbmbssbz2jjnhz-curl-8.17.0-dev/include/curl/curl.h:3333,503 > from /nix/store/jviasb44hibgh09829gbmbssbz2jjnhz-curl-8.17.0-dev/include/curl/multi.h:51,504 > from src/event.h:4,505 > from src/event.c:6:506 > /nix/store/jviasb44hibgh09829gbmbssbz2jjnhz-curl-8.17.0-dev/include/curl/multi.h:429:23: error: expected identifier or '(' before '__extension__'507 > 429 | CURL_EXTERN CURLMcode curl_multi_setopt(CURLM *multi_handle,508 > | ^~~~~~~~~~~~~~~~~509 > /nix/store/jviasb44hibgh09829gbmbssbz2jjnhz-curl-8.17.0-dev/include/curl/multi.h:429:23: error: expected identifier or '(' before ')' token510 > 429 | CURL_EXTERN CURLMcode curl_multi_setopt(CURLM *multi_handle,511 > | ^~~~~~~~~~~~~~~~~512 > make: *** [<builtin>: src/event.o] Error 1513 For full logs, run:514 nix log /nix/store/7iq4z475k625nsn9wc9nf4vxa7x1f1qd-pg_net-0.19.5.drv515error: Cannot build '/nix/store/7iq4z475k625nsn9wc9nf4vxa7x1f1qd-pg_net-0.19.5.drv'.516 Reason: builder failed with exit code 1.517 Output paths:518 /nix/store/mx90q334pqf6iwkyb9vk1wzl5nhmqmiv-pg_net-0.19.5519error: build of '/nix/store/yf5z0qi17vprkjz68rqyp804sx929g9n-pg_net-0.19.5.drv' on 'ssh-ng://nixbot-remote-build@78.232.36.247' failed: Cannot build '/nix/store/yf5z0qi17vprkjz68rqyp804sx929g9n-pg_net-0.19.5.drv'.520 Reason: builder failed with exit code 2.521 Output paths:522 /nix/store/910sp8g3bfhhfdcqhihd5al828k3839f-pg_net-0.19.5523 Last 22 log lines:524 > Running phase: unpackPhase525 > unpacking source archive /nix/store/5zgdqy3bz93jyn79pizxc1hks0cdcadw-source526 > source root is source527 > Running phase: patchPhase528 > Running phase: updateAutotoolsGnuConfigScriptsPhase529 > Running phase: configurePhase530 > no configure script, doing nothing531 > Running phase: buildPhase532 > gcc -Wall -Wmissing-prototypes -Wpointer-arith -Wdeclaration-after-statement -Werror=vla -Wendif-labels -Wmissing-format-attribute -Wimplicit-fallthrough=3 -Wcast-function-type -Wshadow=compatible-local -Wformat-security -fno-strict-aliasing -fwrapv -fexcess-precision=standard -Wno-format-truncation -Wno-stringop-truncation -g -O2 -std=c11 -Wextra -Wall -Werror -Wno-declaration-after-statement -Wno-vla -Wno-long-long -Wmissing-variable-declarations -fPIC -fvisibility=hidden -DEXTVERSION=\"0.19.5\" -I. -I./ -I/nix/store/9q4p23a2y63xn8safzzn6lbn07bnkshs-postgresql-17.11/include/server -I/nix/store/9q4p23a2y63xn8safzzn6lbn07bnkshs-postgresql-17.11/include/internal -D_GNU_SOURCE -I/nix/store/p17klc3qq4nl9ihfwqfpi8cnqvcf92xz-libxml2-2.15.1-dev/include/libxml2 -I/nix/store/mglbi4dy4kpx7v1dcgf6iincp5x38hsc-lz4-1.10.0-dev/include -I/nix/store/g41q9md9rdcr3lkydi6f8zd6fza3h1q4-zstd-1.5.7-dev/include -I/nix/store/n2vnr7ycfk6midbzxcwd28qj3bgb50cz-icu4c-75.1-dev/include -c -o src/core.o src/core.c533 > gcc -Wall -Wmissing-prototypes -Wpointer-arith -Wdeclaration-after-statement -Werror=vla -Wendif-labels -Wmissing-format-attribute -Wimplicit-fallthrough=3 -Wcast-function-type -Wshadow=compatible-local -Wformat-security -fno-strict-aliasing -fwrapv -fexcess-precision=standard -Wno-format-truncation -Wno-stringop-truncation -g -O2 -std=c11 -Wextra -Wall -Werror -Wno-declaration-after-statement -Wno-vla -Wno-long-long -Wmissing-variable-declarations -fPIC -fvisibility=hidden -DEXTVERSION=\"0.19.5\" -I. -I./ -I/nix/store/9q4p23a2y63xn8safzzn6lbn07bnkshs-postgresql-17.11/include/server -I/nix/store/9q4p23a2y63xn8safzzn6lbn07bnkshs-postgresql-17.11/include/internal -D_GNU_SOURCE -I/nix/store/p17klc3qq4nl9ihfwqfpi8cnqvcf92xz-libxml2-2.15.1-dev/include/libxml2 -I/nix/store/mglbi4dy4kpx7v1dcgf6iincp5x38hsc-lz4-1.10.0-dev/include -I/nix/store/g41q9md9rdcr3lkydi6f8zd6fza3h1q4-zstd-1.5.7-dev/include -I/nix/store/n2vnr7ycfk6midbzxcwd28qj3bgb50cz-icu4c-75.1-dev/include -c -o src/errors.o src/errors.c534 > gcc -Wall -Wmissing-prototypes -Wpointer-arith -Wdeclaration-after-statement -Werror=vla -Wendif-labels -Wmissing-format-attribute -Wimplicit-fallthrough=3 -Wcast-function-type -Wshadow=compatible-local -Wformat-security -fno-strict-aliasing -fwrapv -fexcess-precision=standard -Wno-format-truncation -Wno-stringop-truncation -g -O2 -std=c11 -Wextra -Wall -Werror -Wno-declaration-after-statement -Wno-vla -Wno-long-long -Wmissing-variable-declarations -fPIC -fvisibility=hidden -DEXTVERSION=\"0.19.5\" -I. -I./ -I/nix/store/9q4p23a2y63xn8safzzn6lbn07bnkshs-postgresql-17.11/include/server -I/nix/store/9q4p23a2y63xn8safzzn6lbn07bnkshs-postgresql-17.11/include/internal -D_GNU_SOURCE -I/nix/store/p17klc3qq4nl9ihfwqfpi8cnqvcf92xz-libxml2-2.15.1-dev/include/libxml2 -I/nix/store/mglbi4dy4kpx7v1dcgf6iincp5x38hsc-lz4-1.10.0-dev/include -I/nix/store/g41q9md9rdcr3lkydi6f8zd6fza3h1q4-zstd-1.5.7-dev/include -I/nix/store/n2vnr7ycfk6midbzxcwd28qj3bgb50cz-icu4c-75.1-dev/include -c -o src/event.o src/event.c535 > In file included from /nix/store/jviasb44hibgh09829gbmbssbz2jjnhz-curl-8.17.0-dev/include/curl/curl.h:3333,536 > from /nix/store/jviasb44hibgh09829gbmbssbz2jjnhz-curl-8.17.0-dev/include/curl/multi.h:51,537 > from src/event.h:4,538 > from src/event.c:6:539 > /nix/store/jviasb44hibgh09829gbmbssbz2jjnhz-curl-8.17.0-dev/include/curl/multi.h:429:23: error: expected identifier or '(' before '__extension__'540 > 429 | CURL_EXTERN CURLMcode curl_multi_setopt(CURLM *multi_handle,541 > | ^~~~~~~~~~~~~~~~~542 > /nix/store/jviasb44hibgh09829gbmbssbz2jjnhz-curl-8.17.0-dev/include/curl/multi.h:429:23: error: expected identifier or '(' before ')' token543 > 429 | CURL_EXTERN CURLMcode curl_multi_setopt(CURLM *multi_handle,544 > | ^~~~~~~~~~~~~~~~~545 > make: *** [<builtin>: src/event.o] Error 1546 For full logs, run:547 nix log /nix/store/yf5z0qi17vprkjz68rqyp804sx929g9n-pg_net-0.19.5.drv548error: Cannot build '/nix/store/yf5z0qi17vprkjz68rqyp804sx929g9n-pg_net-0.19.5.drv'.549 Reason: builder failed with exit code 1.550 Output paths:551 /nix/store/910sp8g3bfhhfdcqhihd5al828k3839f-pg_net-0.19.5552error: build of '/nix/store/a0ldx82cv1chkbdks86c8mjp8ps4lfgn-pg_net-0.20.0.drv' on 'ssh-ng://nixbot-remote-build@78.232.36.247' failed: Cannot build '/nix/store/a0ldx82cv1chkbdks86c8mjp8ps4lfgn-pg_net-0.20.0.drv'.553 Reason: builder failed with exit code 2.554 Output paths:555 /nix/store/j9hxarpn08mgqpwavw7wdypm8adf921z-pg_net-0.20.0556 Last 22 log lines:557 > Running phase: unpackPhase558 > unpacking source archive /nix/store/3783i7yhcfqnyv5ndli22gcr11ap151m-source559 > source root is source560 > Running phase: patchPhase561 > Running phase: updateAutotoolsGnuConfigScriptsPhase562 > Running phase: configurePhase563 > no configure script, doing nothing564 > Running phase: buildPhase565 > gcc -Wall -Wmissing-prototypes -Wpointer-arith -Wdeclaration-after-statement -Werror=vla -Wendif-labels -Wmissing-format-attribute -Wimplicit-fallthrough=3 -Wcast-function-type -Wshadow=compatible-local -Wformat-security -fno-strict-aliasing -fwrapv -fexcess-precision=standard -Wno-format-truncation -Wno-stringop-truncation -moutline-atomics -g -O2 -std=c11 -Wextra -Wall -Werror -Wno-declaration-after-statement -Wno-vla -Wno-long-long -Wmissing-variable-declarations -fPIC -fvisibility=hidden -DEXTVERSION=\"0.20.0\" -I. -I./ -I/nix/store/wq2kfr0rkb0hdmf1iwi3mi8pxycakzmq-postgresql-17_22/include/server -I/nix/store/wq2kfr0rkb0hdmf1iwi3mi8pxycakzmq-postgresql-17_22/include/internal -D_GNU_SOURCE -I/nix/store/p17klc3qq4nl9ihfwqfpi8cnqvcf92xz-libxml2-2.15.1-dev/include/libxml2 -I/nix/store/mglbi4dy4kpx7v1dcgf6iincp5x38hsc-lz4-1.10.0-dev/include -I/nix/store/g41q9md9rdcr3lkydi6f8zd6fza3h1q4-zstd-1.5.7-dev/include -I/nix/store/n2vnr7ycfk6midbzxcwd28qj3bgb50cz-icu4c-75.1-dev/include -c -o src/core.o src/core.c566 > gcc -Wall -Wmissing-prototypes -Wpointer-arith -Wdeclaration-after-statement -Werror=vla -Wendif-labels -Wmissing-format-attribute -Wimplicit-fallthrough=3 -Wcast-function-type -Wshadow=compatible-local -Wformat-security -fno-strict-aliasing -fwrapv -fexcess-precision=standard -Wno-format-truncation -Wno-stringop-truncation -moutline-atomics -g -O2 -std=c11 -Wextra -Wall -Werror -Wno-declaration-after-statement -Wno-vla -Wno-long-long -Wmissing-variable-declarations -fPIC -fvisibility=hidden -DEXTVERSION=\"0.20.0\" -I. -I./ -I/nix/store/wq2kfr0rkb0hdmf1iwi3mi8pxycakzmq-postgresql-17_22/include/server -I/nix/store/wq2kfr0rkb0hdmf1iwi3mi8pxycakzmq-postgresql-17_22/include/internal -D_GNU_SOURCE -I/nix/store/p17klc3qq4nl9ihfwqfpi8cnqvcf92xz-libxml2-2.15.1-dev/include/libxml2 -I/nix/store/mglbi4dy4kpx7v1dcgf6iincp5x38hsc-lz4-1.10.0-dev/include -I/nix/store/g41q9md9rdcr3lkydi6f8zd6fza3h1q4-zstd-1.5.7-dev/include -I/nix/store/n2vnr7ycfk6midbzxcwd28qj3bgb50cz-icu4c-75.1-dev/include -c -o src/errors.o src/errors.c567 > gcc -Wall -Wmissing-prototypes -Wpointer-arith -Wdeclaration-after-statement -Werror=vla -Wendif-labels -Wmissing-format-attribute -Wimplicit-fallthrough=3 -Wcast-function-type -Wshadow=compatible-local -Wformat-security -fno-strict-aliasing -fwrapv -fexcess-precision=standard -Wno-format-truncation -Wno-stringop-truncation -moutline-atomics -g -O2 -std=c11 -Wextra -Wall -Werror -Wno-declaration-after-statement -Wno-vla -Wno-long-long -Wmissing-variable-declarations -fPIC -fvisibility=hidden -DEXTVERSION=\"0.20.0\" -I. -I./ -I/nix/store/wq2kfr0rkb0hdmf1iwi3mi8pxycakzmq-postgresql-17_22/include/server -I/nix/store/wq2kfr0rkb0hdmf1iwi3mi8pxycakzmq-postgresql-17_22/include/internal -D_GNU_SOURCE -I/nix/store/p17klc3qq4nl9ihfwqfpi8cnqvcf92xz-libxml2-2.15.1-dev/include/libxml2 -I/nix/store/mglbi4dy4kpx7v1dcgf6iincp5x38hsc-lz4-1.10.0-dev/include -I/nix/store/g41q9md9rdcr3lkydi6f8zd6fza3h1q4-zstd-1.5.7-dev/include -I/nix/store/n2vnr7ycfk6midbzxcwd28qj3bgb50cz-icu4c-75.1-dev/include -c -o src/event.o src/event.c568 > In file included from /nix/store/jviasb44hibgh09829gbmbssbz2jjnhz-curl-8.17.0-dev/include/curl/curl.h:3333,569 > from /nix/store/jviasb44hibgh09829gbmbssbz2jjnhz-curl-8.17.0-dev/include/curl/multi.h:51,570 > from src/event.h:4,571 > from src/event.c:6:572 > /nix/store/jviasb44hibgh09829gbmbssbz2jjnhz-curl-8.17.0-dev/include/curl/multi.h:429:23: error: expected identifier or '(' before '__extension__'573 > 429 | CURL_EXTERN CURLMcode curl_multi_setopt(CURLM *multi_handle,574 > | ^~~~~~~~~~~~~~~~~575 > /nix/store/jviasb44hibgh09829gbmbssbz2jjnhz-curl-8.17.0-dev/include/curl/multi.h:429:23: error: expected identifier or '(' before ')' token576 > 429 | CURL_EXTERN CURLMcode curl_multi_setopt(CURLM *multi_handle,577 > | ^~~~~~~~~~~~~~~~~578 > make: *** [<builtin>: src/event.o] Error 1579 For full logs, run:580 nix log /nix/store/a0ldx82cv1chkbdks86c8mjp8ps4lfgn-pg_net-0.20.0.drv581error: Cannot build '/nix/store/a0ldx82cv1chkbdks86c8mjp8ps4lfgn-pg_net-0.20.0.drv'.582 Reason: builder failed with exit code 1.583 Output paths:584 /nix/store/j9hxarpn08mgqpwavw7wdypm8adf921z-pg_net-0.20.0585error: Cannot build '/nix/store/vvs47f973jig6lflvm7cidm6m20glpy5-pg_net.drv'.586 Reason: 4 dependencies failed.587 Output paths:588 /nix/store/b0bs0di9wnr2lphh29rb3cyghbrpflly-pg_net589error: build of '/nix/store/b1pyvgjyn940h95bbnsp15qmb0qli5gd-pg_net-0.20.0.drv' on 'ssh-ng://nixbot-remote-build@78.232.36.247' failed: Cannot build '/nix/store/b1pyvgjyn940h95bbnsp15qmb0qli5gd-pg_net-0.20.0.drv'.590 Reason: builder failed with exit code 2.591 Output paths:592 /nix/store/r13hlgma95j03wagv3kcyfxmdmxs0dx6-pg_net-0.20.0593 Last 22 log lines:594 > Running phase: unpackPhase595 > unpacking source archive /nix/store/3783i7yhcfqnyv5ndli22gcr11ap151m-source596 > source root is source597 > Running phase: patchPhase598 > Running phase: updateAutotoolsGnuConfigScriptsPhase599 > Running phase: configurePhase600 > no configure script, doing nothing601 > Running phase: buildPhase602 > gcc -Wall -Wmissing-prototypes -Wpointer-arith -Wdeclaration-after-statement -Werror=vla -Wendif-labels -Wmissing-format-attribute -Wimplicit-fallthrough=3 -Wcast-function-type -Wshadow=compatible-local -Wformat-security -fno-strict-aliasing -fwrapv -fexcess-precision=standard -Wno-format-truncation -Wno-stringop-truncation -g -O2 -std=c11 -Wextra -Wall -Werror -Wno-declaration-after-statement -Wno-vla -Wno-long-long -Wmissing-variable-declarations -fPIC -fvisibility=hidden -DEXTVERSION=\"0.20.0\" -I. -I./ -I/nix/store/9q4p23a2y63xn8safzzn6lbn07bnkshs-postgresql-17.11/include/server -I/nix/store/9q4p23a2y63xn8safzzn6lbn07bnkshs-postgresql-17.11/include/internal -D_GNU_SOURCE -I/nix/store/p17klc3qq4nl9ihfwqfpi8cnqvcf92xz-libxml2-2.15.1-dev/include/libxml2 -I/nix/store/mglbi4dy4kpx7v1dcgf6iincp5x38hsc-lz4-1.10.0-dev/include -I/nix/store/g41q9md9rdcr3lkydi6f8zd6fza3h1q4-zstd-1.5.7-dev/include -I/nix/store/n2vnr7ycfk6midbzxcwd28qj3bgb50cz-icu4c-75.1-dev/include -c -o src/core.o src/core.c603 > gcc -Wall -Wmissing-prototypes -Wpointer-arith -Wdeclaration-after-statement -Werror=vla -Wendif-labels -Wmissing-format-attribute -Wimplicit-fallthrough=3 -Wcast-function-type -Wshadow=compatible-local -Wformat-security -fno-strict-aliasing -fwrapv -fexcess-precision=standard -Wno-format-truncation -Wno-stringop-truncation -g -O2 -std=c11 -Wextra -Wall -Werror -Wno-declaration-after-statement -Wno-vla -Wno-long-long -Wmissing-variable-declarations -fPIC -fvisibility=hidden -DEXTVERSION=\"0.20.0\" -I. -I./ -I/nix/store/9q4p23a2y63xn8safzzn6lbn07bnkshs-postgresql-17.11/include/server -I/nix/store/9q4p23a2y63xn8safzzn6lbn07bnkshs-postgresql-17.11/include/internal -D_GNU_SOURCE -I/nix/store/p17klc3qq4nl9ihfwqfpi8cnqvcf92xz-libxml2-2.15.1-dev/include/libxml2 -I/nix/store/mglbi4dy4kpx7v1dcgf6iincp5x38hsc-lz4-1.10.0-dev/include -I/nix/store/g41q9md9rdcr3lkydi6f8zd6fza3h1q4-zstd-1.5.7-dev/include -I/nix/store/n2vnr7ycfk6midbzxcwd28qj3bgb50cz-icu4c-75.1-dev/include -c -o src/errors.o src/errors.c604 > gcc -Wall -Wmissing-prototypes -Wpointer-arith -Wdeclaration-after-statement -Werror=vla -Wendif-labels -Wmissing-format-attribute -Wimplicit-fallthrough=3 -Wcast-function-type -Wshadow=compatible-local -Wformat-security -fno-strict-aliasing -fwrapv -fexcess-precision=standard -Wno-format-truncation -Wno-stringop-truncation -g -O2 -std=c11 -Wextra -Wall -Werror -Wno-declaration-after-statement -Wno-vla -Wno-long-long -Wmissing-variable-declarations -fPIC -fvisibility=hidden -DEXTVERSION=\"0.20.0\" -I. -I./ -I/nix/store/9q4p23a2y63xn8safzzn6lbn07bnkshs-postgresql-17.11/include/server -I/nix/store/9q4p23a2y63xn8safzzn6lbn07bnkshs-postgresql-17.11/include/internal -D_GNU_SOURCE -I/nix/store/p17klc3qq4nl9ihfwqfpi8cnqvcf92xz-libxml2-2.15.1-dev/include/libxml2 -I/nix/store/mglbi4dy4kpx7v1dcgf6iincp5x38hsc-lz4-1.10.0-dev/include -I/nix/store/g41q9md9rdcr3lkydi6f8zd6fza3h1q4-zstd-1.5.7-dev/include -I/nix/store/n2vnr7ycfk6midbzxcwd28qj3bgb50cz-icu4c-75.1-dev/include -c -o src/event.o src/event.c605 > In file included from /nix/store/jviasb44hibgh09829gbmbssbz2jjnhz-curl-8.17.0-dev/include/curl/curl.h:3333,606 > from /nix/store/jviasb44hibgh09829gbmbssbz2jjnhz-curl-8.17.0-dev/include/curl/multi.h:51,607 > from src/event.h:4,608 > from src/event.c:6:609 > /nix/store/jviasb44hibgh09829gbmbssbz2jjnhz-curl-8.17.0-dev/include/curl/multi.h:429:23: error: expected identifier or '(' before '__extension__'610 > 429 | CURL_EXTERN CURLMcode curl_multi_setopt(CURLM *multi_handle,611 > | ^~~~~~~~~~~~~~~~~612 > /nix/store/jviasb44hibgh09829gbmbssbz2jjnhz-curl-8.17.0-dev/include/curl/multi.h:429:23: error: expected identifier or '(' before ')' token613 > 429 | CURL_EXTERN CURLMcode curl_multi_setopt(CURLM *multi_handle,614 > | ^~~~~~~~~~~~~~~~~615 > make: *** [<builtin>: src/event.o] Error 1616 For full logs, run:617 nix log /nix/store/b1pyvgjyn940h95bbnsp15qmb0qli5gd-pg_net-0.20.0.drv618error: Cannot build '/nix/store/b1pyvgjyn940h95bbnsp15qmb0qli5gd-pg_net-0.20.0.drv'.619 Reason: builder failed with exit code 1.620 Output paths:621 /nix/store/r13hlgma95j03wagv3kcyfxmdmxs0dx6-pg_net-0.20.0622error: Cannot build '/nix/store/y02vszvrhs7b6kn8llgwzdmnmhqiymzk-pg_net.drv'.623 Reason: 4 dependencies failed.624 Output paths:625 /nix/store/279d7pzxppyz66f6rw8fplifvz9b6s0s-pg_net626error: build of '/nix/store/nwcnf7x9i2zdx48936w9ixsnxzhbab16-pg_net-0.20.0.drv' on 'ssh-ng://nixbot-remote-build@78.232.36.247' failed: Cannot build '/nix/store/nwcnf7x9i2zdx48936w9ixsnxzhbab16-pg_net-0.20.0.drv'.627 Reason: builder failed with exit code 2.628 Output paths:629 /nix/store/5abg792kgyfqqg3w6nh6wfm1jallf5hq-pg_net-0.20.0630 Last 22 log lines:631 > Running phase: unpackPhase632 > unpacking source archive /nix/store/3783i7yhcfqnyv5ndli22gcr11ap151m-source633 > source root is source634 > Running phase: patchPhase635 > Running phase: updateAutotoolsGnuConfigScriptsPhase636 > Running phase: configurePhase637 > no configure script, doing nothing638 > Running phase: buildPhase639 > gcc -Wall -Wmissing-prototypes -Wpointer-arith -Wdeclaration-after-statement -Werror=vla -Wendif-labels -Wmissing-format-attribute -Wimplicit-fallthrough=3 -Wcast-function-type -Wformat-security -fno-strict-aliasing -fwrapv -fexcess-precision=standard -Wno-deprecated-non-prototype -Wno-format-truncation -Wno-stringop-truncation -g -O2 -std=gnu17 -std=c11 -Wextra -Wall -Werror -Wno-declaration-after-statement -Wno-vla -Wno-long-long -Wmissing-variable-declarations -fPIC -DEXTVERSION=\"0.20.0\" -I. -I./ -I/nix/store/48l45fvi99n90x6p9i4cs1lmzby6cb73-postgresql-15.19/include/server -I/nix/store/48l45fvi99n90x6p9i4cs1lmzby6cb73-postgresql-15.19/include/internal -D_GNU_SOURCE -I/nix/store/p17klc3qq4nl9ihfwqfpi8cnqvcf92xz-libxml2-2.15.1-dev/include/libxml2 -I/nix/store/mglbi4dy4kpx7v1dcgf6iincp5x38hsc-lz4-1.10.0-dev/include -I/nix/store/g41q9md9rdcr3lkydi6f8zd6fza3h1q4-zstd-1.5.7-dev/include -I/nix/store/n2vnr7ycfk6midbzxcwd28qj3bgb50cz-icu4c-75.1-dev/include -c -o src/core.o src/core.c640 > gcc -Wall -Wmissing-prototypes -Wpointer-arith -Wdeclaration-after-statement -Werror=vla -Wendif-labels -Wmissing-format-attribute -Wimplicit-fallthrough=3 -Wcast-function-type -Wformat-security -fno-strict-aliasing -fwrapv -fexcess-precision=standard -Wno-deprecated-non-prototype -Wno-format-truncation -Wno-stringop-truncation -g -O2 -std=gnu17 -std=c11 -Wextra -Wall -Werror -Wno-declaration-after-statement -Wno-vla -Wno-long-long -Wmissing-variable-declarations -fPIC -DEXTVERSION=\"0.20.0\" -I. -I./ -I/nix/store/48l45fvi99n90x6p9i4cs1lmzby6cb73-postgresql-15.19/include/server -I/nix/store/48l45fvi99n90x6p9i4cs1lmzby6cb73-postgresql-15.19/include/internal -D_GNU_SOURCE -I/nix/store/p17klc3qq4nl9ihfwqfpi8cnqvcf92xz-libxml2-2.15.1-dev/include/libxml2 -I/nix/store/mglbi4dy4kpx7v1dcgf6iincp5x38hsc-lz4-1.10.0-dev/include -I/nix/store/g41q9md9rdcr3lkydi6f8zd6fza3h1q4-zstd-1.5.7-dev/include -I/nix/store/n2vnr7ycfk6midbzxcwd28qj3bgb50cz-icu4c-75.1-dev/include -c -o src/errors.o src/errors.c641 > gcc -Wall -Wmissing-prototypes -Wpointer-arith -Wdeclaration-after-statement -Werror=vla -Wendif-labels -Wmissing-format-attribute -Wimplicit-fallthrough=3 -Wcast-function-type -Wformat-security -fno-strict-aliasing -fwrapv -fexcess-precision=standard -Wno-deprecated-non-prototype -Wno-format-truncation -Wno-stringop-truncation -g -O2 -std=gnu17 -std=c11 -Wextra -Wall -Werror -Wno-declaration-after-statement -Wno-vla -Wno-long-long -Wmissing-variable-declarations -fPIC -DEXTVERSION=\"0.20.0\" -I. -I./ -I/nix/store/48l45fvi99n90x6p9i4cs1lmzby6cb73-postgresql-15.19/include/server -I/nix/store/48l45fvi99n90x6p9i4cs1lmzby6cb73-postgresql-15.19/include/internal -D_GNU_SOURCE -I/nix/store/p17klc3qq4nl9ihfwqfpi8cnqvcf92xz-libxml2-2.15.1-dev/include/libxml2 -I/nix/store/mglbi4dy4kpx7v1dcgf6iincp5x38hsc-lz4-1.10.0-dev/include -I/nix/store/g41q9md9rdcr3lkydi6f8zd6fza3h1q4-zstd-1.5.7-dev/include -I/nix/store/n2vnr7ycfk6midbzxcwd28qj3bgb50cz-icu4c-75.1-dev/include -c -o src/event.o src/event.c642 > In file included from /nix/store/jviasb44hibgh09829gbmbssbz2jjnhz-curl-8.17.0-dev/include/curl/curl.h:3333,643 > from /nix/store/jviasb44hibgh09829gbmbssbz2jjnhz-curl-8.17.0-dev/include/curl/multi.h:51,644 > from src/event.h:4,645 > from src/event.c:6:646 > /nix/store/jviasb44hibgh09829gbmbssbz2jjnhz-curl-8.17.0-dev/include/curl/multi.h:429:23: error: expected identifier or '(' before '__extension__'647 > 429 | CURL_EXTERN CURLMcode curl_multi_setopt(CURLM *multi_handle,648 > | ^~~~~~~~~~~~~~~~~649 > /nix/store/jviasb44hibgh09829gbmbssbz2jjnhz-curl-8.17.0-dev/include/curl/multi.h:429:23: error: expected identifier or '(' before ')' token650 > 429 | CURL_EXTERN CURLMcode curl_multi_setopt(CURLM *multi_handle,651 > | ^~~~~~~~~~~~~~~~~652 > make: *** [<builtin>: src/event.o] Error 1653 For full logs, run:654 nix log /nix/store/nwcnf7x9i2zdx48936w9ixsnxzhbab16-pg_net-0.20.0.drv655error: Cannot build '/nix/store/nwcnf7x9i2zdx48936w9ixsnxzhbab16-pg_net-0.20.0.drv'.656 Reason: builder failed with exit code 1.657 Output paths:658 /nix/store/5abg792kgyfqqg3w6nh6wfm1jallf5hq-pg_net-0.20.0659error: build of '/nix/store/rfdqkjkjdwz7ydrwlfn9cdy68zz9z6rf-pg_net-0.7.drv' on 'ssh-ng://nixbot-remote-build@78.232.36.247' failed: Cannot build '/nix/store/rfdqkjkjdwz7ydrwlfn9cdy68zz9z6rf-pg_net-0.7.drv'.660 Reason: builder failed with exit code 2.661 Output paths:662 /nix/store/yxd26zp7dvdq20sqsk13x0lk0bqd7j9i-pg_net-0.7663 Last 25 log lines:664 > | ^~~~~~~~~~~~~~665 > src/util.h:6:11: warning: call to 'Wcurl_easy_setopt_err_long' declared with attribute warning: curl_easy_setopt expects a long argument [-Wattribute-warning]666 > 6 | if (curl_easy_setopt(hdl, opt, prm) != CURLE_OK) \667 > | ^~~~~~~~~~~~~~~~668 > src/core.c:108:3: note: in expansion of macro 'CURL_EZ_SETOPT'669 > 108 | CURL_EZ_SETOPT(curl_ez_handle, CURLOPT_TIMEOUT_MS, timeout_milliseconds);670 > | ^~~~~~~~~~~~~~671 > src/util.h:6:11: warning: call to 'Wcurl_easy_setopt_err_long' declared with attribute warning: curl_easy_setopt expects a long argument [-Wattribute-warning]672 > 6 | if (curl_easy_setopt(hdl, opt, prm) != CURLE_OK) \673 > | ^~~~~~~~~~~~~~~~674 > src/core.c:110:3: note: in expansion of macro 'CURL_EZ_SETOPT'675 > 110 | CURL_EZ_SETOPT(curl_ez_handle, CURLOPT_FOLLOWLOCATION, true);676 > | ^~~~~~~~~~~~~~677 > gcc -Wall -Wmissing-prototypes -Wpointer-arith -Wdeclaration-after-statement -Werror=vla -Wendif-labels -Wmissing-format-attribute -Wimplicit-fallthrough=3 -Wcast-function-type -Wformat-security -fno-strict-aliasing -fwrapv -fexcess-precision=standard -Wno-deprecated-non-prototype -Wno-format-truncation -Wno-stringop-truncation -g -O2 -std=gnu17 -std=c11 -Werror -Wno-declaration-after-statement -fPIC -DEXTVERSION=\"0.13.0\" -I. -I./ -I/nix/store/48l45fvi99n90x6p9i4cs1lmzby6cb73-postgresql-15.19/include/server -I/nix/store/48l45fvi99n90x6p9i4cs1lmzby6cb73-postgresql-15.19/include/internal -D_GNU_SOURCE -I/nix/store/p17klc3qq4nl9ihfwqfpi8cnqvcf92xz-libxml2-2.15.1-dev/include/libxml2 -I/nix/store/mglbi4dy4kpx7v1dcgf6iincp5x38hsc-lz4-1.10.0-dev/include -I/nix/store/g41q9md9rdcr3lkydi6f8zd6fza3h1q4-zstd-1.5.7-dev/include -I/nix/store/n2vnr7ycfk6midbzxcwd28qj3bgb50cz-icu4c-75.1-dev/include -c -o src/event.o src/event.c678 > In file included from /nix/store/jviasb44hibgh09829gbmbssbz2jjnhz-curl-8.17.0-dev/include/curl/curl.h:3333,679 > from /nix/store/jviasb44hibgh09829gbmbssbz2jjnhz-curl-8.17.0-dev/include/curl/multi.h:51,680 > from src/event.h:4,681 > from src/event.c:6:682 > /nix/store/jviasb44hibgh09829gbmbssbz2jjnhz-curl-8.17.0-dev/include/curl/multi.h:429:23: error: expected identifier or '(' before '__extension__'683 > 429 | CURL_EXTERN CURLMcode curl_multi_setopt(CURLM *multi_handle,684 > | ^~~~~~~~~~~~~~~~~685 > /nix/store/jviasb44hibgh09829gbmbssbz2jjnhz-curl-8.17.0-dev/include/curl/multi.h:429:23: error: expected identifier or '(' before ')' token686 > 429 | CURL_EXTERN CURLMcode curl_multi_setopt(CURLM *multi_handle,687 > | ^~~~~~~~~~~~~~~~~688 > make: *** [<builtin>: src/event.o] Error 1689 For full logs, run:690 nix log /nix/store/rfdqkjkjdwz7ydrwlfn9cdy68zz9z6rf-pg_net-0.7.drv691error: Cannot build '/nix/store/rfdqkjkjdwz7ydrwlfn9cdy68zz9z6rf-pg_net-0.7.drv'.692 Reason: builder failed with exit code 1.693 Output paths:694 /nix/store/yxd26zp7dvdq20sqsk13x0lk0bqd7j9i-pg_net-0.7695error: Cannot build '/nix/store/q7ak647qv213m4vc4fnr43i09azs1b0p-pg_net.drv'.696 Reason: 5 dependencies failed.697 Output paths:698 /nix/store/9p2ykggx0qabaqhlslb35di6b0ypkcqn-pg_net699error: Cannot build '/nix/store/2fndab8axk4hz4s30ijaxnpa1bc9z1dc-postgresql-and-plugins-17_22.drv'.700 Reason: 1 dependency failed.701 Output paths:702 /nix/store/7f3w5h6iyxryqb3j56n4af0s0y6dy58p-postgresql-and-plugins-17_22703error: Cannot build '/nix/store/w85w5162f9zdpi7g98sjlk186hrrm57p-postgresql-and-plugins-17_22.drv'.704 Reason: 1 dependency failed.705 Output paths:706 /nix/store/c1aavrr5wsqbn4rvrvnln8yaz26zzdmy-postgresql-and-plugins-17_22707error: Cannot build '/nix/store/8r4vw45si1w8qby225b0amhay9ybj6c5-postgresql-orioledb-init.drv'.708 Reason: 1 dependency failed.709 Output paths:710 /nix/store/7c9qf6616nwzqfl6fi7yqdjk4z632qzi-postgresql-orioledb-init711error: Cannot build '/nix/store/9i9flpkzn6d3cvhin3s644150jhvcazf-supabase-orioledb-db-init.drv'.712 Reason: 1 dependency failed.713 Output paths:714 /nix/store/pz04bls9r7r21l14w2igx6amqgcywm60-supabase-orioledb-db-init715error: Cannot build '/nix/store/pgysndf7sfj9ifxk4sy1w8qfx2ln1ws6-unit-postgresql.service.drv'.716 Reason: 2 dependencies failed.717 Output paths:718 /nix/store/yhvd0y4vpmxwxj7c8qkg8gqzjmgbhxfb-unit-postgresql.service719error: Cannot build '/nix/store/s4qicdb2kbzvf3lf6m8xidm4lndgs2yl-unit-supabase-db-init.service.drv'.720 Reason: 1 dependency failed.721 Output paths:722 /nix/store/rzjca48wm4mi0ky3frwwgnm28085ajsx-unit-supabase-db-init.service723error: Cannot build '/nix/store/nj44phx30461wf1ac6n8fg8cc58agpgv-postgresql-and-plugins-17.11.drv'.724 Reason: 1 dependency failed.725 Output paths:726 /nix/store/2v72vvfw2gklj608vs5y8qh2kgyjh4k4-postgresql-and-plugins-17.11727error: Cannot build '/nix/store/rn61yq57k8lhdkx7al266vkbandycwv7-postgresql-and-plugins-17.11.drv'.728 Reason: 1 dependency failed.729 Output paths:730 /nix/store/m1vznlg6iaiwn871m0bw3fywbl8l0fpb-postgresql-and-plugins-17.11731error: Cannot build '/nix/store/fakh4z5ssr1vhknp3xv3ch232i3ph2ax-postgresql-and-plugins-15.19.drv'.732 Reason: 1 dependency failed.733 Output paths:734 /nix/store/k465i8vjw8xzi46ymkk5mhqydlcg32bd-postgresql-and-plugins-15.19735error: Cannot build '/nix/store/4z7sbcap8vdzfs1smz81k2crr4sgm640-postgresql-and-plugins-15.19.drv'.736 Reason: 1 dependency failed.737 Output paths:738 /nix/store/41g9k8wa6wm6jr22hn1xa6xzvg03fmbq-postgresql-and-plugins-15.19739error: Cannot build '/nix/store/rjsqz027b1xj9q5dymzvs3wbqn2dv53m-postgresql-init.drv'.740 Reason: 1 dependency failed.741 Output paths:742 /nix/store/mjfcivwp18j0qcajcv5y1w4rgqa438bi-postgresql-init743error: Cannot build '/nix/store/wmsihsmjyk0h8yjj86lpmijxpzqwk8gg-postgresql-migrate.drv'.744 Reason: 2 dependencies failed.745 Output paths:746 /nix/store/bwkbksfm1g1wg59n8lbbs6si6a0yzz7q-postgresql-migrate747error: Cannot build '/nix/store/qbfmigmm8fk4v5nhvb8h71hmhmdaky0g-supabase-db-init.drv'.748 Reason: 1 dependency failed.749 Output paths:750 /nix/store/qfjqsqsw03kfjf61y4cq3ffffpd1pywz-supabase-db-init751error: Cannot build '/nix/store/amy1ji0k53n9qihnqys9hvlc60bncr1y-system-path.drv'.752 Reason: 2 dependencies failed.753 Output paths:754 /nix/store/2q4zyfzbw4kd12h0h8y34skah708msd6-system-path755error: Cannot build '/nix/store/czird9kid1f479i75r0fcy4ivzd3zzs8-system-path.drv'.756 Reason: 2 dependencies failed.757 Output paths:758 /nix/store/rvv6sp52n8wy28gj22n2m58vir7dsbrf-system-path759error: Cannot build '/nix/store/q4qvxkwv7rl1jac9sf5aap56gjx0n5mb-system-path.drv'.760 Reason: 1 dependency failed.761 Output paths:762 /nix/store/ai2r0wvs9817lqvy62k93driv4x5j5bq-system-path763error: Cannot build '/nix/store/7ynly7nv4iq2wvhmmg6p100h3wr2dpxd-dbus-1.drv'.764 Reason: 1 dependency failed.765 Output paths:766 /nix/store/89605rggrrq6x9va83f79s492399z47h-dbus-1767error: Cannot build '/nix/store/9in45xg9fcahx70h7alf6jg08sin568q-dbus-1.drv'.768 Reason: 1 dependency failed.769 Output paths:770 /nix/store/cnqrgpjkq8n49z3q3niffxj2sq8cdkb8-dbus-1771error: Cannot build '/nix/store/i0ygxsqq6na1vsqmbklzxrj1xy5ypk6x-dbus-1.drv'.772 Reason: 1 dependency failed.773 Output paths:774 /nix/store/49qsknqi753xh51fxzjk9hcsf48r8r6h-dbus-1775error: Cannot build '/nix/store/pml1z1qw471w7nshf5dxp826pysqs3fz-unit-postgresql-migrate.service.drv'.776 Reason: 1 dependency failed.777 Output paths:778 /nix/store/ki6wyvxqxyi3jiqkbxqc9aj74i2dvr96-unit-postgresql-migrate.service779error: Cannot build '/nix/store/n0j0873l4a8mlkz6x1bffr3skhaarc7q-unit-postgresql.service.drv'.780 Reason: 2 dependencies failed.781 Output paths:782 /nix/store/nxnv5i6dsyxjqja66lf3nyv8v4mw73zi-unit-postgresql.service783error: Cannot build '/nix/store/qsr1582sizlpmavcla4x0gbp3q52g4pd-unit-postgresql.service.drv'.784 Reason: 2 dependencies failed.785 Output paths:786 /nix/store/jdpq4p0ii46fdbn6lk9pvjhr4fn9hlk3-unit-postgresql.service787error: Cannot build '/nix/store/ggfylf6a7iwk3pn3r08m30684z8rrq5l-unit-supabase-db-init.service.drv'.788 Reason: 1 dependency failed.789 Output paths:790 /nix/store/yj5im5r7lvm21a97a04zkn267czbrw3l-unit-supabase-db-init.service791error: Cannot build '/nix/store/jffmpfrihfl3k6lfgdc4ii4a62343h7x-X-Restart-Triggers-dbus.drv'.792 Reason: 1 dependency failed.793 Output paths:794 /nix/store/m1k5hvywmxrzrl65zdy4icssmqjwk1ac-X-Restart-Triggers-dbus795error: Cannot build '/nix/store/v749g53p5djbqg3y7kfvdsw5g535j0js-X-Restart-Triggers-dbus.drv'.796 Reason: 1 dependency failed.797 Output paths:798 /nix/store/bqpmmb848k6lgjk42nmhnfh1lg16q81k-X-Restart-Triggers-dbus799error: Cannot build '/nix/store/xnzsv2ymk0qx1fdsm8ssls8mlq8852wc-X-Restart-Triggers-dbus.drv'.800 Reason: 1 dependency failed.801 Output paths:802 /nix/store/3ml8z33q2whxydfyk2l5bkanh67jj07d-X-Restart-Triggers-dbus803error: Cannot build '/nix/store/0jyfsa7sd5nhfiwbk0i0i0k7bbgigy6z-unit-dbus.service.drv'.804 Reason: 1 dependency failed.805 Output paths:806 /nix/store/m1y0mf2s98whn8ssf75ghzldgsm2i6j9-unit-dbus.service807error: Cannot build '/nix/store/5q0f5sx5mas5cc56azv1g9pm53yfrmgc-unit-dbus.service.drv'.808 Reason: 1 dependency failed.809 Output paths:810 /nix/store/a3fz85ah6idqlahgibsss3anjhwvw43y-unit-dbus.service811error: Cannot build '/nix/store/70bg25srcrfnwivfph4bhslzhigdgpxw-unit-dbus.service.drv'.812 Reason: 1 dependency failed.813 Output paths:814 /nix/store/zsgh1qgm3jy8asyqvg4qj0wb78dcrmbr-unit-dbus.service815error: Cannot build '/nix/store/acfna74pf7f063994dvxzqkrrhi623c4-unit-dbus.service.drv'.816 Reason: 1 dependency failed.817 Output paths:818 /nix/store/fcdnvsn70basffr02wx4q0yhvh3bv51y-unit-dbus.service819error: Cannot build '/nix/store/jika4rfg3aj00vq2nfqx2i6nild4nvd5-unit-dbus.service.drv'.820 Reason: 1 dependency failed.821 Output paths:822 /nix/store/hc0bpb6ixv1mffh3g5ks67ha9kjwy2n3-unit-dbus.service823error: Cannot build '/nix/store/n7wg70ga6zm8b0prwd4np0azpi732zji-unit-dbus.service.drv'.824 Reason: 1 dependency failed.825 Output paths:826 /nix/store/x3jdzx5kg815chy5a6mzhahzblz1d3dd-unit-dbus.service827error: Cannot build '/nix/store/dgm1f7y3gvjqjfv7r4gfa7pjffgzr4nj-system-units.drv'.828 Reason: 3 dependencies failed.829 Output paths:830 /nix/store/0m00w4wh2xvzhb9yxz6xjfvg0hzigwis-system-units831error: Cannot build '/nix/store/vrslgxqykax3yi5mlrpiq0v1rq1ilnic-system-units.drv'.832 Reason: 3 dependencies failed.833 Output paths:834 /nix/store/52gkyknb3wx4k2jxapxdj48s5dcan612-system-units835error: Cannot build '/nix/store/ydkqsx664pp5ndcfl70c84mvxgixix01-system-units.drv'.836 Reason: 3 dependencies failed.837 Output paths:838 /nix/store/jzv8qrmiimbc1ndwa0a2rv9vrnkyngs2-system-units839error: Cannot build '/nix/store/a03cbyqm7arwjx83nc7jiwxkbbifg33w-user-units.drv'.840 Reason: 1 dependency failed.841 Output paths:842 /nix/store/8z053plx5r60s6ssccv8vp3v16frx3vh-user-units843error: Cannot build '/nix/store/bmn9rg4vrb07wyj1ls41afzdzcmhdqcm-user-units.drv'.844 Reason: 1 dependency failed.845 Output paths:846 /nix/store/w1bmfz9y06hf43vfs2dfhkbjnqqlb8vc-user-units847error: Cannot build '/nix/store/cpy2j0c5ribiykpjaig0axzryxzh1g69-user-units.drv'.848 Reason: 1 dependency failed.849 Output paths:850 /nix/store/k4q74vb1knwhdc9f757lwy0j04ivgldp-user-units851error: Cannot build '/nix/store/p6pnncmb31ibp4zxf61fbkkb0fmq4xai-etc.drv'.852 Reason: 4 dependencies failed.853 Output paths:854 /nix/store/9200yznkvplcyd5h6zzspwiji64ylhk3-etc855error: Cannot build '/nix/store/sc9b344gbckg6fqywin6bhhs882d6mxa-etc.drv'.856 Reason: 4 dependencies failed.857 Output paths:858 /nix/store/ckxf8wib3vwm6y41vzjr6qn5s96fai06-etc859error: Cannot build '/nix/store/y3dck3diii9z9x0w771pz541gjd0zwh3-etc.drv'.860 Reason: 4 dependencies failed.861 Output paths:862 /nix/store/0gg4z38348708b6snq8hbw2p0f6212am-etc863error: Cannot build '/nix/store/k4pazrfsvz1hsx7l4d0jsxvan5b3dq49-activate.drv'.864 Reason: 1 dependency failed.865 Output paths:866 /nix/store/kgg6la0id0ridfi2n5d6hjwrslqrr0lc-activate867error: Cannot build '/nix/store/srl146pjpar66ijj6l2zw99pmy6wpkl9-activate.drv'.868 Reason: 1 dependency failed.869 Output paths:870 /nix/store/fl857c057c4yxg6bzz5fxi20v1j54dm8-activate871error: Cannot build '/nix/store/x6cijf4csfmd0dc8sqmiajj5dwi4h3dg-activate.drv'.872 Reason: 1 dependency failed.873 Output paths:874 /nix/store/klnbpbna9j60p0z0p03vzc4aybrh66qm-activate875error: Cannot build '/nix/store/cgyqy4j1g2s9zbh87ddwhr7wn9rssarl-nixos-system-server-test.drv'.876 Reason: 3 dependencies failed.877 Output paths:878 /nix/store/w86xsbl1gwsw6jzbir4a2ydiraxdq237-nixos-system-server-test879error: Cannot build '/nix/store/m7z7bg6jaainvrfsikwclppim5yf6kn3-nixos-system-server-test.drv'.880 Reason: 3 dependencies failed.881 Output paths:882 /nix/store/b0ffbnx9s6yib8182ff9056hg0528yi5-nixos-system-server-test883error: Cannot build '/nix/store/sjl12wxd1wb23d9hzlzyqrq731lbrgpb-nixos-system-server-test.drv'.884 Reason: 5 dependencies failed.885 Output paths:886 /nix/store/h0xwxq0y2dhkic248nn5f8l5knznirly-nixos-system-server-test887error: Cannot build '/nix/store/qv2lxny9548lwqjzpi75n12qpyc0fm56-closure-info.drv'.888 Reason: 1 dependency failed.889 Output paths:890 /nix/store/r8bjdjr1r4w0maq6ykhq3hjqyx7fd9s0-closure-info891error: Cannot build '/nix/store/8vx14rz8lihgxgq3s0daqnbhbvnsf97x-run-nixos-vm.drv'.892 Reason: 2 dependencies failed.893 Output paths:894 /nix/store/4wmw3mf35qifw3d3kn3h8nzvi66cglw6-run-nixos-vm895error: Cannot build '/nix/store/63q2a748lli2nxvrk228r5l81997jmzh-nixos-vm.drv'.896 Reason: 2 dependencies failed.897 Output paths:898 /nix/store/rqsj38mgp07g96pmqjy91wzp8n7x75wq-nixos-vm899error: Cannot build '/nix/store/5sd5z8bi95zz9c9m7drwwc5r5gasm6g9-nixos-test-driver-postgis.drv'.900 Reason: 2 dependencies failed.901 Output paths:902 /nix/store/iklpwrhay7rrhiqlyxclb665a3w945rg-nixos-test-driver-postgis903error: Cannot build '/nix/store/gjqlih1fff3c1f6yvcnfjbv2s194n967-vm-test-run-postgis.drv'.904 Reason: 1 dependency failed.905 Output paths:906 /nix/store/ydnnih1n57b8xxwml5wpgnp6a91ib3ng-vm-test-run-postgis