setup
checks.aarch64-linux.ext-plv8
· build #133
· raw
1these 92 derivations will be built:2 /nix/store/0cmixqwsz3vb82j49j1mhvyk8crg4dcw-wrappers-0.6.0.drv3 /nix/store/0i6b8yy32fc4mgfm75w94gw9ja033kw5-wrappers-0.5.5.drv4 /nix/store/h1vl8vpk154yppn5lcqms2680igi0mmj-postgis-3.3.2.drv5 /nix/store/2ylkw9crapb58vd5g0vj602jfyb1p3r6-postgis.drv6 /nix/store/58cinn47vbvwr1wxdkspmvi9cj27b07h-safeupdate-1.4.drv7 /nix/store/6c0mnd757hvxppfyrsf4cb1wgnbd4111-safeupdate.drv8 /nix/store/k4swwy7459wf558rbrraclsr4sjccz0h-pgmq-1.4.4.drv9 /nix/store/8zsadvm8mv18kpy4qy724ps2jlbsik0w-pgmq.drv10 /nix/store/4wk9vb1q3kdnhj8hsq8pwgbp82glwg9w-timescaledb-2.9.1.drv11 /nix/store/9wzj3wh6sczzk849dmjwvmnkshggakxp-timescaledb.drv12 /nix/store/2nmg9sxx50xmndps3714hbvwjyd5rqv0-vector-0.8.2.drv13 /nix/store/alajylsl9b90m65n0ps0mkbkw679x4sn-vector-0.6.2.drv14 /nix/store/jmilv9h5p0v4grgqnhfn22i7zl352ybh-vector-0.7.4.drv15 /nix/store/q3mdjvqpw4xbwcjy5y1ps1igxsjvx133-vector-0.7.0.drv16 /nix/store/v5dnr617av2jgk6kpddxbxxqjqgl5kzg-vector-0.8.0.drv17 /nix/store/z40s48rz55qgpw6g6wiqi68hkfas4h1l-vector-0.6.0.drv18 /nix/store/9zndhfzc45vrfn297g1hav7m6ba3rlzk-vector.drv19 /nix/store/c08rdgxba5n6zhyp78l8sd6fhnbc4a4c-pgsodium-3.1.7.drv20 /nix/store/hh2jpg5qdwgdwzi96qcay1a5ffhi0f4i-pgsodium-3.1.6.drv21 /nix/store/jwrjvb9m50v44sla4jpig83jab7zn17x-pgsodium-3.1.8.drv22 /nix/store/m1xdmpffkflwgdin5ljvfh72wxq5lxpx-pgsodium-3.1.5.drv23 /nix/store/a9laaq557mna86dm87lq3211xy5h2zyl-pgsodium.drv24 /nix/store/i0gq8yqxp5h7l782n2ki94b1d62m6zsg-plpgsql_check-2.2.drv25 /nix/store/q117a7mx5d5bzln8xg24fh1vfzq7bsz4-plpgsql_check-2.7.drv26 /nix/store/rj6qw8pwvr91cy6qyp8xibrw4arrpj9j-plpgsql_check-2.8.drv27 /nix/store/c782i897gj20c0r8bmphf8p6r5s5wdli-plpgsql_check.drv28 /nix/store/b139hl0gpc9icb6j6q28gl1chw7i9260-rum-1.3.drv29 /nix/store/csvzp35khfq15v5g275y14094s58v10k-rum.drv30 /nix/store/c2pcswnd4yfp02pas6a7grpm0fmk70wx-supabase_vault-0.3.1.drv31 /nix/store/jb3j93i6ljmvqkv5cnv3lh3d9zn4zcjz-supabase_vault-0.2.8.drv32 /nix/store/gc3nb7r1a8rbf6f8yf4zs2nnb65awkxq-supabase_vault.drv33 /nix/store/7inhp3jz4x6l1m2i6aa1w6bbb91r1hay-pgroonga-3.2.5.drv34 /nix/store/xim497rkcncpxb5vvyli3j4jnziyybgy-pgroonga-3.0.7.drv35 /nix/store/gdd3j67qcdibplv1d440a6gsix87s5xs-pgroonga.drv36 /nix/store/ihx5q75k74a4cqq4k9bwnl5yin262kq2-pgrouting-3.4.1.drv37 /nix/store/hf9dly2ryx969lw950ld454fqfa6c41r-pgrouting.drv38 /nix/store/82vdx9lfkbv67j79qzi9yzvqrj043w52-wal2json-2.6.drv39 /nix/store/iz713zhjyn0lym6ls12i9vxca9cxf4hi-wal2json.drv40 /nix/store/7lzcc5d36122752hpjb6lij6sc2ai2a0-plv8-3.1.5.drv41 /nix/store/87brzrl1nsm8z4my02aldnxd8fb0i69x-plv8-3.1.4.drv42 /nix/store/k6nh1vivj2dgh0jk2mpsiy4p5v6sjyzk-plv8.drv43 /nix/store/lhdnha0m1rqpv0cmivzv3s7znjmgxc14-plan_filter.drv44 /nix/store/0n0iaya9csx9by2pimrx1yglzw8dp4zs-pg_net-0.13.0.drv45 /nix/store/7iq4z475k625nsn9wc9nf4vxa7x1f1qd-pg_net-0.19.5.drv46 /nix/store/cfrc2vk3cgabx1447j2n7s3zxraq6395-pg_net-0.14.0.drv47 /nix/store/iwq28h7yniccm9ra8q6dc0wma0l6hnqn-pg_net-0.6.drv48 /nix/store/nw3d144zhshkgx1z66g9g2wg5829w36n-pg_net-0.7.1.drv49 /nix/store/nwcnf7x9i2zdx48936w9ixsnxzhbab16-pg_net-0.20.0.drv50 /nix/store/rfdqkjkjdwz7ydrwlfn9cdy68zz9z6rf-pg_net-0.7.drv51 /nix/store/whvqb38akl195470ks3jads9kmq2i9gj-pg_net-0.8.0.drv52 /nix/store/zy29jzcj1bsz7760wbmlg78czaddsrni-pg_net-0.20.3.drv53 /nix/store/q7ak647qv213m4vc4fnr43i09azs1b0p-pg_net.drv54 /nix/store/sxzi0qg4ingw35zkbi2pk2vfgxbq5k2a-pgtap.drv55 /nix/store/21s45rg3i2jfhdarxmqf3dr79allgdgh-wrappers-0.4.5.drv56 /nix/store/56j6z0f3g50m72cj7ynr22p9fdml79q9-wrappers-0.5.3.drv57 /nix/store/9m4hgq2s9z1cy1508wymdcl2n1w3ky5h-wrappers-0.6.2.drv58 /nix/store/f3b53aqd65czxnbbash43yraza54ds7k-wrappers-0.4.3.drv59 /nix/store/fpcwzjw9wdhbljjpcjlbz4w6236qzl70-wrappers-0.3.0.drv60 /nix/store/iimlppn24xgvgjvnm4xp8z9bxl4p4p1d-wrappers-0.4.1.drv61 /nix/store/l3ww3jfvj5l8bp25p66wrjziy8m0vi23-wrappers-0.5.0.drv62 /nix/store/ns9rs9anq0rsl3sh1rhxmqcsll7lkjd0-wrappers-0.5.6.drv63 /nix/store/nvjw377g2m07i1z93mngr72qhpjmafvy-wrappers-0.4.6.drv64 /nix/store/qzn17ml7z84zcmcw96j0z0f6m9j6y7qm-wrappers-0.5.4.drv65 /nix/store/xbhixx8nl4iifcfi17lpavbs9cxcg5ka-wrappers-0.6.1.drv66 /nix/store/y06jjr5k7hk7zs8gzilg4g50b184va6a-wrappers-0.4.2.drv67 /nix/store/y1qh08g7i9w1x2s10rq7ammigljy82kw-wrappers-0.4.4.drv68 /nix/store/z1yzqa9qzq4ri1f58lngsljs0abhgjz5-wrappers-0.5.7.drv69 /nix/store/xcq8s20l2ynk52356w6nqkdw7379h4g4-wrappers.drv70 /nix/store/3m1k34jx4kw90mcghzrp83c2dfhrwab8-pg_repack-1.5.1.drv71 /nix/store/iwgg2la44vzaaa2ja2xyaydck2jab651-pg_repack-1.5.2.drv72 /nix/store/xd0qgx5kfkw00jgxs1v9rm4ksfdjky95-pg_repack.drv73 /nix/store/fakh4z5ssr1vhknp3xv3ch232i3ph2ax-postgresql-and-plugins-15.19.drv74 /nix/store/4z7sbcap8vdzfs1smz81k2crr4sgm640-postgresql-and-plugins-15.19.drv75 /nix/store/q4qvxkwv7rl1jac9sf5aap56gjx0n5mb-system-path.drv76 /nix/store/9in45xg9fcahx70h7alf6jg08sin568q-dbus-1.drv77 /nix/store/jffmpfrihfl3k6lfgdc4ii4a62343h7x-X-Restart-Triggers-dbus.drv78 /nix/store/0jyfsa7sd5nhfiwbk0i0i0k7bbgigy6z-unit-dbus.service.drv79 /nix/store/70bg25srcrfnwivfph4bhslzhigdgpxw-unit-dbus.service.drv80 /nix/store/cpy2j0c5ribiykpjaig0axzryxzh1g69-user-units.drv81 /nix/store/qbfmigmm8fk4v5nhvb8h71hmhmdaky0g-supabase-db-init.drv82 /nix/store/ggfylf6a7iwk3pn3r08m30684z8rrq5l-unit-supabase-db-init.service.drv83 /nix/store/rjsqz027b1xj9q5dymzvs3wbqn2dv53m-postgresql-init.drv84 /nix/store/qsr1582sizlpmavcla4x0gbp3q52g4pd-unit-postgresql.service.drv85 /nix/store/ydkqsx664pp5ndcfl70c84mvxgixix01-system-units.drv86 /nix/store/y3dck3diii9z9x0w771pz541gjd0zwh3-etc.drv87 /nix/store/srl146pjpar66ijj6l2zw99pmy6wpkl9-activate.drv88 /nix/store/9wc69nxjgbhixmblkw2jjk9m2s6017bl-nixos-system-server-test.drv89 /nix/store/q2g2vsq78xk83ml7d6cbgb611scjh0d3-closure-info.drv90 /nix/store/wr7fgqns5k3zaglqbpqhdgai9pvl3z5n-run-nixos-vm.drv91 /nix/store/cnlwlmv2n0wkkx4a1ys07p1m8dvh8a9w-nixos-vm.drv92 /nix/store/7i9qgiv15gk1hs9rys1nk2208kq5sipv-nixos-test-driver-plv8.drv93 /nix/store/z9jvdnia2823i65mz8chs87sb0bcf02s-vm-test-run-plv8.drv94error: build of '/nix/store/0n0iaya9csx9by2pimrx1yglzw8dp4zs-pg_net-0.13.0.drv' on 'ssh-ng://nixbot-remote-build@78.232.36.247' failed: Cannot build '/nix/store/0n0iaya9csx9by2pimrx1yglzw8dp4zs-pg_net-0.13.0.drv'.95 Reason: builder failed with exit code 2.96 Output paths:97 /nix/store/14dkr1mhbrh869r2k75r03ngw6q7c4ma-pg_net-0.13.098 Last 25 log lines:99 > | ^~~~~~~~~~~~~~100 > src/util.h:6:11: warning: call to 'Wcurl_easy_setopt_err_long' declared with attribute warning: curl_easy_setopt expects a long argument [-Wattribute-warning]101 > 6 | if (curl_easy_setopt(hdl, opt, prm) != CURLE_OK) \102 > | ^~~~~~~~~~~~~~~~103 > src/core.c:108:3: note: in expansion of macro 'CURL_EZ_SETOPT'104 > 108 | CURL_EZ_SETOPT(curl_ez_handle, CURLOPT_TIMEOUT_MS, timeout_milliseconds);105 > | ^~~~~~~~~~~~~~106 > src/util.h:6:11: warning: call to 'Wcurl_easy_setopt_err_long' declared with attribute warning: curl_easy_setopt expects a long argument [-Wattribute-warning]107 > 6 | if (curl_easy_setopt(hdl, opt, prm) != CURLE_OK) \108 > | ^~~~~~~~~~~~~~~~109 > src/core.c:110:3: note: in expansion of macro 'CURL_EZ_SETOPT'110 > 110 | CURL_EZ_SETOPT(curl_ez_handle, CURLOPT_FOLLOWLOCATION, true);111 > | ^~~~~~~~~~~~~~112 > gcc -Wall -Wmissing-prototypes -Wpointer-arith -Wdeclaration-after-statement -Werror=vla -Wendif-labels -Wmissing-format-attribute -Wimplicit-fallthrough=3 -Wcast-function-type -Wformat-security -fno-strict-aliasing -fwrapv -fexcess-precision=standard -Wno-deprecated-non-prototype -Wno-format-truncation -Wno-stringop-truncation -g -O2 -std=gnu17 -std=c11 -Werror -Wno-declaration-after-statement -fPIC -DEXTVERSION=\"0.13.0\" -I. -I./ -I/nix/store/48l45fvi99n90x6p9i4cs1lmzby6cb73-postgresql-15.19/include/server -I/nix/store/48l45fvi99n90x6p9i4cs1lmzby6cb73-postgresql-15.19/include/internal -D_GNU_SOURCE -I/nix/store/p17klc3qq4nl9ihfwqfpi8cnqvcf92xz-libxml2-2.15.1-dev/include/libxml2 -I/nix/store/mglbi4dy4kpx7v1dcgf6iincp5x38hsc-lz4-1.10.0-dev/include -I/nix/store/g41q9md9rdcr3lkydi6f8zd6fza3h1q4-zstd-1.5.7-dev/include -I/nix/store/n2vnr7ycfk6midbzxcwd28qj3bgb50cz-icu4c-75.1-dev/include -c -o src/event.o src/event.c113 > In file included from /nix/store/jviasb44hibgh09829gbmbssbz2jjnhz-curl-8.17.0-dev/include/curl/curl.h:3333,114 > from /nix/store/jviasb44hibgh09829gbmbssbz2jjnhz-curl-8.17.0-dev/include/curl/multi.h:51,115 > from src/event.h:4,116 > from src/event.c:6:117 > /nix/store/jviasb44hibgh09829gbmbssbz2jjnhz-curl-8.17.0-dev/include/curl/multi.h:429:23: error: expected identifier or '(' before '__extension__'118 > 429 | CURL_EXTERN CURLMcode curl_multi_setopt(CURLM *multi_handle,119 > | ^~~~~~~~~~~~~~~~~120 > /nix/store/jviasb44hibgh09829gbmbssbz2jjnhz-curl-8.17.0-dev/include/curl/multi.h:429:23: error: expected identifier or '(' before ')' token121 > 429 | CURL_EXTERN CURLMcode curl_multi_setopt(CURLM *multi_handle,122 > | ^~~~~~~~~~~~~~~~~123 > make: *** [<builtin>: src/event.o] Error 1124 For full logs, run:125 nix log /nix/store/0n0iaya9csx9by2pimrx1yglzw8dp4zs-pg_net-0.13.0.drv126error: Cannot build '/nix/store/0n0iaya9csx9by2pimrx1yglzw8dp4zs-pg_net-0.13.0.drv'.127 Reason: builder failed with exit code 1.128 Output paths:129 /nix/store/14dkr1mhbrh869r2k75r03ngw6q7c4ma-pg_net-0.13.0130error: build of '/nix/store/cfrc2vk3cgabx1447j2n7s3zxraq6395-pg_net-0.14.0.drv' on 'ssh-ng://nixbot-remote-build@78.232.36.247' failed: Cannot build '/nix/store/cfrc2vk3cgabx1447j2n7s3zxraq6395-pg_net-0.14.0.drv'.131 Reason: builder failed with exit code 2.132 Output paths:133 /nix/store/m4c4b79prkz8x60agzy6dy9bn0cdcy0d-pg_net-0.14.0134 Last 25 log lines:135 > src/errors.h:6:11: warning: call to 'Wcurl_easy_setopt_err_long' declared with attribute warning: curl_easy_setopt expects a long argument [-Wattribute-warning]136 > 6 | if (curl_easy_setopt(hdl, opt, prm) != CURLE_OK) \137 > | ^~~~~~~~~~~~~~~~138 > src/core.c:134:3: note: in expansion of macro 'EREPORT_CURL_SETOPT'139 > 134 | EREPORT_CURL_SETOPT(curl_ez_handle, CURLOPT_TIMEOUT_MS, cdata->timeout_milliseconds);140 > | ^~~~~~~~~~~~~~~~~~~141 > src/errors.h:6:11: warning: call to 'Wcurl_easy_setopt_err_long' declared with attribute warning: curl_easy_setopt expects a long argument [-Wattribute-warning]142 > 6 | if (curl_easy_setopt(hdl, opt, prm) != CURLE_OK) \143 > | ^~~~~~~~~~~~~~~~144 > src/core.c:136:3: note: in expansion of macro 'EREPORT_CURL_SETOPT'145 > 136 | EREPORT_CURL_SETOPT(curl_ez_handle, CURLOPT_FOLLOWLOCATION, true);146 > | ^~~~~~~~~~~~~~~~~~~147 > gcc -Wall -Wmissing-prototypes -Wpointer-arith -Wdeclaration-after-statement -Werror=vla -Wendif-labels -Wmissing-format-attribute -Wimplicit-fallthrough=3 -Wcast-function-type -Wformat-security -fno-strict-aliasing -fwrapv -fexcess-precision=standard -Wno-deprecated-non-prototype -Wno-format-truncation -Wno-stringop-truncation -g -O2 -std=gnu17 -std=c11 -Werror -Wno-declaration-after-statement -fPIC -DEXTVERSION=\"0.14.0\" -I. -I./ -I/nix/store/48l45fvi99n90x6p9i4cs1lmzby6cb73-postgresql-15.19/include/server -I/nix/store/48l45fvi99n90x6p9i4cs1lmzby6cb73-postgresql-15.19/include/internal -D_GNU_SOURCE -I/nix/store/p17klc3qq4nl9ihfwqfpi8cnqvcf92xz-libxml2-2.15.1-dev/include/libxml2 -I/nix/store/mglbi4dy4kpx7v1dcgf6iincp5x38hsc-lz4-1.10.0-dev/include -I/nix/store/g41q9md9rdcr3lkydi6f8zd6fza3h1q4-zstd-1.5.7-dev/include -I/nix/store/n2vnr7ycfk6midbzxcwd28qj3bgb50cz-icu4c-75.1-dev/include -c -o src/errors.o src/errors.c148 > gcc -Wall -Wmissing-prototypes -Wpointer-arith -Wdeclaration-after-statement -Werror=vla -Wendif-labels -Wmissing-format-attribute -Wimplicit-fallthrough=3 -Wcast-function-type -Wformat-security -fno-strict-aliasing -fwrapv -fexcess-precision=standard -Wno-deprecated-non-prototype -Wno-format-truncation -Wno-stringop-truncation -g -O2 -std=gnu17 -std=c11 -Werror -Wno-declaration-after-statement -fPIC -DEXTVERSION=\"0.14.0\" -I. -I./ -I/nix/store/48l45fvi99n90x6p9i4cs1lmzby6cb73-postgresql-15.19/include/server -I/nix/store/48l45fvi99n90x6p9i4cs1lmzby6cb73-postgresql-15.19/include/internal -D_GNU_SOURCE -I/nix/store/p17klc3qq4nl9ihfwqfpi8cnqvcf92xz-libxml2-2.15.1-dev/include/libxml2 -I/nix/store/mglbi4dy4kpx7v1dcgf6iincp5x38hsc-lz4-1.10.0-dev/include -I/nix/store/g41q9md9rdcr3lkydi6f8zd6fza3h1q4-zstd-1.5.7-dev/include -I/nix/store/n2vnr7ycfk6midbzxcwd28qj3bgb50cz-icu4c-75.1-dev/include -c -o src/event.o src/event.c149 > In file included from /nix/store/jviasb44hibgh09829gbmbssbz2jjnhz-curl-8.17.0-dev/include/curl/curl.h:3333,150 > from /nix/store/jviasb44hibgh09829gbmbssbz2jjnhz-curl-8.17.0-dev/include/curl/multi.h:51,151 > from src/event.h:4,152 > from src/event.c:6:153 > /nix/store/jviasb44hibgh09829gbmbssbz2jjnhz-curl-8.17.0-dev/include/curl/multi.h:429:23: error: expected identifier or '(' before '__extension__'154 > 429 | CURL_EXTERN CURLMcode curl_multi_setopt(CURLM *multi_handle,155 > | ^~~~~~~~~~~~~~~~~156 > /nix/store/jviasb44hibgh09829gbmbssbz2jjnhz-curl-8.17.0-dev/include/curl/multi.h:429:23: error: expected identifier or '(' before ')' token157 > 429 | CURL_EXTERN CURLMcode curl_multi_setopt(CURLM *multi_handle,158 > | ^~~~~~~~~~~~~~~~~159 > make: *** [<builtin>: src/event.o] Error 1160 For full logs, run:161 nix log /nix/store/cfrc2vk3cgabx1447j2n7s3zxraq6395-pg_net-0.14.0.drv162error: Cannot build '/nix/store/cfrc2vk3cgabx1447j2n7s3zxraq6395-pg_net-0.14.0.drv'.163 Reason: builder failed with exit code 1.164 Output paths:165 /nix/store/m4c4b79prkz8x60agzy6dy9bn0cdcy0d-pg_net-0.14.0166error: build of '/nix/store/7iq4z475k625nsn9wc9nf4vxa7x1f1qd-pg_net-0.19.5.drv' on 'ssh-ng://nixbot-remote-build@78.232.36.247' failed: Cannot build '/nix/store/7iq4z475k625nsn9wc9nf4vxa7x1f1qd-pg_net-0.19.5.drv'.167 Reason: builder failed with exit code 2.168 Output paths:169 /nix/store/mx90q334pqf6iwkyb9vk1wzl5nhmqmiv-pg_net-0.19.5170 Last 22 log lines:171 > Running phase: unpackPhase172 > unpacking source archive /nix/store/5zgdqy3bz93jyn79pizxc1hks0cdcadw-source173 > source root is source174 > Running phase: patchPhase175 > Running phase: updateAutotoolsGnuConfigScriptsPhase176 > Running phase: configurePhase177 > no configure script, doing nothing178 > Running phase: buildPhase179 > gcc -Wall -Wmissing-prototypes -Wpointer-arith -Wdeclaration-after-statement -Werror=vla -Wendif-labels -Wmissing-format-attribute -Wimplicit-fallthrough=3 -Wcast-function-type -Wformat-security -fno-strict-aliasing -fwrapv -fexcess-precision=standard -Wno-deprecated-non-prototype -Wno-format-truncation -Wno-stringop-truncation -g -O2 -std=gnu17 -std=c11 -Wextra -Wall -Werror -Wno-declaration-after-statement -Wno-vla -Wno-long-long -Wmissing-variable-declarations -fPIC -DEXTVERSION=\"0.19.5\" -I. -I./ -I/nix/store/48l45fvi99n90x6p9i4cs1lmzby6cb73-postgresql-15.19/include/server -I/nix/store/48l45fvi99n90x6p9i4cs1lmzby6cb73-postgresql-15.19/include/internal -D_GNU_SOURCE -I/nix/store/p17klc3qq4nl9ihfwqfpi8cnqvcf92xz-libxml2-2.15.1-dev/include/libxml2 -I/nix/store/mglbi4dy4kpx7v1dcgf6iincp5x38hsc-lz4-1.10.0-dev/include -I/nix/store/g41q9md9rdcr3lkydi6f8zd6fza3h1q4-zstd-1.5.7-dev/include -I/nix/store/n2vnr7ycfk6midbzxcwd28qj3bgb50cz-icu4c-75.1-dev/include -c -o src/core.o src/core.c180 > gcc -Wall -Wmissing-prototypes -Wpointer-arith -Wdeclaration-after-statement -Werror=vla -Wendif-labels -Wmissing-format-attribute -Wimplicit-fallthrough=3 -Wcast-function-type -Wformat-security -fno-strict-aliasing -fwrapv -fexcess-precision=standard -Wno-deprecated-non-prototype -Wno-format-truncation -Wno-stringop-truncation -g -O2 -std=gnu17 -std=c11 -Wextra -Wall -Werror -Wno-declaration-after-statement -Wno-vla -Wno-long-long -Wmissing-variable-declarations -fPIC -DEXTVERSION=\"0.19.5\" -I. -I./ -I/nix/store/48l45fvi99n90x6p9i4cs1lmzby6cb73-postgresql-15.19/include/server -I/nix/store/48l45fvi99n90x6p9i4cs1lmzby6cb73-postgresql-15.19/include/internal -D_GNU_SOURCE -I/nix/store/p17klc3qq4nl9ihfwqfpi8cnqvcf92xz-libxml2-2.15.1-dev/include/libxml2 -I/nix/store/mglbi4dy4kpx7v1dcgf6iincp5x38hsc-lz4-1.10.0-dev/include -I/nix/store/g41q9md9rdcr3lkydi6f8zd6fza3h1q4-zstd-1.5.7-dev/include -I/nix/store/n2vnr7ycfk6midbzxcwd28qj3bgb50cz-icu4c-75.1-dev/include -c -o src/errors.o src/errors.c181 > gcc -Wall -Wmissing-prototypes -Wpointer-arith -Wdeclaration-after-statement -Werror=vla -Wendif-labels -Wmissing-format-attribute -Wimplicit-fallthrough=3 -Wcast-function-type -Wformat-security -fno-strict-aliasing -fwrapv -fexcess-precision=standard -Wno-deprecated-non-prototype -Wno-format-truncation -Wno-stringop-truncation -g -O2 -std=gnu17 -std=c11 -Wextra -Wall -Werror -Wno-declaration-after-statement -Wno-vla -Wno-long-long -Wmissing-variable-declarations -fPIC -DEXTVERSION=\"0.19.5\" -I. -I./ -I/nix/store/48l45fvi99n90x6p9i4cs1lmzby6cb73-postgresql-15.19/include/server -I/nix/store/48l45fvi99n90x6p9i4cs1lmzby6cb73-postgresql-15.19/include/internal -D_GNU_SOURCE -I/nix/store/p17klc3qq4nl9ihfwqfpi8cnqvcf92xz-libxml2-2.15.1-dev/include/libxml2 -I/nix/store/mglbi4dy4kpx7v1dcgf6iincp5x38hsc-lz4-1.10.0-dev/include -I/nix/store/g41q9md9rdcr3lkydi6f8zd6fza3h1q4-zstd-1.5.7-dev/include -I/nix/store/n2vnr7ycfk6midbzxcwd28qj3bgb50cz-icu4c-75.1-dev/include -c -o src/event.o src/event.c182 > In file included from /nix/store/jviasb44hibgh09829gbmbssbz2jjnhz-curl-8.17.0-dev/include/curl/curl.h:3333,183 > from /nix/store/jviasb44hibgh09829gbmbssbz2jjnhz-curl-8.17.0-dev/include/curl/multi.h:51,184 > from src/event.h:4,185 > from src/event.c:6:186 > /nix/store/jviasb44hibgh09829gbmbssbz2jjnhz-curl-8.17.0-dev/include/curl/multi.h:429:23: error: expected identifier or '(' before '__extension__'187 > 429 | CURL_EXTERN CURLMcode curl_multi_setopt(CURLM *multi_handle,188 > | ^~~~~~~~~~~~~~~~~189 > /nix/store/jviasb44hibgh09829gbmbssbz2jjnhz-curl-8.17.0-dev/include/curl/multi.h:429:23: error: expected identifier or '(' before ')' token190 > 429 | CURL_EXTERN CURLMcode curl_multi_setopt(CURLM *multi_handle,191 > | ^~~~~~~~~~~~~~~~~192 > make: *** [<builtin>: src/event.o] Error 1193 For full logs, run:194 nix log /nix/store/7iq4z475k625nsn9wc9nf4vxa7x1f1qd-pg_net-0.19.5.drv195error: Cannot build '/nix/store/7iq4z475k625nsn9wc9nf4vxa7x1f1qd-pg_net-0.19.5.drv'.196 Reason: builder failed with exit code 1.197 Output paths:198 /nix/store/mx90q334pqf6iwkyb9vk1wzl5nhmqmiv-pg_net-0.19.5199error: build of '/nix/store/nwcnf7x9i2zdx48936w9ixsnxzhbab16-pg_net-0.20.0.drv' on 'ssh-ng://nixbot-remote-build@78.232.36.247' failed: Cannot build '/nix/store/nwcnf7x9i2zdx48936w9ixsnxzhbab16-pg_net-0.20.0.drv'.200 Reason: builder failed with exit code 2.201 Output paths:202 /nix/store/5abg792kgyfqqg3w6nh6wfm1jallf5hq-pg_net-0.20.0203 Last 22 log lines:204 > Running phase: unpackPhase205 > unpacking source archive /nix/store/3783i7yhcfqnyv5ndli22gcr11ap151m-source206 > source root is source207 > Running phase: patchPhase208 > Running phase: updateAutotoolsGnuConfigScriptsPhase209 > Running phase: configurePhase210 > no configure script, doing nothing211 > Running phase: buildPhase212 > gcc -Wall -Wmissing-prototypes -Wpointer-arith -Wdeclaration-after-statement -Werror=vla -Wendif-labels -Wmissing-format-attribute -Wimplicit-fallthrough=3 -Wcast-function-type -Wformat-security -fno-strict-aliasing -fwrapv -fexcess-precision=standard -Wno-deprecated-non-prototype -Wno-format-truncation -Wno-stringop-truncation -g -O2 -std=gnu17 -std=c11 -Wextra -Wall -Werror -Wno-declaration-after-statement -Wno-vla -Wno-long-long -Wmissing-variable-declarations -fPIC -DEXTVERSION=\"0.20.0\" -I. -I./ -I/nix/store/48l45fvi99n90x6p9i4cs1lmzby6cb73-postgresql-15.19/include/server -I/nix/store/48l45fvi99n90x6p9i4cs1lmzby6cb73-postgresql-15.19/include/internal -D_GNU_SOURCE -I/nix/store/p17klc3qq4nl9ihfwqfpi8cnqvcf92xz-libxml2-2.15.1-dev/include/libxml2 -I/nix/store/mglbi4dy4kpx7v1dcgf6iincp5x38hsc-lz4-1.10.0-dev/include -I/nix/store/g41q9md9rdcr3lkydi6f8zd6fza3h1q4-zstd-1.5.7-dev/include -I/nix/store/n2vnr7ycfk6midbzxcwd28qj3bgb50cz-icu4c-75.1-dev/include -c -o src/core.o src/core.c213 > gcc -Wall -Wmissing-prototypes -Wpointer-arith -Wdeclaration-after-statement -Werror=vla -Wendif-labels -Wmissing-format-attribute -Wimplicit-fallthrough=3 -Wcast-function-type -Wformat-security -fno-strict-aliasing -fwrapv -fexcess-precision=standard -Wno-deprecated-non-prototype -Wno-format-truncation -Wno-stringop-truncation -g -O2 -std=gnu17 -std=c11 -Wextra -Wall -Werror -Wno-declaration-after-statement -Wno-vla -Wno-long-long -Wmissing-variable-declarations -fPIC -DEXTVERSION=\"0.20.0\" -I. -I./ -I/nix/store/48l45fvi99n90x6p9i4cs1lmzby6cb73-postgresql-15.19/include/server -I/nix/store/48l45fvi99n90x6p9i4cs1lmzby6cb73-postgresql-15.19/include/internal -D_GNU_SOURCE -I/nix/store/p17klc3qq4nl9ihfwqfpi8cnqvcf92xz-libxml2-2.15.1-dev/include/libxml2 -I/nix/store/mglbi4dy4kpx7v1dcgf6iincp5x38hsc-lz4-1.10.0-dev/include -I/nix/store/g41q9md9rdcr3lkydi6f8zd6fza3h1q4-zstd-1.5.7-dev/include -I/nix/store/n2vnr7ycfk6midbzxcwd28qj3bgb50cz-icu4c-75.1-dev/include -c -o src/errors.o src/errors.c214 > gcc -Wall -Wmissing-prototypes -Wpointer-arith -Wdeclaration-after-statement -Werror=vla -Wendif-labels -Wmissing-format-attribute -Wimplicit-fallthrough=3 -Wcast-function-type -Wformat-security -fno-strict-aliasing -fwrapv -fexcess-precision=standard -Wno-deprecated-non-prototype -Wno-format-truncation -Wno-stringop-truncation -g -O2 -std=gnu17 -std=c11 -Wextra -Wall -Werror -Wno-declaration-after-statement -Wno-vla -Wno-long-long -Wmissing-variable-declarations -fPIC -DEXTVERSION=\"0.20.0\" -I. -I./ -I/nix/store/48l45fvi99n90x6p9i4cs1lmzby6cb73-postgresql-15.19/include/server -I/nix/store/48l45fvi99n90x6p9i4cs1lmzby6cb73-postgresql-15.19/include/internal -D_GNU_SOURCE -I/nix/store/p17klc3qq4nl9ihfwqfpi8cnqvcf92xz-libxml2-2.15.1-dev/include/libxml2 -I/nix/store/mglbi4dy4kpx7v1dcgf6iincp5x38hsc-lz4-1.10.0-dev/include -I/nix/store/g41q9md9rdcr3lkydi6f8zd6fza3h1q4-zstd-1.5.7-dev/include -I/nix/store/n2vnr7ycfk6midbzxcwd28qj3bgb50cz-icu4c-75.1-dev/include -c -o src/event.o src/event.c215 > In file included from /nix/store/jviasb44hibgh09829gbmbssbz2jjnhz-curl-8.17.0-dev/include/curl/curl.h:3333,216 > from /nix/store/jviasb44hibgh09829gbmbssbz2jjnhz-curl-8.17.0-dev/include/curl/multi.h:51,217 > from src/event.h:4,218 > from src/event.c:6:219 > /nix/store/jviasb44hibgh09829gbmbssbz2jjnhz-curl-8.17.0-dev/include/curl/multi.h:429:23: error: expected identifier or '(' before '__extension__'220 > 429 | CURL_EXTERN CURLMcode curl_multi_setopt(CURLM *multi_handle,221 > | ^~~~~~~~~~~~~~~~~222 > /nix/store/jviasb44hibgh09829gbmbssbz2jjnhz-curl-8.17.0-dev/include/curl/multi.h:429:23: error: expected identifier or '(' before ')' token223 > 429 | CURL_EXTERN CURLMcode curl_multi_setopt(CURLM *multi_handle,224 > | ^~~~~~~~~~~~~~~~~225 > make: *** [<builtin>: src/event.o] Error 1226 For full logs, run:227 nix log /nix/store/nwcnf7x9i2zdx48936w9ixsnxzhbab16-pg_net-0.20.0.drv228error: Cannot build '/nix/store/nwcnf7x9i2zdx48936w9ixsnxzhbab16-pg_net-0.20.0.drv'.229 Reason: builder failed with exit code 1.230 Output paths:231 /nix/store/5abg792kgyfqqg3w6nh6wfm1jallf5hq-pg_net-0.20.0232error: build of '/nix/store/rfdqkjkjdwz7ydrwlfn9cdy68zz9z6rf-pg_net-0.7.drv' on 'ssh-ng://nixbot-remote-build@78.232.36.247' failed: Cannot build '/nix/store/rfdqkjkjdwz7ydrwlfn9cdy68zz9z6rf-pg_net-0.7.drv'.233 Reason: builder failed with exit code 2.234 Output paths:235 /nix/store/yxd26zp7dvdq20sqsk13x0lk0bqd7j9i-pg_net-0.7236 Last 25 log lines:237 > | ^~~~~~~~~~~~~~238 > src/util.h:6:11: warning: call to 'Wcurl_easy_setopt_err_long' declared with attribute warning: curl_easy_setopt expects a long argument [-Wattribute-warning]239 > 6 | if (curl_easy_setopt(hdl, opt, prm) != CURLE_OK) \240 > | ^~~~~~~~~~~~~~~~241 > src/core.c:108:3: note: in expansion of macro 'CURL_EZ_SETOPT'242 > 108 | CURL_EZ_SETOPT(curl_ez_handle, CURLOPT_TIMEOUT_MS, timeout_milliseconds);243 > | ^~~~~~~~~~~~~~244 > src/util.h:6:11: warning: call to 'Wcurl_easy_setopt_err_long' declared with attribute warning: curl_easy_setopt expects a long argument [-Wattribute-warning]245 > 6 | if (curl_easy_setopt(hdl, opt, prm) != CURLE_OK) \246 > | ^~~~~~~~~~~~~~~~247 > src/core.c:110:3: note: in expansion of macro 'CURL_EZ_SETOPT'248 > 110 | CURL_EZ_SETOPT(curl_ez_handle, CURLOPT_FOLLOWLOCATION, true);249 > | ^~~~~~~~~~~~~~250 > gcc -Wall -Wmissing-prototypes -Wpointer-arith -Wdeclaration-after-statement -Werror=vla -Wendif-labels -Wmissing-format-attribute -Wimplicit-fallthrough=3 -Wcast-function-type -Wformat-security -fno-strict-aliasing -fwrapv -fexcess-precision=standard -Wno-deprecated-non-prototype -Wno-format-truncation -Wno-stringop-truncation -g -O2 -std=gnu17 -std=c11 -Werror -Wno-declaration-after-statement -fPIC -DEXTVERSION=\"0.13.0\" -I. -I./ -I/nix/store/48l45fvi99n90x6p9i4cs1lmzby6cb73-postgresql-15.19/include/server -I/nix/store/48l45fvi99n90x6p9i4cs1lmzby6cb73-postgresql-15.19/include/internal -D_GNU_SOURCE -I/nix/store/p17klc3qq4nl9ihfwqfpi8cnqvcf92xz-libxml2-2.15.1-dev/include/libxml2 -I/nix/store/mglbi4dy4kpx7v1dcgf6iincp5x38hsc-lz4-1.10.0-dev/include -I/nix/store/g41q9md9rdcr3lkydi6f8zd6fza3h1q4-zstd-1.5.7-dev/include -I/nix/store/n2vnr7ycfk6midbzxcwd28qj3bgb50cz-icu4c-75.1-dev/include -c -o src/event.o src/event.c251 > In file included from /nix/store/jviasb44hibgh09829gbmbssbz2jjnhz-curl-8.17.0-dev/include/curl/curl.h:3333,252 > from /nix/store/jviasb44hibgh09829gbmbssbz2jjnhz-curl-8.17.0-dev/include/curl/multi.h:51,253 > from src/event.h:4,254 > from src/event.c:6:255 > /nix/store/jviasb44hibgh09829gbmbssbz2jjnhz-curl-8.17.0-dev/include/curl/multi.h:429:23: error: expected identifier or '(' before '__extension__'256 > 429 | CURL_EXTERN CURLMcode curl_multi_setopt(CURLM *multi_handle,257 > | ^~~~~~~~~~~~~~~~~258 > /nix/store/jviasb44hibgh09829gbmbssbz2jjnhz-curl-8.17.0-dev/include/curl/multi.h:429:23: error: expected identifier or '(' before ')' token259 > 429 | CURL_EXTERN CURLMcode curl_multi_setopt(CURLM *multi_handle,260 > | ^~~~~~~~~~~~~~~~~261 > make: *** [<builtin>: src/event.o] Error 1262 For full logs, run:263 nix log /nix/store/rfdqkjkjdwz7ydrwlfn9cdy68zz9z6rf-pg_net-0.7.drv264error: Cannot build '/nix/store/rfdqkjkjdwz7ydrwlfn9cdy68zz9z6rf-pg_net-0.7.drv'.265 Reason: builder failed with exit code 1.266 Output paths:267 /nix/store/yxd26zp7dvdq20sqsk13x0lk0bqd7j9i-pg_net-0.7268error: Cannot build '/nix/store/q7ak647qv213m4vc4fnr43i09azs1b0p-pg_net.drv'.269 Reason: 5 dependencies failed.270 Output paths:271 /nix/store/9p2ykggx0qabaqhlslb35di6b0ypkcqn-pg_net272error: Cannot build '/nix/store/fakh4z5ssr1vhknp3xv3ch232i3ph2ax-postgresql-and-plugins-15.19.drv'.273 Reason: 1 dependency failed.274 Output paths:275 /nix/store/k465i8vjw8xzi46ymkk5mhqydlcg32bd-postgresql-and-plugins-15.19276error: Cannot build '/nix/store/4z7sbcap8vdzfs1smz81k2crr4sgm640-postgresql-and-plugins-15.19.drv'.277 Reason: 1 dependency failed.278 Output paths:279 /nix/store/41g9k8wa6wm6jr22hn1xa6xzvg03fmbq-postgresql-and-plugins-15.19280error: Cannot build '/nix/store/rjsqz027b1xj9q5dymzvs3wbqn2dv53m-postgresql-init.drv'.281 Reason: 1 dependency failed.282 Output paths:283 /nix/store/mjfcivwp18j0qcajcv5y1w4rgqa438bi-postgresql-init284error: Cannot build '/nix/store/qbfmigmm8fk4v5nhvb8h71hmhmdaky0g-supabase-db-init.drv'.285 Reason: 1 dependency failed.286 Output paths:287 /nix/store/qfjqsqsw03kfjf61y4cq3ffffpd1pywz-supabase-db-init288error: Cannot build '/nix/store/q4qvxkwv7rl1jac9sf5aap56gjx0n5mb-system-path.drv'.289 Reason: 1 dependency failed.290 Output paths:291 /nix/store/ai2r0wvs9817lqvy62k93driv4x5j5bq-system-path292error: Cannot build '/nix/store/9in45xg9fcahx70h7alf6jg08sin568q-dbus-1.drv'.293 Reason: 1 dependency failed.294 Output paths:295 /nix/store/cnqrgpjkq8n49z3q3niffxj2sq8cdkb8-dbus-1296error: Cannot build '/nix/store/qsr1582sizlpmavcla4x0gbp3q52g4pd-unit-postgresql.service.drv'.297 Reason: 2 dependencies failed.298 Output paths:299 /nix/store/jdpq4p0ii46fdbn6lk9pvjhr4fn9hlk3-unit-postgresql.service300error: Cannot build '/nix/store/ggfylf6a7iwk3pn3r08m30684z8rrq5l-unit-supabase-db-init.service.drv'.301 Reason: 1 dependency failed.302 Output paths:303 /nix/store/yj5im5r7lvm21a97a04zkn267czbrw3l-unit-supabase-db-init.service304error: Cannot build '/nix/store/jffmpfrihfl3k6lfgdc4ii4a62343h7x-X-Restart-Triggers-dbus.drv'.305 Reason: 1 dependency failed.306 Output paths:307 /nix/store/m1k5hvywmxrzrl65zdy4icssmqjwk1ac-X-Restart-Triggers-dbus308error: Cannot build '/nix/store/0jyfsa7sd5nhfiwbk0i0i0k7bbgigy6z-unit-dbus.service.drv'.309 Reason: 1 dependency failed.310 Output paths:311 /nix/store/m1y0mf2s98whn8ssf75ghzldgsm2i6j9-unit-dbus.service312error: Cannot build '/nix/store/70bg25srcrfnwivfph4bhslzhigdgpxw-unit-dbus.service.drv'.313 Reason: 1 dependency failed.314 Output paths:315 /nix/store/zsgh1qgm3jy8asyqvg4qj0wb78dcrmbr-unit-dbus.service316error: Cannot build '/nix/store/ydkqsx664pp5ndcfl70c84mvxgixix01-system-units.drv'.317 Reason: 3 dependencies failed.318 Output paths:319 /nix/store/jzv8qrmiimbc1ndwa0a2rv9vrnkyngs2-system-units320error: Cannot build '/nix/store/cpy2j0c5ribiykpjaig0axzryxzh1g69-user-units.drv'.321 Reason: 1 dependency failed.322 Output paths:323 /nix/store/k4q74vb1knwhdc9f757lwy0j04ivgldp-user-units324error: Cannot build '/nix/store/y3dck3diii9z9x0w771pz541gjd0zwh3-etc.drv'.325 Reason: 4 dependencies failed.326 Output paths:327 /nix/store/0gg4z38348708b6snq8hbw2p0f6212am-etc328error: Cannot build '/nix/store/srl146pjpar66ijj6l2zw99pmy6wpkl9-activate.drv'.329 Reason: 1 dependency failed.330 Output paths:331 /nix/store/fl857c057c4yxg6bzz5fxi20v1j54dm8-activate332error: Cannot build '/nix/store/9wc69nxjgbhixmblkw2jjk9m2s6017bl-nixos-system-server-test.drv'.333 Reason: 3 dependencies failed.334 Output paths:335 /nix/store/mkgavgzjx3rvxh0l4hhw504lw8v8i3z9-nixos-system-server-test336error: Cannot build '/nix/store/q2g2vsq78xk83ml7d6cbgb611scjh0d3-closure-info.drv'.337 Reason: 1 dependency failed.338 Output paths:339 /nix/store/4xhd11lhmmyn2r9p77c4xa4lhrzkflks-closure-info340error: Cannot build '/nix/store/wr7fgqns5k3zaglqbpqhdgai9pvl3z5n-run-nixos-vm.drv'.341 Reason: 2 dependencies failed.342 Output paths:343 /nix/store/chd9fxl5xfnmdcwm3dki9r85x3rb36fz-run-nixos-vm344error: Cannot build '/nix/store/cnlwlmv2n0wkkx4a1ys07p1m8dvh8a9w-nixos-vm.drv'.345 Reason: 2 dependencies failed.346 Output paths:347 /nix/store/m21rwlsk4m4d5vi2dajb3rfzxi1lrbfn-nixos-vm348error: Cannot build '/nix/store/7i9qgiv15gk1hs9rys1nk2208kq5sipv-nixos-test-driver-plv8.drv'.349 Reason: 1 dependency failed.350 Output paths:351 /nix/store/xfs645rn96bmvk5i6lpk4s65xhzppilg-nixos-test-driver-plv8352error: Cannot build '/nix/store/z9jvdnia2823i65mz8chs87sb0bcf02s-vm-test-run-plv8.drv'.353 Reason: 1 dependency failed.354 Output paths:355 /nix/store/gkjs5pq6qm6r34xw774b23973vck4dj0-vm-test-run-plv8