setup
checks.aarch64-linux.ext-pgrouting
· build #133
· raw
1these 237 derivations will be built:2 /nix/store/0cmixqwsz3vb82j49j1mhvyk8crg4dcw-wrappers-0.6.0.drv3 /nix/store/f4fxzxll7q3m5cy6rib758j63zcky8dk-supabase_vault-0.2.8.drv4 /nix/store/0dxji73cc07dbqk8nny6y5mkf5qr6kl8-supabase_vault.drv5 /nix/store/fl27cr5qdrq44nk61x5yjlqxsrc8mg3n-pgsodium-3.0.4.drv6 /nix/store/jl20dg8fxlmlv84f7cda9xa6mq8y46sr-pgsodium-3.1.7.drv7 /nix/store/pvz0jf5drhdz4jj5k592kxbdgk4lm52r-pgsodium-3.1.6.drv8 /nix/store/zdz6b4s43i332x3xlvjivc7p4csihzba-pgsodium-3.1.5.drv9 /nix/store/0h7mnh8was4m19z53z0dmakrp0c9271q-pgsodium.drv10 /nix/store/0i6b8yy32fc4mgfm75w94gw9ja033kw5-wrappers-0.5.5.drv11 /nix/store/h1vl8vpk154yppn5lcqms2680igi0mmj-postgis-3.3.2.drv12 /nix/store/2ylkw9crapb58vd5g0vj602jfyb1p3r6-postgis.drv13 /nix/store/58cinn47vbvwr1wxdkspmvi9cj27b07h-safeupdate-1.4.drv14 /nix/store/6c0mnd757hvxppfyrsf4cb1wgnbd4111-safeupdate.drv15 /nix/store/k4swwy7459wf558rbrraclsr4sjccz0h-pgmq-1.4.4.drv16 /nix/store/8zsadvm8mv18kpy4qy724ps2jlbsik0w-pgmq.drv17 /nix/store/4wk9vb1q3kdnhj8hsq8pwgbp82glwg9w-timescaledb-2.9.1.drv18 /nix/store/9wzj3wh6sczzk849dmjwvmnkshggakxp-timescaledb.drv19 /nix/store/2nmg9sxx50xmndps3714hbvwjyd5rqv0-vector-0.8.2.drv20 /nix/store/alajylsl9b90m65n0ps0mkbkw679x4sn-vector-0.6.2.drv21 /nix/store/jmilv9h5p0v4grgqnhfn22i7zl352ybh-vector-0.7.4.drv22 /nix/store/q3mdjvqpw4xbwcjy5y1ps1igxsjvx133-vector-0.7.0.drv23 /nix/store/v5dnr617av2jgk6kpddxbxxqjqgl5kzg-vector-0.8.0.drv24 /nix/store/z40s48rz55qgpw6g6wiqi68hkfas4h1l-vector-0.6.0.drv25 /nix/store/9zndhfzc45vrfn297g1hav7m6ba3rlzk-vector.drv26 /nix/store/c08rdgxba5n6zhyp78l8sd6fhnbc4a4c-pgsodium-3.1.7.drv27 /nix/store/hh2jpg5qdwgdwzi96qcay1a5ffhi0f4i-pgsodium-3.1.6.drv28 /nix/store/jwrjvb9m50v44sla4jpig83jab7zn17x-pgsodium-3.1.8.drv29 /nix/store/m1xdmpffkflwgdin5ljvfh72wxq5lxpx-pgsodium-3.1.5.drv30 /nix/store/a9laaq557mna86dm87lq3211xy5h2zyl-pgsodium.drv31 /nix/store/i0gq8yqxp5h7l782n2ki94b1d62m6zsg-plpgsql_check-2.2.drv32 /nix/store/q117a7mx5d5bzln8xg24fh1vfzq7bsz4-plpgsql_check-2.7.drv33 /nix/store/rj6qw8pwvr91cy6qyp8xibrw4arrpj9j-plpgsql_check-2.8.drv34 /nix/store/c782i897gj20c0r8bmphf8p6r5s5wdli-plpgsql_check.drv35 /nix/store/b139hl0gpc9icb6j6q28gl1chw7i9260-rum-1.3.drv36 /nix/store/csvzp35khfq15v5g275y14094s58v10k-rum.drv37 /nix/store/c2pcswnd4yfp02pas6a7grpm0fmk70wx-supabase_vault-0.3.1.drv38 /nix/store/jb3j93i6ljmvqkv5cnv3lh3d9zn4zcjz-supabase_vault-0.2.8.drv39 /nix/store/gc3nb7r1a8rbf6f8yf4zs2nnb65awkxq-supabase_vault.drv40 /nix/store/7inhp3jz4x6l1m2i6aa1w6bbb91r1hay-pgroonga-3.2.5.drv41 /nix/store/xim497rkcncpxb5vvyli3j4jnziyybgy-pgroonga-3.0.7.drv42 /nix/store/gdd3j67qcdibplv1d440a6gsix87s5xs-pgroonga.drv43 /nix/store/ihx5q75k74a4cqq4k9bwnl5yin262kq2-pgrouting-3.4.1.drv44 /nix/store/hf9dly2ryx969lw950ld454fqfa6c41r-pgrouting.drv45 /nix/store/82vdx9lfkbv67j79qzi9yzvqrj043w52-wal2json-2.6.drv46 /nix/store/iz713zhjyn0lym6ls12i9vxca9cxf4hi-wal2json.drv47 /nix/store/7lzcc5d36122752hpjb6lij6sc2ai2a0-plv8-3.1.5.drv48 /nix/store/87brzrl1nsm8z4my02aldnxd8fb0i69x-plv8-3.1.4.drv49 /nix/store/k6nh1vivj2dgh0jk2mpsiy4p5v6sjyzk-plv8.drv50 /nix/store/0n0iaya9csx9by2pimrx1yglzw8dp4zs-pg_net-0.13.0.drv51 /nix/store/7iq4z475k625nsn9wc9nf4vxa7x1f1qd-pg_net-0.19.5.drv52 /nix/store/cfrc2vk3cgabx1447j2n7s3zxraq6395-pg_net-0.14.0.drv53 /nix/store/iwq28h7yniccm9ra8q6dc0wma0l6hnqn-pg_net-0.6.drv54 /nix/store/nw3d144zhshkgx1z66g9g2wg5829w36n-pg_net-0.7.1.drv55 /nix/store/nwcnf7x9i2zdx48936w9ixsnxzhbab16-pg_net-0.20.0.drv56 /nix/store/rfdqkjkjdwz7ydrwlfn9cdy68zz9z6rf-pg_net-0.7.drv57 /nix/store/whvqb38akl195470ks3jads9kmq2i9gj-pg_net-0.8.0.drv58 /nix/store/zy29jzcj1bsz7760wbmlg78czaddsrni-pg_net-0.20.3.drv59 /nix/store/q7ak647qv213m4vc4fnr43i09azs1b0p-pg_net.drv60 /nix/store/21s45rg3i2jfhdarxmqf3dr79allgdgh-wrappers-0.4.5.drv61 /nix/store/56j6z0f3g50m72cj7ynr22p9fdml79q9-wrappers-0.5.3.drv62 /nix/store/9m4hgq2s9z1cy1508wymdcl2n1w3ky5h-wrappers-0.6.2.drv63 /nix/store/f3b53aqd65czxnbbash43yraza54ds7k-wrappers-0.4.3.drv64 /nix/store/fpcwzjw9wdhbljjpcjlbz4w6236qzl70-wrappers-0.3.0.drv65 /nix/store/iimlppn24xgvgjvnm4xp8z9bxl4p4p1d-wrappers-0.4.1.drv66 /nix/store/l3ww3jfvj5l8bp25p66wrjziy8m0vi23-wrappers-0.5.0.drv67 /nix/store/ns9rs9anq0rsl3sh1rhxmqcsll7lkjd0-wrappers-0.5.6.drv68 /nix/store/nvjw377g2m07i1z93mngr72qhpjmafvy-wrappers-0.4.6.drv69 /nix/store/qzn17ml7z84zcmcw96j0z0f6m9j6y7qm-wrappers-0.5.4.drv70 /nix/store/xbhixx8nl4iifcfi17lpavbs9cxcg5ka-wrappers-0.6.1.drv71 /nix/store/y06jjr5k7hk7zs8gzilg4g50b184va6a-wrappers-0.4.2.drv72 /nix/store/y1qh08g7i9w1x2s10rq7ammigljy82kw-wrappers-0.4.4.drv73 /nix/store/z1yzqa9qzq4ri1f58lngsljs0abhgjz5-wrappers-0.5.7.drv74 /nix/store/xcq8s20l2ynk52356w6nqkdw7379h4g4-wrappers.drv75 /nix/store/3m1k34jx4kw90mcghzrp83c2dfhrwab8-pg_repack-1.5.1.drv76 /nix/store/iwgg2la44vzaaa2ja2xyaydck2jab651-pg_repack-1.5.2.drv77 /nix/store/xd0qgx5kfkw00jgxs1v9rm4ksfdjky95-pg_repack.drv78 /nix/store/fakh4z5ssr1vhknp3xv3ch232i3ph2ax-postgresql-and-plugins-15.19.drv79 /nix/store/4z7sbcap8vdzfs1smz81k2crr4sgm640-postgresql-and-plugins-15.19.drv80 /nix/store/q4qvxkwv7rl1jac9sf5aap56gjx0n5mb-system-path.drv81 /nix/store/9in45xg9fcahx70h7alf6jg08sin568q-dbus-1.drv82 /nix/store/jffmpfrihfl3k6lfgdc4ii4a62343h7x-X-Restart-Triggers-dbus.drv83 /nix/store/0jyfsa7sd5nhfiwbk0i0i0k7bbgigy6z-unit-dbus.service.drv84 /nix/store/0nn0jglvy3w5hd868rilks6acxx242hj-pg_net-0.19.5.drv85 /nix/store/0q3jswlrym436vq3yzd7nmxpfpc7zbw7-wrappers-0.5.6.drv86 /nix/store/1k3nzf8206jy6jjwdb50jn8rij79dvvj-plan_filter-0.1.drv87 /nix/store/17zhj6r14i4xx0fmzclykpcnyicwhbga-plan_filter.drv88 /nix/store/18746y4c8pvpm3al2bydwcn29pgwkjij-pg_repack-1.4.8.drv89 /nix/store/1hza0wxglhyl1641a3yki78kp045s8x2-wrappers-0.5.7.drv90 /nix/store/1mkhz1wanb7sx61imr6wqda0cqnvnj8q-wal2json-2.6.drv91 /nix/store/1r4ihdrrxnxp1kc97akzkb6yf0rhj5fy-wal2json-2.6.drv92 /nix/store/2wp2aqp71l4218m1z0aas6789yx18sv3-pgrouting-3.4.1.drv93 /nix/store/564f4p7z536irjy1x7a6i39nk3n3g2r2-pgrouting.drv94 /nix/store/k4qjk97aggz30jlgv2hdqka8fy8z07pg-supabase_vault-0.3.1.drv95 /nix/store/z8jynkjsnrfphim33c02aci4n6i2s9la-supabase_vault-0.2.8.drv96 /nix/store/8ir53vjiqz9rhip8arbxd2b58d0j67w0-supabase_vault.drv97 /nix/store/9sv9z7i53r40xnrigr8aywi98izk30rb-wal2json.drv98 /nix/store/g3yy08xhp6kakigznjmymrvasv6xhzz4-rum-1.3.drv99 /nix/store/apcx516gwjdivwb00nzvgwwq26mp6kbp-rum.drv100 /nix/store/ynjdlqr0w8h7ici1xdnsr79mwnzmyyri-pgroonga-3.2.5.drv101 /nix/store/c7b5vgzvlwgra3bhwq5fjzl0cg8lxq53-pgroonga.drv102 /nix/store/axpz1dvivwnmwkkcs392nj9cp1zs4x4h-pg_repack-1.4.8.drv103 /nix/store/gpxphj5cc5qbfjvp1kckicqwibgb6870-pg_repack-1.5.0.drv104 /nix/store/nynlpdydjmjk2fk2fsjz9bws5n6pjjyv-pg_repack-1.5.1.drv105 /nix/store/sa036niivyjgc2rqi9xh890msxh349l9-pg_repack-1.5.2.drv106 /nix/store/f4jr9drjzv7wfj2rxqg6fxg4ki5xv8aq-pg_repack.drv107 /nix/store/3cgs2dl0nwcsnwa5j7vkkp9vnqrax686-wrappers-0.6.0.drv108 /nix/store/74dcpcc376carhrdcf8ka4zmkawz1yv6-wrappers-0.5.4.drv109 /nix/store/92vrj7bj8hswwppxa34pv4a5mcishcns-wrappers-0.4.4.drv110 /nix/store/96l1zwmvz2ffcdfraaalfc6lvhah4kbz-wrappers-0.5.5.drv111 /nix/store/adcv6z66z4kpsasjjh1mcxa915lbdppl-wrappers-0.4.5.drv112 /nix/store/b4n3d1kid5pcaqfl3fjnjmc425dgg1p1-wrappers-0.5.0.drv113 /nix/store/jcd2gw4vawwnh0pmxhl4pl3ll6adggx5-wrappers-0.6.2.drv114 /nix/store/vxwdlzq8s4jj92x0jpc4sl9drjywlalq-wrappers-0.6.3.drv115 /nix/store/xwhq66cqc0ms922bxlcgc1jwff6kqv8g-wrappers-0.5.3.drv116 /nix/store/y6kq63cxxc5v5jh87mv9wpbvk0p4ayfg-wrappers-0.6.1.drv117 /nix/store/zdyyj4cgmfdl46zb5ycwmwr6d30w6mbx-wrappers-0.4.6.drv118 /nix/store/fn58ja37h9fw7mszrd75faxdb0999f0i-wrappers.drv119 /nix/store/9yiwshvqw6zii2gdbjn3whic00kdi2kk-vector-0.7.4.drv120 /nix/store/gd4y86918lqw8gzxg8nqrz8sy2dqq9fb-vector-0.7.0.drv121 /nix/store/gdgmh15k0z47wvlyk7n79hg9mm7jzisl-vector-0.6.2.drv122 /nix/store/hs3bxh6aa4yj96k9qp50af7qy1jchwk3-vector-0.6.0.drv123 /nix/store/j5mchw8xwd04x2c28fmf7pccna5x7y95-vector-0.8.2.drv124 /nix/store/qa8qkhza8bf74v69dzxgqvy2mjf799yl-vector-0.8.0.drv125 /nix/store/g5mv4minlqr25pj8gqhzcns6w7bwzaph-vector.drv126 /nix/store/lkbp0bzzg49y6z9h7ms156q0jsiq6qh4-safeupdate-1.4.drv127 /nix/store/icwncd52zxyvvybn79pvj2s9day934p8-safeupdate.drv128 /nix/store/9kmiqqmclsl8d77yd54al2d2wlwc6dp1-pgsodium-3.0.4.drv129 /nix/store/ckl9zg69wqkncwizrd6lln7h5492wwn6-pgsodium-3.1.6.drv130 /nix/store/lhi0y1xi9i9i1c8kg95nfhdw95j3dz3r-pgsodium-3.1.5.drv131 /nix/store/msmzmvngp6cx4yl0dwgzp3iv7bv796wg-pgsodium-3.1.8.drv132 /nix/store/zwypkv0vf8m8ybs536jq5wglvhfwdx8y-pgsodium-3.1.7.drv133 /nix/store/l68xzbdq736nzdnwvr9q3x29wcngcsj1-pgsodium.drv134 /nix/store/apd0c6nk3x333r1xj0sl2m3cr96pbizv-postgis-3.3.7.drv135 /nix/store/r12320b80inhy5aq434asc4sa8w6bn0g-postgis.drv136 /nix/store/36hfvpcvdxj64718i9mhil3db8835a6q-plpgsql_check-2.7.drv137 /nix/store/9lpr8r6zwzid07ihmr89rnxqcwv0yfja-plpgsql_check-2.8.drv138 /nix/store/rly88629k74w1nj10q0l6mg2jvd3nr1g-plpgsql_check.drv139 /nix/store/83ycsfk9ivb7sah3lq89d8hy5rxj5vpp-pg_net-0.20.3.drv140 /nix/store/a0ldx82cv1chkbdks86c8mjp8ps4lfgn-pg_net-0.20.0.drv141 /nix/store/lbqp8bfrqa2xm82ma6wyq1gijyajh6kh-pg_net-0.13.0.drv142 /nix/store/rdglczxf0sk4hhwsppqw13zl43vf5wr0-pg_net-0.14.0.drv143 /nix/store/w7547z9slhcibw4s6cwkag6w1f49317s-pg_net-0.20.4.drv144 /nix/store/vvs47f973jig6lflvm7cidm6m20glpy5-pg_net.drv145 /nix/store/y1p5dlzmilwxqbf3a4c7hl6gp9p84wsl-pgmq-1.5.1.drv146 /nix/store/y5rgrfmhzrjr0j6zil7ksqdbcglh0s8i-pgmq.drv147 /nix/store/2fndab8axk4hz4s30ijaxnpa1bc9z1dc-postgresql-and-plugins-17_22.drv148 /nix/store/2h15dgac1417g71pjrb4aqcz8yabiv21-plpgsql_check-2.7.drv149 /nix/store/2i3blwmkdwv0753xgc4pb1rm16gk4jmv-wrappers-0.5.6.drv150 /nix/store/381ghgpkv0l9lnv0f1v2jxfg04cspiih-rum-1.3.drv151 /nix/store/3dxfnbp09hx3zc5q8mmvb54v0nb1lrid-plpgsql_check-2.8.drv152 /nix/store/48mqx57r48j330b49mc32k7bvy6445c2-wal2json.drv153 /nix/store/msp1w36fm572jxlq4yj3ilwksxa0qpag-safeupdate-1.4.drv154 /nix/store/fl0xvi8swv20jz0vkfsm12znd6mp9naq-safeupdate.drv155 /nix/store/k4lajdzpb6zgp35ib3yfg5hk7p7kj1z3-rum.drv156 /nix/store/8p8fsl25zwlaqwhknw8myg0lfhi6rhsg-wrappers-0.6.0.drv157 /nix/store/a9l3bgzraqwg33ax5gcmbqwrkrrxxnag-wrappers-0.4.5.drv158 /nix/store/fh5b65jxgdyzwrs2g7y12ffnk1yhxczn-wrappers-0.5.7.drv159 /nix/store/h81r7798azz2nz8s3pxp1drpa02ma2m8-wrappers-0.5.4.drv160 /nix/store/hlpygbdz705888l5vwvvnz96901jdbkn-wrappers-0.5.5.drv161 /nix/store/kcan9i952k07b3pm1fnq4s0f7pfn7yx9-wrappers-0.5.3.drv162 /nix/store/pvzl31ydc0nhwqmrw9agqqbmk4v4ycr8-wrappers-0.6.3.drv163 /nix/store/q0lgs5nhw27p302wa3gp300l19ad95f0-wrappers-0.4.4.drv164 /nix/store/rfn5rhjy53sq47kjz5qfawd9pz9a38l1-wrappers-0.5.0.drv165 /nix/store/sg3hglpfqxg0bdxvkn36jnvpd752brga-wrappers-0.4.6.drv166 /nix/store/sn2m8z01kbz72vbl839b4qdhql2lf67m-wrappers-0.6.1.drv167 /nix/store/w5gnd7pybydask3lizsy3lirm83jxx56-wrappers-0.6.2.drv168 /nix/store/kplnvybrmx8df99qr3hsafbkky7hfg3v-wrappers.drv169 /nix/store/ibl9nbmh9mbqgqqfkrq7vgqzbsxj392q-pgmq-1.5.1.drv170 /nix/store/kv8jjb4gkylvk18qlsxl5lp9k29b1d31-pgmq.drv171 /nix/store/hnhqkd9jnn7w4z0z0jacwjwg9x016gyl-pg_repack-1.5.0.drv172 /nix/store/x14ai73x9yl5ckncl830rpbqxpjvvbg5-pg_repack-1.5.2.drv173 /nix/store/m6b5d5vphi1v49cpgr7ff07zvzfri21p-pg_repack.drv174 /nix/store/q8n9c44w9m7lggw81a93q8rvr4jgmslx-plan_filter-0.1.drv175 /nix/store/n1y2c26wz7wmff6xrz6ggk6zvsgma4bk-plan_filter.drv176 /nix/store/8byjp94z4bcpvgpc2s8ga2rqg9c3xc55-pgrouting-3.4.1.drv177 /nix/store/qs7fc4p2b8g3zc4cd29vi1wck7acipz9-pgrouting.drv178 /nix/store/v635079aqf2hhpg4xnhm2226g7khvdav-plpgsql_check.drv179 /nix/store/84hgdiz6hjkzk0cm5bd3vqsbx45n9zkh-vector-0.8.0.drv180 /nix/store/92n1zijp3izg793lrskmws7kyjz1xg5h-vector-0.6.2.drv181 /nix/store/bxnxr2z670m9ri1dc66149krs7h60dnc-vector-0.7.0.drv182 /nix/store/nyx1ahbyki15bmvygqzj2s1nnbmbi8ig-vector-0.7.4.drv183 /nix/store/za0ss4y8awhkng526g581wdnh0azibcf-vector-0.8.2.drv184 /nix/store/x3iqn55b29mih079vypw11gf008gj74l-vector.drv185 /nix/store/xkmdckj5hdcfgqlyjn2qq5vdv6s09h5a-pgroonga.drv186 /nix/store/al6g5cvx86v4ljmh3sg6hmlsl3ab3bwf-pg_net-0.20.3.drv187 /nix/store/b1pyvgjyn940h95bbnsp15qmb0qli5gd-pg_net-0.20.0.drv188 /nix/store/g6nfp5n056kw2jvfzldzxrrrxfpfcka0-pg_net-0.13.0.drv189 /nix/store/xwiwd8fzjgv67zb2ji446a8vxjj3s7bs-pg_net-0.14.0.drv190 /nix/store/yf5z0qi17vprkjz68rqyp804sx929g9n-pg_net-0.19.5.drv191 /nix/store/y02vszvrhs7b6kn8llgwzdmnmhqiymzk-pg_net.drv192 /nix/store/mrfs1y0f5l367m93gpss7lp0jg6nz3bf-postgis-3.3.7.drv193 /nix/store/yskfmp4z518h4ff0mli70gsirhsli1ns-postgis.drv194 /nix/store/nj44phx30461wf1ac6n8fg8cc58agpgv-postgresql-and-plugins-17.11.drv195 /nix/store/rn61yq57k8lhdkx7al266vkbandycwv7-postgresql-and-plugins-17.11.drv196 /nix/store/czird9kid1f479i75r0fcy4ivzd3zzs8-system-path.drv197 /nix/store/i0ygxsqq6na1vsqmbklzxrj1xy5ypk6x-dbus-1.drv198 /nix/store/xnzsv2ymk0qx1fdsm8ssls8mlq8852wc-X-Restart-Triggers-dbus.drv199 /nix/store/5q0f5sx5mas5cc56azv1g9pm53yfrmgc-unit-dbus.service.drv200 /nix/store/a03cbyqm7arwjx83nc7jiwxkbbifg33w-user-units.drv201 /nix/store/acfna74pf7f063994dvxzqkrrhi623c4-unit-dbus.service.drv202 /nix/store/rjsqz027b1xj9q5dymzvs3wbqn2dv53m-postgresql-init.drv203 /nix/store/n0j0873l4a8mlkz6x1bffr3skhaarc7q-unit-postgresql.service.drv204 /nix/store/wmsihsmjyk0h8yjj86lpmijxpzqwk8gg-postgresql-migrate.drv205 /nix/store/pml1z1qw471w7nshf5dxp826pysqs3fz-unit-postgresql-migrate.service.drv206 /nix/store/vrslgxqykax3yi5mlrpiq0v1rq1ilnic-system-units.drv207 /nix/store/p6pnncmb31ibp4zxf61fbkkb0fmq4xai-etc.drv208 /nix/store/x6cijf4csfmd0dc8sqmiajj5dwi4h3dg-activate.drv209 /nix/store/cgyqy4j1g2s9zbh87ddwhr7wn9rssarl-nixos-system-server-test.drv210 /nix/store/w85w5162f9zdpi7g98sjlk186hrrm57p-postgresql-and-plugins-17_22.drv211 /nix/store/amy1ji0k53n9qihnqys9hvlc60bncr1y-system-path.drv212 /nix/store/7ynly7nv4iq2wvhmmg6p100h3wr2dpxd-dbus-1.drv213 /nix/store/v749g53p5djbqg3y7kfvdsw5g535j0js-X-Restart-Triggers-dbus.drv214 /nix/store/n7wg70ga6zm8b0prwd4np0azpi732zji-unit-dbus.service.drv215 /nix/store/bmn9rg4vrb07wyj1ls41afzdzcmhdqcm-user-units.drv216 /nix/store/jika4rfg3aj00vq2nfqx2i6nild4nvd5-unit-dbus.service.drv217 /nix/store/8r4vw45si1w8qby225b0amhay9ybj6c5-postgresql-orioledb-init.drv218 /nix/store/pgysndf7sfj9ifxk4sy1w8qfx2ln1ws6-unit-postgresql.service.drv219 /nix/store/9i9flpkzn6d3cvhin3s644150jhvcazf-supabase-orioledb-db-init.drv220 /nix/store/s4qicdb2kbzvf3lf6m8xidm4lndgs2yl-unit-supabase-db-init.service.drv221 /nix/store/dgm1f7y3gvjqjfv7r4gfa7pjffgzr4nj-system-units.drv222 /nix/store/sc9b344gbckg6fqywin6bhhs882d6mxa-etc.drv223 /nix/store/k4pazrfsvz1hsx7l4d0jsxvan5b3dq49-activate.drv224 /nix/store/m7z7bg6jaainvrfsikwclppim5yf6kn3-nixos-system-server-test.drv225 /nix/store/70bg25srcrfnwivfph4bhslzhigdgpxw-unit-dbus.service.drv226 /nix/store/cpy2j0c5ribiykpjaig0axzryxzh1g69-user-units.drv227 /nix/store/qbfmigmm8fk4v5nhvb8h71hmhmdaky0g-supabase-db-init.drv228 /nix/store/ggfylf6a7iwk3pn3r08m30684z8rrq5l-unit-supabase-db-init.service.drv229 /nix/store/qsr1582sizlpmavcla4x0gbp3q52g4pd-unit-postgresql.service.drv230 /nix/store/ydkqsx664pp5ndcfl70c84mvxgixix01-system-units.drv231 /nix/store/y3dck3diii9z9x0w771pz541gjd0zwh3-etc.drv232 /nix/store/srl146pjpar66ijj6l2zw99pmy6wpkl9-activate.drv233 /nix/store/sjl12wxd1wb23d9hzlzyqrq731lbrgpb-nixos-system-server-test.drv234 /nix/store/qv2lxny9548lwqjzpi75n12qpyc0fm56-closure-info.drv235 /nix/store/8vx14rz8lihgxgq3s0daqnbhbvnsf97x-run-nixos-vm.drv236 /nix/store/63q2a748lli2nxvrk228r5l81997jmzh-nixos-vm.drv237 /nix/store/vlgcshpwwrznfq7w25ysnhszlz6af34y-nixos-test-driver-pgrouting.drv238 /nix/store/r16fc6ff6kqbnvsskz35s4wq344cjr0q-vm-test-run-pgrouting.drv239error: build of '/nix/store/0n0iaya9csx9by2pimrx1yglzw8dp4zs-pg_net-0.13.0.drv' on 'ssh-ng://nixbot-remote-build@78.232.36.247' failed: Cannot build '/nix/store/0n0iaya9csx9by2pimrx1yglzw8dp4zs-pg_net-0.13.0.drv'.240 Reason: builder failed with exit code 2.241 Output paths:242 /nix/store/14dkr1mhbrh869r2k75r03ngw6q7c4ma-pg_net-0.13.0243 Last 25 log lines:244 > | ^~~~~~~~~~~~~~245 > src/util.h:6:11: warning: call to 'Wcurl_easy_setopt_err_long' declared with attribute warning: curl_easy_setopt expects a long argument [-Wattribute-warning]246 > 6 | if (curl_easy_setopt(hdl, opt, prm) != CURLE_OK) \247 > | ^~~~~~~~~~~~~~~~248 > src/core.c:108:3: note: in expansion of macro 'CURL_EZ_SETOPT'249 > 108 | CURL_EZ_SETOPT(curl_ez_handle, CURLOPT_TIMEOUT_MS, timeout_milliseconds);250 > | ^~~~~~~~~~~~~~251 > src/util.h:6:11: warning: call to 'Wcurl_easy_setopt_err_long' declared with attribute warning: curl_easy_setopt expects a long argument [-Wattribute-warning]252 > 6 | if (curl_easy_setopt(hdl, opt, prm) != CURLE_OK) \253 > | ^~~~~~~~~~~~~~~~254 > src/core.c:110:3: note: in expansion of macro 'CURL_EZ_SETOPT'255 > 110 | CURL_EZ_SETOPT(curl_ez_handle, CURLOPT_FOLLOWLOCATION, true);256 > | ^~~~~~~~~~~~~~257 > gcc -Wall -Wmissing-prototypes -Wpointer-arith -Wdeclaration-after-statement -Werror=vla -Wendif-labels -Wmissing-format-attribute -Wimplicit-fallthrough=3 -Wcast-function-type -Wformat-security -fno-strict-aliasing -fwrapv -fexcess-precision=standard -Wno-deprecated-non-prototype -Wno-format-truncation -Wno-stringop-truncation -g -O2 -std=gnu17 -std=c11 -Werror -Wno-declaration-after-statement -fPIC -DEXTVERSION=\"0.13.0\" -I. -I./ -I/nix/store/48l45fvi99n90x6p9i4cs1lmzby6cb73-postgresql-15.19/include/server -I/nix/store/48l45fvi99n90x6p9i4cs1lmzby6cb73-postgresql-15.19/include/internal -D_GNU_SOURCE -I/nix/store/p17klc3qq4nl9ihfwqfpi8cnqvcf92xz-libxml2-2.15.1-dev/include/libxml2 -I/nix/store/mglbi4dy4kpx7v1dcgf6iincp5x38hsc-lz4-1.10.0-dev/include -I/nix/store/g41q9md9rdcr3lkydi6f8zd6fza3h1q4-zstd-1.5.7-dev/include -I/nix/store/n2vnr7ycfk6midbzxcwd28qj3bgb50cz-icu4c-75.1-dev/include -c -o src/event.o src/event.c258 > In file included from /nix/store/jviasb44hibgh09829gbmbssbz2jjnhz-curl-8.17.0-dev/include/curl/curl.h:3333,259 > from /nix/store/jviasb44hibgh09829gbmbssbz2jjnhz-curl-8.17.0-dev/include/curl/multi.h:51,260 > from src/event.h:4,261 > from src/event.c:6:262 > /nix/store/jviasb44hibgh09829gbmbssbz2jjnhz-curl-8.17.0-dev/include/curl/multi.h:429:23: error: expected identifier or '(' before '__extension__'263 > 429 | CURL_EXTERN CURLMcode curl_multi_setopt(CURLM *multi_handle,264 > | ^~~~~~~~~~~~~~~~~265 > /nix/store/jviasb44hibgh09829gbmbssbz2jjnhz-curl-8.17.0-dev/include/curl/multi.h:429:23: error: expected identifier or '(' before ')' token266 > 429 | CURL_EXTERN CURLMcode curl_multi_setopt(CURLM *multi_handle,267 > | ^~~~~~~~~~~~~~~~~268 > make: *** [<builtin>: src/event.o] Error 1269 For full logs, run:270 nix log /nix/store/0n0iaya9csx9by2pimrx1yglzw8dp4zs-pg_net-0.13.0.drv271error: Cannot build '/nix/store/0n0iaya9csx9by2pimrx1yglzw8dp4zs-pg_net-0.13.0.drv'.272 Reason: builder failed with exit code 1.273 Output paths:274 /nix/store/14dkr1mhbrh869r2k75r03ngw6q7c4ma-pg_net-0.13.0275error: build of '/nix/store/g6nfp5n056kw2jvfzldzxrrrxfpfcka0-pg_net-0.13.0.drv' on 'ssh-ng://nixbot-remote-build@78.232.36.247' failed: Cannot build '/nix/store/g6nfp5n056kw2jvfzldzxrrrxfpfcka0-pg_net-0.13.0.drv'.276 Reason: builder failed with exit code 2.277 Output paths:278 /nix/store/0z6qc5i8vhckm5s9j7br24f5kfxsgds5-pg_net-0.13.0279 Last 25 log lines:280 > | ^~~~~~~~~~~~~~281 > src/util.h:6:11: warning: call to 'Wcurl_easy_setopt_err_long' declared with attribute warning: curl_easy_setopt expects a long argument [-Wattribute-warning]282 > 6 | if (curl_easy_setopt(hdl, opt, prm) != CURLE_OK) \283 > | ^~~~~~~~~~~~~~~~284 > src/core.c:108:3: note: in expansion of macro 'CURL_EZ_SETOPT'285 > 108 | CURL_EZ_SETOPT(curl_ez_handle, CURLOPT_TIMEOUT_MS, timeout_milliseconds);286 > | ^~~~~~~~~~~~~~287 > src/util.h:6:11: warning: call to 'Wcurl_easy_setopt_err_long' declared with attribute warning: curl_easy_setopt expects a long argument [-Wattribute-warning]288 > 6 | if (curl_easy_setopt(hdl, opt, prm) != CURLE_OK) \289 > | ^~~~~~~~~~~~~~~~290 > src/core.c:110:3: note: in expansion of macro 'CURL_EZ_SETOPT'291 > 110 | CURL_EZ_SETOPT(curl_ez_handle, CURLOPT_FOLLOWLOCATION, true);292 > | ^~~~~~~~~~~~~~293 > gcc -Wall -Wmissing-prototypes -Wpointer-arith -Wdeclaration-after-statement -Werror=vla -Wendif-labels -Wmissing-format-attribute -Wimplicit-fallthrough=3 -Wcast-function-type -Wshadow=compatible-local -Wformat-security -fno-strict-aliasing -fwrapv -fexcess-precision=standard -Wno-format-truncation -Wno-stringop-truncation -g -O2 -std=c11 -Werror -Wno-declaration-after-statement -fPIC -fvisibility=hidden -DEXTVERSION=\"0.13.0\" -I. -I./ -I/nix/store/9q4p23a2y63xn8safzzn6lbn07bnkshs-postgresql-17.11/include/server -I/nix/store/9q4p23a2y63xn8safzzn6lbn07bnkshs-postgresql-17.11/include/internal -D_GNU_SOURCE -I/nix/store/p17klc3qq4nl9ihfwqfpi8cnqvcf92xz-libxml2-2.15.1-dev/include/libxml2 -I/nix/store/mglbi4dy4kpx7v1dcgf6iincp5x38hsc-lz4-1.10.0-dev/include -I/nix/store/g41q9md9rdcr3lkydi6f8zd6fza3h1q4-zstd-1.5.7-dev/include -I/nix/store/n2vnr7ycfk6midbzxcwd28qj3bgb50cz-icu4c-75.1-dev/include -c -o src/event.o src/event.c294 > In file included from /nix/store/jviasb44hibgh09829gbmbssbz2jjnhz-curl-8.17.0-dev/include/curl/curl.h:3333,295 > from /nix/store/jviasb44hibgh09829gbmbssbz2jjnhz-curl-8.17.0-dev/include/curl/multi.h:51,296 > from src/event.h:4,297 > from src/event.c:6:298 > /nix/store/jviasb44hibgh09829gbmbssbz2jjnhz-curl-8.17.0-dev/include/curl/multi.h:429:23: error: expected identifier or '(' before '__extension__'299 > 429 | CURL_EXTERN CURLMcode curl_multi_setopt(CURLM *multi_handle,300 > | ^~~~~~~~~~~~~~~~~301 > /nix/store/jviasb44hibgh09829gbmbssbz2jjnhz-curl-8.17.0-dev/include/curl/multi.h:429:23: error: expected identifier or '(' before ')' token302 > 429 | CURL_EXTERN CURLMcode curl_multi_setopt(CURLM *multi_handle,303 > | ^~~~~~~~~~~~~~~~~304 > make: *** [<builtin>: src/event.o] Error 1305 For full logs, run:306 nix log /nix/store/g6nfp5n056kw2jvfzldzxrrrxfpfcka0-pg_net-0.13.0.drv307error: Cannot build '/nix/store/g6nfp5n056kw2jvfzldzxrrrxfpfcka0-pg_net-0.13.0.drv'.308 Reason: builder failed with exit code 1.309 Output paths:310 /nix/store/0z6qc5i8vhckm5s9j7br24f5kfxsgds5-pg_net-0.13.0311error: build of '/nix/store/cfrc2vk3cgabx1447j2n7s3zxraq6395-pg_net-0.14.0.drv' on 'ssh-ng://nixbot-remote-build@78.232.36.247' failed: Cannot build '/nix/store/cfrc2vk3cgabx1447j2n7s3zxraq6395-pg_net-0.14.0.drv'.312 Reason: builder failed with exit code 2.313 Output paths:314 /nix/store/m4c4b79prkz8x60agzy6dy9bn0cdcy0d-pg_net-0.14.0315 Last 25 log lines:316 > src/errors.h:6:11: warning: call to 'Wcurl_easy_setopt_err_long' declared with attribute warning: curl_easy_setopt expects a long argument [-Wattribute-warning]317 > 6 | if (curl_easy_setopt(hdl, opt, prm) != CURLE_OK) \318 > | ^~~~~~~~~~~~~~~~319 > src/core.c:134:3: note: in expansion of macro 'EREPORT_CURL_SETOPT'320 > 134 | EREPORT_CURL_SETOPT(curl_ez_handle, CURLOPT_TIMEOUT_MS, cdata->timeout_milliseconds);321 > | ^~~~~~~~~~~~~~~~~~~322 > src/errors.h:6:11: warning: call to 'Wcurl_easy_setopt_err_long' declared with attribute warning: curl_easy_setopt expects a long argument [-Wattribute-warning]323 > 6 | if (curl_easy_setopt(hdl, opt, prm) != CURLE_OK) \324 > | ^~~~~~~~~~~~~~~~325 > src/core.c:136:3: note: in expansion of macro 'EREPORT_CURL_SETOPT'326 > 136 | EREPORT_CURL_SETOPT(curl_ez_handle, CURLOPT_FOLLOWLOCATION, true);327 > | ^~~~~~~~~~~~~~~~~~~328 > gcc -Wall -Wmissing-prototypes -Wpointer-arith -Wdeclaration-after-statement -Werror=vla -Wendif-labels -Wmissing-format-attribute -Wimplicit-fallthrough=3 -Wcast-function-type -Wformat-security -fno-strict-aliasing -fwrapv -fexcess-precision=standard -Wno-deprecated-non-prototype -Wno-format-truncation -Wno-stringop-truncation -g -O2 -std=gnu17 -std=c11 -Werror -Wno-declaration-after-statement -fPIC -DEXTVERSION=\"0.14.0\" -I. -I./ -I/nix/store/48l45fvi99n90x6p9i4cs1lmzby6cb73-postgresql-15.19/include/server -I/nix/store/48l45fvi99n90x6p9i4cs1lmzby6cb73-postgresql-15.19/include/internal -D_GNU_SOURCE -I/nix/store/p17klc3qq4nl9ihfwqfpi8cnqvcf92xz-libxml2-2.15.1-dev/include/libxml2 -I/nix/store/mglbi4dy4kpx7v1dcgf6iincp5x38hsc-lz4-1.10.0-dev/include -I/nix/store/g41q9md9rdcr3lkydi6f8zd6fza3h1q4-zstd-1.5.7-dev/include -I/nix/store/n2vnr7ycfk6midbzxcwd28qj3bgb50cz-icu4c-75.1-dev/include -c -o src/errors.o src/errors.c329 > gcc -Wall -Wmissing-prototypes -Wpointer-arith -Wdeclaration-after-statement -Werror=vla -Wendif-labels -Wmissing-format-attribute -Wimplicit-fallthrough=3 -Wcast-function-type -Wformat-security -fno-strict-aliasing -fwrapv -fexcess-precision=standard -Wno-deprecated-non-prototype -Wno-format-truncation -Wno-stringop-truncation -g -O2 -std=gnu17 -std=c11 -Werror -Wno-declaration-after-statement -fPIC -DEXTVERSION=\"0.14.0\" -I. -I./ -I/nix/store/48l45fvi99n90x6p9i4cs1lmzby6cb73-postgresql-15.19/include/server -I/nix/store/48l45fvi99n90x6p9i4cs1lmzby6cb73-postgresql-15.19/include/internal -D_GNU_SOURCE -I/nix/store/p17klc3qq4nl9ihfwqfpi8cnqvcf92xz-libxml2-2.15.1-dev/include/libxml2 -I/nix/store/mglbi4dy4kpx7v1dcgf6iincp5x38hsc-lz4-1.10.0-dev/include -I/nix/store/g41q9md9rdcr3lkydi6f8zd6fza3h1q4-zstd-1.5.7-dev/include -I/nix/store/n2vnr7ycfk6midbzxcwd28qj3bgb50cz-icu4c-75.1-dev/include -c -o src/event.o src/event.c330 > In file included from /nix/store/jviasb44hibgh09829gbmbssbz2jjnhz-curl-8.17.0-dev/include/curl/curl.h:3333,331 > from /nix/store/jviasb44hibgh09829gbmbssbz2jjnhz-curl-8.17.0-dev/include/curl/multi.h:51,332 > from src/event.h:4,333 > from src/event.c:6:334 > /nix/store/jviasb44hibgh09829gbmbssbz2jjnhz-curl-8.17.0-dev/include/curl/multi.h:429:23: error: expected identifier or '(' before '__extension__'335 > 429 | CURL_EXTERN CURLMcode curl_multi_setopt(CURLM *multi_handle,336 > | ^~~~~~~~~~~~~~~~~337 > /nix/store/jviasb44hibgh09829gbmbssbz2jjnhz-curl-8.17.0-dev/include/curl/multi.h:429:23: error: expected identifier or '(' before ')' token338 > 429 | CURL_EXTERN CURLMcode curl_multi_setopt(CURLM *multi_handle,339 > | ^~~~~~~~~~~~~~~~~340 > make: *** [<builtin>: src/event.o] Error 1341 For full logs, run:342 nix log /nix/store/cfrc2vk3cgabx1447j2n7s3zxraq6395-pg_net-0.14.0.drv343error: Cannot build '/nix/store/cfrc2vk3cgabx1447j2n7s3zxraq6395-pg_net-0.14.0.drv'.344 Reason: builder failed with exit code 1.345 Output paths:346 /nix/store/m4c4b79prkz8x60agzy6dy9bn0cdcy0d-pg_net-0.14.0347error: build of '/nix/store/rdglczxf0sk4hhwsppqw13zl43vf5wr0-pg_net-0.14.0.drv' on 'ssh-ng://nixbot-remote-build@78.232.36.247' failed: Cannot build '/nix/store/rdglczxf0sk4hhwsppqw13zl43vf5wr0-pg_net-0.14.0.drv'.348 Reason: builder failed with exit code 2.349 Output paths:350 /nix/store/dljg9dqcggn0gx9wwgbw43zdg392qhq2-pg_net-0.14.0351 Last 25 log lines:352 > src/errors.h:6:11: warning: call to 'Wcurl_easy_setopt_err_long' declared with attribute warning: curl_easy_setopt expects a long argument [-Wattribute-warning]353 > 6 | if (curl_easy_setopt(hdl, opt, prm) != CURLE_OK) \354 > | ^~~~~~~~~~~~~~~~355 > src/core.c:134:3: note: in expansion of macro 'EREPORT_CURL_SETOPT'356 > 134 | EREPORT_CURL_SETOPT(curl_ez_handle, CURLOPT_TIMEOUT_MS, cdata->timeout_milliseconds);357 > | ^~~~~~~~~~~~~~~~~~~358 > src/errors.h:6:11: warning: call to 'Wcurl_easy_setopt_err_long' declared with attribute warning: curl_easy_setopt expects a long argument [-Wattribute-warning]359 > 6 | if (curl_easy_setopt(hdl, opt, prm) != CURLE_OK) \360 > | ^~~~~~~~~~~~~~~~361 > src/core.c:136:3: note: in expansion of macro 'EREPORT_CURL_SETOPT'362 > 136 | EREPORT_CURL_SETOPT(curl_ez_handle, CURLOPT_FOLLOWLOCATION, true);363 > | ^~~~~~~~~~~~~~~~~~~364 > gcc -Wall -Wmissing-prototypes -Wpointer-arith -Wdeclaration-after-statement -Werror=vla -Wendif-labels -Wmissing-format-attribute -Wimplicit-fallthrough=3 -Wcast-function-type -Wshadow=compatible-local -Wformat-security -fno-strict-aliasing -fwrapv -fexcess-precision=standard -Wno-format-truncation -Wno-stringop-truncation -moutline-atomics -g -O2 -std=c11 -Werror -Wno-declaration-after-statement -fPIC -fvisibility=hidden -DEXTVERSION=\"0.14.0\" -I. -I./ -I/nix/store/wq2kfr0rkb0hdmf1iwi3mi8pxycakzmq-postgresql-17_22/include/server -I/nix/store/wq2kfr0rkb0hdmf1iwi3mi8pxycakzmq-postgresql-17_22/include/internal -D_GNU_SOURCE -I/nix/store/p17klc3qq4nl9ihfwqfpi8cnqvcf92xz-libxml2-2.15.1-dev/include/libxml2 -I/nix/store/mglbi4dy4kpx7v1dcgf6iincp5x38hsc-lz4-1.10.0-dev/include -I/nix/store/g41q9md9rdcr3lkydi6f8zd6fza3h1q4-zstd-1.5.7-dev/include -I/nix/store/n2vnr7ycfk6midbzxcwd28qj3bgb50cz-icu4c-75.1-dev/include -c -o src/errors.o src/errors.c365 > gcc -Wall -Wmissing-prototypes -Wpointer-arith -Wdeclaration-after-statement -Werror=vla -Wendif-labels -Wmissing-format-attribute -Wimplicit-fallthrough=3 -Wcast-function-type -Wshadow=compatible-local -Wformat-security -fno-strict-aliasing -fwrapv -fexcess-precision=standard -Wno-format-truncation -Wno-stringop-truncation -moutline-atomics -g -O2 -std=c11 -Werror -Wno-declaration-after-statement -fPIC -fvisibility=hidden -DEXTVERSION=\"0.14.0\" -I. -I./ -I/nix/store/wq2kfr0rkb0hdmf1iwi3mi8pxycakzmq-postgresql-17_22/include/server -I/nix/store/wq2kfr0rkb0hdmf1iwi3mi8pxycakzmq-postgresql-17_22/include/internal -D_GNU_SOURCE -I/nix/store/p17klc3qq4nl9ihfwqfpi8cnqvcf92xz-libxml2-2.15.1-dev/include/libxml2 -I/nix/store/mglbi4dy4kpx7v1dcgf6iincp5x38hsc-lz4-1.10.0-dev/include -I/nix/store/g41q9md9rdcr3lkydi6f8zd6fza3h1q4-zstd-1.5.7-dev/include -I/nix/store/n2vnr7ycfk6midbzxcwd28qj3bgb50cz-icu4c-75.1-dev/include -c -o src/event.o src/event.c366 > In file included from /nix/store/jviasb44hibgh09829gbmbssbz2jjnhz-curl-8.17.0-dev/include/curl/curl.h:3333,367 > from /nix/store/jviasb44hibgh09829gbmbssbz2jjnhz-curl-8.17.0-dev/include/curl/multi.h:51,368 > from src/event.h:4,369 > from src/event.c:6:370 > /nix/store/jviasb44hibgh09829gbmbssbz2jjnhz-curl-8.17.0-dev/include/curl/multi.h:429:23: error: expected identifier or '(' before '__extension__'371 > 429 | CURL_EXTERN CURLMcode curl_multi_setopt(CURLM *multi_handle,372 > | ^~~~~~~~~~~~~~~~~373 > /nix/store/jviasb44hibgh09829gbmbssbz2jjnhz-curl-8.17.0-dev/include/curl/multi.h:429:23: error: expected identifier or '(' before ')' token374 > 429 | CURL_EXTERN CURLMcode curl_multi_setopt(CURLM *multi_handle,375 > | ^~~~~~~~~~~~~~~~~376 > make: *** [<builtin>: src/event.o] Error 1377 For full logs, run:378 nix log /nix/store/rdglczxf0sk4hhwsppqw13zl43vf5wr0-pg_net-0.14.0.drv379error: Cannot build '/nix/store/rdglczxf0sk4hhwsppqw13zl43vf5wr0-pg_net-0.14.0.drv'.380 Reason: builder failed with exit code 1.381 Output paths:382 /nix/store/dljg9dqcggn0gx9wwgbw43zdg392qhq2-pg_net-0.14.0383error: build of '/nix/store/lbqp8bfrqa2xm82ma6wyq1gijyajh6kh-pg_net-0.13.0.drv' on 'ssh-ng://nixbot-remote-build@78.232.36.247' failed: Cannot build '/nix/store/lbqp8bfrqa2xm82ma6wyq1gijyajh6kh-pg_net-0.13.0.drv'.384 Reason: builder failed with exit code 2.385 Output paths:386 /nix/store/517wbr5c7xb4fvch9kn0zim5j3hnjzpa-pg_net-0.13.0387 Last 25 log lines:388 > | ^~~~~~~~~~~~~~389 > src/util.h:6:11: warning: call to 'Wcurl_easy_setopt_err_long' declared with attribute warning: curl_easy_setopt expects a long argument [-Wattribute-warning]390 > 6 | if (curl_easy_setopt(hdl, opt, prm) != CURLE_OK) \391 > | ^~~~~~~~~~~~~~~~392 > src/core.c:108:3: note: in expansion of macro 'CURL_EZ_SETOPT'393 > 108 | CURL_EZ_SETOPT(curl_ez_handle, CURLOPT_TIMEOUT_MS, timeout_milliseconds);394 > | ^~~~~~~~~~~~~~395 > src/util.h:6:11: warning: call to 'Wcurl_easy_setopt_err_long' declared with attribute warning: curl_easy_setopt expects a long argument [-Wattribute-warning]396 > 6 | if (curl_easy_setopt(hdl, opt, prm) != CURLE_OK) \397 > | ^~~~~~~~~~~~~~~~398 > src/core.c:110:3: note: in expansion of macro 'CURL_EZ_SETOPT'399 > 110 | CURL_EZ_SETOPT(curl_ez_handle, CURLOPT_FOLLOWLOCATION, true);400 > | ^~~~~~~~~~~~~~401 > gcc -Wall -Wmissing-prototypes -Wpointer-arith -Wdeclaration-after-statement -Werror=vla -Wendif-labels -Wmissing-format-attribute -Wimplicit-fallthrough=3 -Wcast-function-type -Wshadow=compatible-local -Wformat-security -fno-strict-aliasing -fwrapv -fexcess-precision=standard -Wno-format-truncation -Wno-stringop-truncation -moutline-atomics -g -O2 -std=c11 -Werror -Wno-declaration-after-statement -fPIC -fvisibility=hidden -DEXTVERSION=\"0.13.0\" -I. -I./ -I/nix/store/wq2kfr0rkb0hdmf1iwi3mi8pxycakzmq-postgresql-17_22/include/server -I/nix/store/wq2kfr0rkb0hdmf1iwi3mi8pxycakzmq-postgresql-17_22/include/internal -D_GNU_SOURCE -I/nix/store/p17klc3qq4nl9ihfwqfpi8cnqvcf92xz-libxml2-2.15.1-dev/include/libxml2 -I/nix/store/mglbi4dy4kpx7v1dcgf6iincp5x38hsc-lz4-1.10.0-dev/include -I/nix/store/g41q9md9rdcr3lkydi6f8zd6fza3h1q4-zstd-1.5.7-dev/include -I/nix/store/n2vnr7ycfk6midbzxcwd28qj3bgb50cz-icu4c-75.1-dev/include -c -o src/event.o src/event.c402 > In file included from /nix/store/jviasb44hibgh09829gbmbssbz2jjnhz-curl-8.17.0-dev/include/curl/curl.h:3333,403 > from /nix/store/jviasb44hibgh09829gbmbssbz2jjnhz-curl-8.17.0-dev/include/curl/multi.h:51,404 > from src/event.h:4,405 > from src/event.c:6:406 > /nix/store/jviasb44hibgh09829gbmbssbz2jjnhz-curl-8.17.0-dev/include/curl/multi.h:429:23: error: expected identifier or '(' before '__extension__'407 > 429 | CURL_EXTERN CURLMcode curl_multi_setopt(CURLM *multi_handle,408 > | ^~~~~~~~~~~~~~~~~409 > /nix/store/jviasb44hibgh09829gbmbssbz2jjnhz-curl-8.17.0-dev/include/curl/multi.h:429:23: error: expected identifier or '(' before ')' token410 > 429 | CURL_EXTERN CURLMcode curl_multi_setopt(CURLM *multi_handle,411 > | ^~~~~~~~~~~~~~~~~412 > make: *** [<builtin>: src/event.o] Error 1413 For full logs, run:414 nix log /nix/store/lbqp8bfrqa2xm82ma6wyq1gijyajh6kh-pg_net-0.13.0.drv415error: Cannot build '/nix/store/lbqp8bfrqa2xm82ma6wyq1gijyajh6kh-pg_net-0.13.0.drv'.416 Reason: builder failed with exit code 1.417 Output paths:418 /nix/store/517wbr5c7xb4fvch9kn0zim5j3hnjzpa-pg_net-0.13.0419error: build of '/nix/store/xwiwd8fzjgv67zb2ji446a8vxjj3s7bs-pg_net-0.14.0.drv' on 'ssh-ng://nixbot-remote-build@78.232.36.247' failed: Cannot build '/nix/store/xwiwd8fzjgv67zb2ji446a8vxjj3s7bs-pg_net-0.14.0.drv'.420 Reason: builder failed with exit code 2.421 Output paths:422 /nix/store/0bq877r81wz036mv2my23krgmx5r2xkg-pg_net-0.14.0423 Last 25 log lines:424 > src/errors.h:6:11: warning: call to 'Wcurl_easy_setopt_err_long' declared with attribute warning: curl_easy_setopt expects a long argument [-Wattribute-warning]425 > 6 | if (curl_easy_setopt(hdl, opt, prm) != CURLE_OK) \426 > | ^~~~~~~~~~~~~~~~427 > src/core.c:134:3: note: in expansion of macro 'EREPORT_CURL_SETOPT'428 > 134 | EREPORT_CURL_SETOPT(curl_ez_handle, CURLOPT_TIMEOUT_MS, cdata->timeout_milliseconds);429 > | ^~~~~~~~~~~~~~~~~~~430 > src/errors.h:6:11: warning: call to 'Wcurl_easy_setopt_err_long' declared with attribute warning: curl_easy_setopt expects a long argument [-Wattribute-warning]431 > 6 | if (curl_easy_setopt(hdl, opt, prm) != CURLE_OK) \432 > | ^~~~~~~~~~~~~~~~433 > src/core.c:136:3: note: in expansion of macro 'EREPORT_CURL_SETOPT'434 > 136 | EREPORT_CURL_SETOPT(curl_ez_handle, CURLOPT_FOLLOWLOCATION, true);435 > | ^~~~~~~~~~~~~~~~~~~436 > gcc -Wall -Wmissing-prototypes -Wpointer-arith -Wdeclaration-after-statement -Werror=vla -Wendif-labels -Wmissing-format-attribute -Wimplicit-fallthrough=3 -Wcast-function-type -Wshadow=compatible-local -Wformat-security -fno-strict-aliasing -fwrapv -fexcess-precision=standard -Wno-format-truncation -Wno-stringop-truncation -g -O2 -std=c11 -Werror -Wno-declaration-after-statement -fPIC -fvisibility=hidden -DEXTVERSION=\"0.14.0\" -I. -I./ -I/nix/store/9q4p23a2y63xn8safzzn6lbn07bnkshs-postgresql-17.11/include/server -I/nix/store/9q4p23a2y63xn8safzzn6lbn07bnkshs-postgresql-17.11/include/internal -D_GNU_SOURCE -I/nix/store/p17klc3qq4nl9ihfwqfpi8cnqvcf92xz-libxml2-2.15.1-dev/include/libxml2 -I/nix/store/mglbi4dy4kpx7v1dcgf6iincp5x38hsc-lz4-1.10.0-dev/include -I/nix/store/g41q9md9rdcr3lkydi6f8zd6fza3h1q4-zstd-1.5.7-dev/include -I/nix/store/n2vnr7ycfk6midbzxcwd28qj3bgb50cz-icu4c-75.1-dev/include -c -o src/errors.o src/errors.c437 > gcc -Wall -Wmissing-prototypes -Wpointer-arith -Wdeclaration-after-statement -Werror=vla -Wendif-labels -Wmissing-format-attribute -Wimplicit-fallthrough=3 -Wcast-function-type -Wshadow=compatible-local -Wformat-security -fno-strict-aliasing -fwrapv -fexcess-precision=standard -Wno-format-truncation -Wno-stringop-truncation -g -O2 -std=c11 -Werror -Wno-declaration-after-statement -fPIC -fvisibility=hidden -DEXTVERSION=\"0.14.0\" -I. -I./ -I/nix/store/9q4p23a2y63xn8safzzn6lbn07bnkshs-postgresql-17.11/include/server -I/nix/store/9q4p23a2y63xn8safzzn6lbn07bnkshs-postgresql-17.11/include/internal -D_GNU_SOURCE -I/nix/store/p17klc3qq4nl9ihfwqfpi8cnqvcf92xz-libxml2-2.15.1-dev/include/libxml2 -I/nix/store/mglbi4dy4kpx7v1dcgf6iincp5x38hsc-lz4-1.10.0-dev/include -I/nix/store/g41q9md9rdcr3lkydi6f8zd6fza3h1q4-zstd-1.5.7-dev/include -I/nix/store/n2vnr7ycfk6midbzxcwd28qj3bgb50cz-icu4c-75.1-dev/include -c -o src/event.o src/event.c438 > In file included from /nix/store/jviasb44hibgh09829gbmbssbz2jjnhz-curl-8.17.0-dev/include/curl/curl.h:3333,439 > from /nix/store/jviasb44hibgh09829gbmbssbz2jjnhz-curl-8.17.0-dev/include/curl/multi.h:51,440 > from src/event.h:4,441 > from src/event.c:6:442 > /nix/store/jviasb44hibgh09829gbmbssbz2jjnhz-curl-8.17.0-dev/include/curl/multi.h:429:23: error: expected identifier or '(' before '__extension__'443 > 429 | CURL_EXTERN CURLMcode curl_multi_setopt(CURLM *multi_handle,444 > | ^~~~~~~~~~~~~~~~~445 > /nix/store/jviasb44hibgh09829gbmbssbz2jjnhz-curl-8.17.0-dev/include/curl/multi.h:429:23: error: expected identifier or '(' before ')' token446 > 429 | CURL_EXTERN CURLMcode curl_multi_setopt(CURLM *multi_handle,447 > | ^~~~~~~~~~~~~~~~~448 > make: *** [<builtin>: src/event.o] Error 1449 For full logs, run:450 nix log /nix/store/xwiwd8fzjgv67zb2ji446a8vxjj3s7bs-pg_net-0.14.0.drv451error: Cannot build '/nix/store/xwiwd8fzjgv67zb2ji446a8vxjj3s7bs-pg_net-0.14.0.drv'.452 Reason: builder failed with exit code 1.453 Output paths:454 /nix/store/0bq877r81wz036mv2my23krgmx5r2xkg-pg_net-0.14.0455error: build of '/nix/store/0nn0jglvy3w5hd868rilks6acxx242hj-pg_net-0.19.5.drv' on 'ssh-ng://nixbot-remote-build@78.232.36.247' failed: Cannot build '/nix/store/0nn0jglvy3w5hd868rilks6acxx242hj-pg_net-0.19.5.drv'.456 Reason: builder failed with exit code 2.457 Output paths:458 /nix/store/4301s7p0rsq58k2f9hrs6ar4c2a8ya3d-pg_net-0.19.5459 Last 22 log lines:460 > Running phase: unpackPhase461 > unpacking source archive /nix/store/5zgdqy3bz93jyn79pizxc1hks0cdcadw-source462 > source root is source463 > Running phase: patchPhase464 > Running phase: updateAutotoolsGnuConfigScriptsPhase465 > Running phase: configurePhase466 > no configure script, doing nothing467 > Running phase: buildPhase468 > gcc -Wall -Wmissing-prototypes -Wpointer-arith -Wdeclaration-after-statement -Werror=vla -Wendif-labels -Wmissing-format-attribute -Wimplicit-fallthrough=3 -Wcast-function-type -Wshadow=compatible-local -Wformat-security -fno-strict-aliasing -fwrapv -fexcess-precision=standard -Wno-format-truncation -Wno-stringop-truncation -moutline-atomics -g -O2 -std=c11 -Wextra -Wall -Werror -Wno-declaration-after-statement -Wno-vla -Wno-long-long -Wmissing-variable-declarations -fPIC -fvisibility=hidden -DEXTVERSION=\"0.19.5\" -I. -I./ -I/nix/store/wq2kfr0rkb0hdmf1iwi3mi8pxycakzmq-postgresql-17_22/include/server -I/nix/store/wq2kfr0rkb0hdmf1iwi3mi8pxycakzmq-postgresql-17_22/include/internal -D_GNU_SOURCE -I/nix/store/p17klc3qq4nl9ihfwqfpi8cnqvcf92xz-libxml2-2.15.1-dev/include/libxml2 -I/nix/store/mglbi4dy4kpx7v1dcgf6iincp5x38hsc-lz4-1.10.0-dev/include -I/nix/store/g41q9md9rdcr3lkydi6f8zd6fza3h1q4-zstd-1.5.7-dev/include -I/nix/store/n2vnr7ycfk6midbzxcwd28qj3bgb50cz-icu4c-75.1-dev/include -c -o src/core.o src/core.c469 > gcc -Wall -Wmissing-prototypes -Wpointer-arith -Wdeclaration-after-statement -Werror=vla -Wendif-labels -Wmissing-format-attribute -Wimplicit-fallthrough=3 -Wcast-function-type -Wshadow=compatible-local -Wformat-security -fno-strict-aliasing -fwrapv -fexcess-precision=standard -Wno-format-truncation -Wno-stringop-truncation -moutline-atomics -g -O2 -std=c11 -Wextra -Wall -Werror -Wno-declaration-after-statement -Wno-vla -Wno-long-long -Wmissing-variable-declarations -fPIC -fvisibility=hidden -DEXTVERSION=\"0.19.5\" -I. -I./ -I/nix/store/wq2kfr0rkb0hdmf1iwi3mi8pxycakzmq-postgresql-17_22/include/server -I/nix/store/wq2kfr0rkb0hdmf1iwi3mi8pxycakzmq-postgresql-17_22/include/internal -D_GNU_SOURCE -I/nix/store/p17klc3qq4nl9ihfwqfpi8cnqvcf92xz-libxml2-2.15.1-dev/include/libxml2 -I/nix/store/mglbi4dy4kpx7v1dcgf6iincp5x38hsc-lz4-1.10.0-dev/include -I/nix/store/g41q9md9rdcr3lkydi6f8zd6fza3h1q4-zstd-1.5.7-dev/include -I/nix/store/n2vnr7ycfk6midbzxcwd28qj3bgb50cz-icu4c-75.1-dev/include -c -o src/errors.o src/errors.c470 > gcc -Wall -Wmissing-prototypes -Wpointer-arith -Wdeclaration-after-statement -Werror=vla -Wendif-labels -Wmissing-format-attribute -Wimplicit-fallthrough=3 -Wcast-function-type -Wshadow=compatible-local -Wformat-security -fno-strict-aliasing -fwrapv -fexcess-precision=standard -Wno-format-truncation -Wno-stringop-truncation -moutline-atomics -g -O2 -std=c11 -Wextra -Wall -Werror -Wno-declaration-after-statement -Wno-vla -Wno-long-long -Wmissing-variable-declarations -fPIC -fvisibility=hidden -DEXTVERSION=\"0.19.5\" -I. -I./ -I/nix/store/wq2kfr0rkb0hdmf1iwi3mi8pxycakzmq-postgresql-17_22/include/server -I/nix/store/wq2kfr0rkb0hdmf1iwi3mi8pxycakzmq-postgresql-17_22/include/internal -D_GNU_SOURCE -I/nix/store/p17klc3qq4nl9ihfwqfpi8cnqvcf92xz-libxml2-2.15.1-dev/include/libxml2 -I/nix/store/mglbi4dy4kpx7v1dcgf6iincp5x38hsc-lz4-1.10.0-dev/include -I/nix/store/g41q9md9rdcr3lkydi6f8zd6fza3h1q4-zstd-1.5.7-dev/include -I/nix/store/n2vnr7ycfk6midbzxcwd28qj3bgb50cz-icu4c-75.1-dev/include -c -o src/event.o src/event.c471 > In file included from /nix/store/jviasb44hibgh09829gbmbssbz2jjnhz-curl-8.17.0-dev/include/curl/curl.h:3333,472 > from /nix/store/jviasb44hibgh09829gbmbssbz2jjnhz-curl-8.17.0-dev/include/curl/multi.h:51,473 > from src/event.h:4,474 > from src/event.c:6:475 > /nix/store/jviasb44hibgh09829gbmbssbz2jjnhz-curl-8.17.0-dev/include/curl/multi.h:429:23: error: expected identifier or '(' before '__extension__'476 > 429 | CURL_EXTERN CURLMcode curl_multi_setopt(CURLM *multi_handle,477 > | ^~~~~~~~~~~~~~~~~478 > /nix/store/jviasb44hibgh09829gbmbssbz2jjnhz-curl-8.17.0-dev/include/curl/multi.h:429:23: error: expected identifier or '(' before ')' token479 > 429 | CURL_EXTERN CURLMcode curl_multi_setopt(CURLM *multi_handle,480 > | ^~~~~~~~~~~~~~~~~481 > make: *** [<builtin>: src/event.o] Error 1482 For full logs, run:483 nix log /nix/store/0nn0jglvy3w5hd868rilks6acxx242hj-pg_net-0.19.5.drv484error: Cannot build '/nix/store/0nn0jglvy3w5hd868rilks6acxx242hj-pg_net-0.19.5.drv'.485 Reason: builder failed with exit code 1.486 Output paths:487 /nix/store/4301s7p0rsq58k2f9hrs6ar4c2a8ya3d-pg_net-0.19.5488error: build of '/nix/store/7iq4z475k625nsn9wc9nf4vxa7x1f1qd-pg_net-0.19.5.drv' on 'ssh-ng://nixbot-remote-build@78.232.36.247' failed: Cannot build '/nix/store/7iq4z475k625nsn9wc9nf4vxa7x1f1qd-pg_net-0.19.5.drv'.489 Reason: builder failed with exit code 2.490 Output paths:491 /nix/store/mx90q334pqf6iwkyb9vk1wzl5nhmqmiv-pg_net-0.19.5492 Last 22 log lines:493 > Running phase: unpackPhase494 > unpacking source archive /nix/store/5zgdqy3bz93jyn79pizxc1hks0cdcadw-source495 > source root is source496 > Running phase: patchPhase497 > Running phase: updateAutotoolsGnuConfigScriptsPhase498 > Running phase: configurePhase499 > no configure script, doing nothing500 > Running phase: buildPhase501 > gcc -Wall -Wmissing-prototypes -Wpointer-arith -Wdeclaration-after-statement -Werror=vla -Wendif-labels -Wmissing-format-attribute -Wimplicit-fallthrough=3 -Wcast-function-type -Wformat-security -fno-strict-aliasing -fwrapv -fexcess-precision=standard -Wno-deprecated-non-prototype -Wno-format-truncation -Wno-stringop-truncation -g -O2 -std=gnu17 -std=c11 -Wextra -Wall -Werror -Wno-declaration-after-statement -Wno-vla -Wno-long-long -Wmissing-variable-declarations -fPIC -DEXTVERSION=\"0.19.5\" -I. -I./ -I/nix/store/48l45fvi99n90x6p9i4cs1lmzby6cb73-postgresql-15.19/include/server -I/nix/store/48l45fvi99n90x6p9i4cs1lmzby6cb73-postgresql-15.19/include/internal -D_GNU_SOURCE -I/nix/store/p17klc3qq4nl9ihfwqfpi8cnqvcf92xz-libxml2-2.15.1-dev/include/libxml2 -I/nix/store/mglbi4dy4kpx7v1dcgf6iincp5x38hsc-lz4-1.10.0-dev/include -I/nix/store/g41q9md9rdcr3lkydi6f8zd6fza3h1q4-zstd-1.5.7-dev/include -I/nix/store/n2vnr7ycfk6midbzxcwd28qj3bgb50cz-icu4c-75.1-dev/include -c -o src/core.o src/core.c502 > gcc -Wall -Wmissing-prototypes -Wpointer-arith -Wdeclaration-after-statement -Werror=vla -Wendif-labels -Wmissing-format-attribute -Wimplicit-fallthrough=3 -Wcast-function-type -Wformat-security -fno-strict-aliasing -fwrapv -fexcess-precision=standard -Wno-deprecated-non-prototype -Wno-format-truncation -Wno-stringop-truncation -g -O2 -std=gnu17 -std=c11 -Wextra -Wall -Werror -Wno-declaration-after-statement -Wno-vla -Wno-long-long -Wmissing-variable-declarations -fPIC -DEXTVERSION=\"0.19.5\" -I. -I./ -I/nix/store/48l45fvi99n90x6p9i4cs1lmzby6cb73-postgresql-15.19/include/server -I/nix/store/48l45fvi99n90x6p9i4cs1lmzby6cb73-postgresql-15.19/include/internal -D_GNU_SOURCE -I/nix/store/p17klc3qq4nl9ihfwqfpi8cnqvcf92xz-libxml2-2.15.1-dev/include/libxml2 -I/nix/store/mglbi4dy4kpx7v1dcgf6iincp5x38hsc-lz4-1.10.0-dev/include -I/nix/store/g41q9md9rdcr3lkydi6f8zd6fza3h1q4-zstd-1.5.7-dev/include -I/nix/store/n2vnr7ycfk6midbzxcwd28qj3bgb50cz-icu4c-75.1-dev/include -c -o src/errors.o src/errors.c503 > gcc -Wall -Wmissing-prototypes -Wpointer-arith -Wdeclaration-after-statement -Werror=vla -Wendif-labels -Wmissing-format-attribute -Wimplicit-fallthrough=3 -Wcast-function-type -Wformat-security -fno-strict-aliasing -fwrapv -fexcess-precision=standard -Wno-deprecated-non-prototype -Wno-format-truncation -Wno-stringop-truncation -g -O2 -std=gnu17 -std=c11 -Wextra -Wall -Werror -Wno-declaration-after-statement -Wno-vla -Wno-long-long -Wmissing-variable-declarations -fPIC -DEXTVERSION=\"0.19.5\" -I. -I./ -I/nix/store/48l45fvi99n90x6p9i4cs1lmzby6cb73-postgresql-15.19/include/server -I/nix/store/48l45fvi99n90x6p9i4cs1lmzby6cb73-postgresql-15.19/include/internal -D_GNU_SOURCE -I/nix/store/p17klc3qq4nl9ihfwqfpi8cnqvcf92xz-libxml2-2.15.1-dev/include/libxml2 -I/nix/store/mglbi4dy4kpx7v1dcgf6iincp5x38hsc-lz4-1.10.0-dev/include -I/nix/store/g41q9md9rdcr3lkydi6f8zd6fza3h1q4-zstd-1.5.7-dev/include -I/nix/store/n2vnr7ycfk6midbzxcwd28qj3bgb50cz-icu4c-75.1-dev/include -c -o src/event.o src/event.c504 > In file included from /nix/store/jviasb44hibgh09829gbmbssbz2jjnhz-curl-8.17.0-dev/include/curl/curl.h:3333,505 > from /nix/store/jviasb44hibgh09829gbmbssbz2jjnhz-curl-8.17.0-dev/include/curl/multi.h:51,506 > from src/event.h:4,507 > from src/event.c:6:508 > /nix/store/jviasb44hibgh09829gbmbssbz2jjnhz-curl-8.17.0-dev/include/curl/multi.h:429:23: error: expected identifier or '(' before '__extension__'509 > 429 | CURL_EXTERN CURLMcode curl_multi_setopt(CURLM *multi_handle,510 > | ^~~~~~~~~~~~~~~~~511 > /nix/store/jviasb44hibgh09829gbmbssbz2jjnhz-curl-8.17.0-dev/include/curl/multi.h:429:23: error: expected identifier or '(' before ')' token512 > 429 | CURL_EXTERN CURLMcode curl_multi_setopt(CURLM *multi_handle,513 > | ^~~~~~~~~~~~~~~~~514 > make: *** [<builtin>: src/event.o] Error 1515 For full logs, run:516 nix log /nix/store/7iq4z475k625nsn9wc9nf4vxa7x1f1qd-pg_net-0.19.5.drv517error: Cannot build '/nix/store/7iq4z475k625nsn9wc9nf4vxa7x1f1qd-pg_net-0.19.5.drv'.518 Reason: builder failed with exit code 1.519 Output paths:520 /nix/store/mx90q334pqf6iwkyb9vk1wzl5nhmqmiv-pg_net-0.19.5521error: build of '/nix/store/yf5z0qi17vprkjz68rqyp804sx929g9n-pg_net-0.19.5.drv' on 'ssh-ng://nixbot-remote-build@78.232.36.247' failed: Cannot build '/nix/store/yf5z0qi17vprkjz68rqyp804sx929g9n-pg_net-0.19.5.drv'.522 Reason: builder failed with exit code 2.523 Output paths:524 /nix/store/910sp8g3bfhhfdcqhihd5al828k3839f-pg_net-0.19.5525 Last 22 log lines:526 > Running phase: unpackPhase527 > unpacking source archive /nix/store/5zgdqy3bz93jyn79pizxc1hks0cdcadw-source528 > source root is source529 > Running phase: patchPhase530 > Running phase: updateAutotoolsGnuConfigScriptsPhase531 > Running phase: configurePhase532 > no configure script, doing nothing533 > Running phase: buildPhase534 > gcc -Wall -Wmissing-prototypes -Wpointer-arith -Wdeclaration-after-statement -Werror=vla -Wendif-labels -Wmissing-format-attribute -Wimplicit-fallthrough=3 -Wcast-function-type -Wshadow=compatible-local -Wformat-security -fno-strict-aliasing -fwrapv -fexcess-precision=standard -Wno-format-truncation -Wno-stringop-truncation -g -O2 -std=c11 -Wextra -Wall -Werror -Wno-declaration-after-statement -Wno-vla -Wno-long-long -Wmissing-variable-declarations -fPIC -fvisibility=hidden -DEXTVERSION=\"0.19.5\" -I. -I./ -I/nix/store/9q4p23a2y63xn8safzzn6lbn07bnkshs-postgresql-17.11/include/server -I/nix/store/9q4p23a2y63xn8safzzn6lbn07bnkshs-postgresql-17.11/include/internal -D_GNU_SOURCE -I/nix/store/p17klc3qq4nl9ihfwqfpi8cnqvcf92xz-libxml2-2.15.1-dev/include/libxml2 -I/nix/store/mglbi4dy4kpx7v1dcgf6iincp5x38hsc-lz4-1.10.0-dev/include -I/nix/store/g41q9md9rdcr3lkydi6f8zd6fza3h1q4-zstd-1.5.7-dev/include -I/nix/store/n2vnr7ycfk6midbzxcwd28qj3bgb50cz-icu4c-75.1-dev/include -c -o src/core.o src/core.c535 > gcc -Wall -Wmissing-prototypes -Wpointer-arith -Wdeclaration-after-statement -Werror=vla -Wendif-labels -Wmissing-format-attribute -Wimplicit-fallthrough=3 -Wcast-function-type -Wshadow=compatible-local -Wformat-security -fno-strict-aliasing -fwrapv -fexcess-precision=standard -Wno-format-truncation -Wno-stringop-truncation -g -O2 -std=c11 -Wextra -Wall -Werror -Wno-declaration-after-statement -Wno-vla -Wno-long-long -Wmissing-variable-declarations -fPIC -fvisibility=hidden -DEXTVERSION=\"0.19.5\" -I. -I./ -I/nix/store/9q4p23a2y63xn8safzzn6lbn07bnkshs-postgresql-17.11/include/server -I/nix/store/9q4p23a2y63xn8safzzn6lbn07bnkshs-postgresql-17.11/include/internal -D_GNU_SOURCE -I/nix/store/p17klc3qq4nl9ihfwqfpi8cnqvcf92xz-libxml2-2.15.1-dev/include/libxml2 -I/nix/store/mglbi4dy4kpx7v1dcgf6iincp5x38hsc-lz4-1.10.0-dev/include -I/nix/store/g41q9md9rdcr3lkydi6f8zd6fza3h1q4-zstd-1.5.7-dev/include -I/nix/store/n2vnr7ycfk6midbzxcwd28qj3bgb50cz-icu4c-75.1-dev/include -c -o src/errors.o src/errors.c536 > gcc -Wall -Wmissing-prototypes -Wpointer-arith -Wdeclaration-after-statement -Werror=vla -Wendif-labels -Wmissing-format-attribute -Wimplicit-fallthrough=3 -Wcast-function-type -Wshadow=compatible-local -Wformat-security -fno-strict-aliasing -fwrapv -fexcess-precision=standard -Wno-format-truncation -Wno-stringop-truncation -g -O2 -std=c11 -Wextra -Wall -Werror -Wno-declaration-after-statement -Wno-vla -Wno-long-long -Wmissing-variable-declarations -fPIC -fvisibility=hidden -DEXTVERSION=\"0.19.5\" -I. -I./ -I/nix/store/9q4p23a2y63xn8safzzn6lbn07bnkshs-postgresql-17.11/include/server -I/nix/store/9q4p23a2y63xn8safzzn6lbn07bnkshs-postgresql-17.11/include/internal -D_GNU_SOURCE -I/nix/store/p17klc3qq4nl9ihfwqfpi8cnqvcf92xz-libxml2-2.15.1-dev/include/libxml2 -I/nix/store/mglbi4dy4kpx7v1dcgf6iincp5x38hsc-lz4-1.10.0-dev/include -I/nix/store/g41q9md9rdcr3lkydi6f8zd6fza3h1q4-zstd-1.5.7-dev/include -I/nix/store/n2vnr7ycfk6midbzxcwd28qj3bgb50cz-icu4c-75.1-dev/include -c -o src/event.o src/event.c537 > In file included from /nix/store/jviasb44hibgh09829gbmbssbz2jjnhz-curl-8.17.0-dev/include/curl/curl.h:3333,538 > from /nix/store/jviasb44hibgh09829gbmbssbz2jjnhz-curl-8.17.0-dev/include/curl/multi.h:51,539 > from src/event.h:4,540 > from src/event.c:6:541 > /nix/store/jviasb44hibgh09829gbmbssbz2jjnhz-curl-8.17.0-dev/include/curl/multi.h:429:23: error: expected identifier or '(' before '__extension__'542 > 429 | CURL_EXTERN CURLMcode curl_multi_setopt(CURLM *multi_handle,543 > | ^~~~~~~~~~~~~~~~~544 > /nix/store/jviasb44hibgh09829gbmbssbz2jjnhz-curl-8.17.0-dev/include/curl/multi.h:429:23: error: expected identifier or '(' before ')' token545 > 429 | CURL_EXTERN CURLMcode curl_multi_setopt(CURLM *multi_handle,546 > | ^~~~~~~~~~~~~~~~~547 > make: *** [<builtin>: src/event.o] Error 1548 For full logs, run:549 nix log /nix/store/yf5z0qi17vprkjz68rqyp804sx929g9n-pg_net-0.19.5.drv550error: Cannot build '/nix/store/yf5z0qi17vprkjz68rqyp804sx929g9n-pg_net-0.19.5.drv'.551 Reason: builder failed with exit code 1.552 Output paths:553 /nix/store/910sp8g3bfhhfdcqhihd5al828k3839f-pg_net-0.19.5554error: build of '/nix/store/a0ldx82cv1chkbdks86c8mjp8ps4lfgn-pg_net-0.20.0.drv' on 'ssh-ng://nixbot-remote-build@78.232.36.247' failed: Cannot build '/nix/store/a0ldx82cv1chkbdks86c8mjp8ps4lfgn-pg_net-0.20.0.drv'.555 Reason: builder failed with exit code 2.556 Output paths:557 /nix/store/j9hxarpn08mgqpwavw7wdypm8adf921z-pg_net-0.20.0558 Last 22 log lines:559 > Running phase: unpackPhase560 > unpacking source archive /nix/store/3783i7yhcfqnyv5ndli22gcr11ap151m-source561 > source root is source562 > Running phase: patchPhase563 > Running phase: updateAutotoolsGnuConfigScriptsPhase564 > Running phase: configurePhase565 > no configure script, doing nothing566 > Running phase: buildPhase567 > gcc -Wall -Wmissing-prototypes -Wpointer-arith -Wdeclaration-after-statement -Werror=vla -Wendif-labels -Wmissing-format-attribute -Wimplicit-fallthrough=3 -Wcast-function-type -Wshadow=compatible-local -Wformat-security -fno-strict-aliasing -fwrapv -fexcess-precision=standard -Wno-format-truncation -Wno-stringop-truncation -moutline-atomics -g -O2 -std=c11 -Wextra -Wall -Werror -Wno-declaration-after-statement -Wno-vla -Wno-long-long -Wmissing-variable-declarations -fPIC -fvisibility=hidden -DEXTVERSION=\"0.20.0\" -I. -I./ -I/nix/store/wq2kfr0rkb0hdmf1iwi3mi8pxycakzmq-postgresql-17_22/include/server -I/nix/store/wq2kfr0rkb0hdmf1iwi3mi8pxycakzmq-postgresql-17_22/include/internal -D_GNU_SOURCE -I/nix/store/p17klc3qq4nl9ihfwqfpi8cnqvcf92xz-libxml2-2.15.1-dev/include/libxml2 -I/nix/store/mglbi4dy4kpx7v1dcgf6iincp5x38hsc-lz4-1.10.0-dev/include -I/nix/store/g41q9md9rdcr3lkydi6f8zd6fza3h1q4-zstd-1.5.7-dev/include -I/nix/store/n2vnr7ycfk6midbzxcwd28qj3bgb50cz-icu4c-75.1-dev/include -c -o src/core.o src/core.c568 > gcc -Wall -Wmissing-prototypes -Wpointer-arith -Wdeclaration-after-statement -Werror=vla -Wendif-labels -Wmissing-format-attribute -Wimplicit-fallthrough=3 -Wcast-function-type -Wshadow=compatible-local -Wformat-security -fno-strict-aliasing -fwrapv -fexcess-precision=standard -Wno-format-truncation -Wno-stringop-truncation -moutline-atomics -g -O2 -std=c11 -Wextra -Wall -Werror -Wno-declaration-after-statement -Wno-vla -Wno-long-long -Wmissing-variable-declarations -fPIC -fvisibility=hidden -DEXTVERSION=\"0.20.0\" -I. -I./ -I/nix/store/wq2kfr0rkb0hdmf1iwi3mi8pxycakzmq-postgresql-17_22/include/server -I/nix/store/wq2kfr0rkb0hdmf1iwi3mi8pxycakzmq-postgresql-17_22/include/internal -D_GNU_SOURCE -I/nix/store/p17klc3qq4nl9ihfwqfpi8cnqvcf92xz-libxml2-2.15.1-dev/include/libxml2 -I/nix/store/mglbi4dy4kpx7v1dcgf6iincp5x38hsc-lz4-1.10.0-dev/include -I/nix/store/g41q9md9rdcr3lkydi6f8zd6fza3h1q4-zstd-1.5.7-dev/include -I/nix/store/n2vnr7ycfk6midbzxcwd28qj3bgb50cz-icu4c-75.1-dev/include -c -o src/errors.o src/errors.c569 > gcc -Wall -Wmissing-prototypes -Wpointer-arith -Wdeclaration-after-statement -Werror=vla -Wendif-labels -Wmissing-format-attribute -Wimplicit-fallthrough=3 -Wcast-function-type -Wshadow=compatible-local -Wformat-security -fno-strict-aliasing -fwrapv -fexcess-precision=standard -Wno-format-truncation -Wno-stringop-truncation -moutline-atomics -g -O2 -std=c11 -Wextra -Wall -Werror -Wno-declaration-after-statement -Wno-vla -Wno-long-long -Wmissing-variable-declarations -fPIC -fvisibility=hidden -DEXTVERSION=\"0.20.0\" -I. -I./ -I/nix/store/wq2kfr0rkb0hdmf1iwi3mi8pxycakzmq-postgresql-17_22/include/server -I/nix/store/wq2kfr0rkb0hdmf1iwi3mi8pxycakzmq-postgresql-17_22/include/internal -D_GNU_SOURCE -I/nix/store/p17klc3qq4nl9ihfwqfpi8cnqvcf92xz-libxml2-2.15.1-dev/include/libxml2 -I/nix/store/mglbi4dy4kpx7v1dcgf6iincp5x38hsc-lz4-1.10.0-dev/include -I/nix/store/g41q9md9rdcr3lkydi6f8zd6fza3h1q4-zstd-1.5.7-dev/include -I/nix/store/n2vnr7ycfk6midbzxcwd28qj3bgb50cz-icu4c-75.1-dev/include -c -o src/event.o src/event.c570 > In file included from /nix/store/jviasb44hibgh09829gbmbssbz2jjnhz-curl-8.17.0-dev/include/curl/curl.h:3333,571 > from /nix/store/jviasb44hibgh09829gbmbssbz2jjnhz-curl-8.17.0-dev/include/curl/multi.h:51,572 > from src/event.h:4,573 > from src/event.c:6:574 > /nix/store/jviasb44hibgh09829gbmbssbz2jjnhz-curl-8.17.0-dev/include/curl/multi.h:429:23: error: expected identifier or '(' before '__extension__'575 > 429 | CURL_EXTERN CURLMcode curl_multi_setopt(CURLM *multi_handle,576 > | ^~~~~~~~~~~~~~~~~577 > /nix/store/jviasb44hibgh09829gbmbssbz2jjnhz-curl-8.17.0-dev/include/curl/multi.h:429:23: error: expected identifier or '(' before ')' token578 > 429 | CURL_EXTERN CURLMcode curl_multi_setopt(CURLM *multi_handle,579 > | ^~~~~~~~~~~~~~~~~580 > make: *** [<builtin>: src/event.o] Error 1581 For full logs, run:582 nix log /nix/store/a0ldx82cv1chkbdks86c8mjp8ps4lfgn-pg_net-0.20.0.drv583error: Cannot build '/nix/store/a0ldx82cv1chkbdks86c8mjp8ps4lfgn-pg_net-0.20.0.drv'.584 Reason: builder failed with exit code 1.585 Output paths:586 /nix/store/j9hxarpn08mgqpwavw7wdypm8adf921z-pg_net-0.20.0587error: Cannot build '/nix/store/vvs47f973jig6lflvm7cidm6m20glpy5-pg_net.drv'.588 Reason: 4 dependencies failed.589 Output paths:590 /nix/store/b0bs0di9wnr2lphh29rb3cyghbrpflly-pg_net591error: build of '/nix/store/b1pyvgjyn940h95bbnsp15qmb0qli5gd-pg_net-0.20.0.drv' on 'ssh-ng://nixbot-remote-build@78.232.36.247' failed: Cannot build '/nix/store/b1pyvgjyn940h95bbnsp15qmb0qli5gd-pg_net-0.20.0.drv'.592 Reason: builder failed with exit code 2.593 Output paths:594 /nix/store/r13hlgma95j03wagv3kcyfxmdmxs0dx6-pg_net-0.20.0595 Last 22 log lines:596 > Running phase: unpackPhase597 > unpacking source archive /nix/store/3783i7yhcfqnyv5ndli22gcr11ap151m-source598 > source root is source599 > Running phase: patchPhase600 > Running phase: updateAutotoolsGnuConfigScriptsPhase601 > Running phase: configurePhase602 > no configure script, doing nothing603 > Running phase: buildPhase604 > gcc -Wall -Wmissing-prototypes -Wpointer-arith -Wdeclaration-after-statement -Werror=vla -Wendif-labels -Wmissing-format-attribute -Wimplicit-fallthrough=3 -Wcast-function-type -Wshadow=compatible-local -Wformat-security -fno-strict-aliasing -fwrapv -fexcess-precision=standard -Wno-format-truncation -Wno-stringop-truncation -g -O2 -std=c11 -Wextra -Wall -Werror -Wno-declaration-after-statement -Wno-vla -Wno-long-long -Wmissing-variable-declarations -fPIC -fvisibility=hidden -DEXTVERSION=\"0.20.0\" -I. -I./ -I/nix/store/9q4p23a2y63xn8safzzn6lbn07bnkshs-postgresql-17.11/include/server -I/nix/store/9q4p23a2y63xn8safzzn6lbn07bnkshs-postgresql-17.11/include/internal -D_GNU_SOURCE -I/nix/store/p17klc3qq4nl9ihfwqfpi8cnqvcf92xz-libxml2-2.15.1-dev/include/libxml2 -I/nix/store/mglbi4dy4kpx7v1dcgf6iincp5x38hsc-lz4-1.10.0-dev/include -I/nix/store/g41q9md9rdcr3lkydi6f8zd6fza3h1q4-zstd-1.5.7-dev/include -I/nix/store/n2vnr7ycfk6midbzxcwd28qj3bgb50cz-icu4c-75.1-dev/include -c -o src/core.o src/core.c605 > gcc -Wall -Wmissing-prototypes -Wpointer-arith -Wdeclaration-after-statement -Werror=vla -Wendif-labels -Wmissing-format-attribute -Wimplicit-fallthrough=3 -Wcast-function-type -Wshadow=compatible-local -Wformat-security -fno-strict-aliasing -fwrapv -fexcess-precision=standard -Wno-format-truncation -Wno-stringop-truncation -g -O2 -std=c11 -Wextra -Wall -Werror -Wno-declaration-after-statement -Wno-vla -Wno-long-long -Wmissing-variable-declarations -fPIC -fvisibility=hidden -DEXTVERSION=\"0.20.0\" -I. -I./ -I/nix/store/9q4p23a2y63xn8safzzn6lbn07bnkshs-postgresql-17.11/include/server -I/nix/store/9q4p23a2y63xn8safzzn6lbn07bnkshs-postgresql-17.11/include/internal -D_GNU_SOURCE -I/nix/store/p17klc3qq4nl9ihfwqfpi8cnqvcf92xz-libxml2-2.15.1-dev/include/libxml2 -I/nix/store/mglbi4dy4kpx7v1dcgf6iincp5x38hsc-lz4-1.10.0-dev/include -I/nix/store/g41q9md9rdcr3lkydi6f8zd6fza3h1q4-zstd-1.5.7-dev/include -I/nix/store/n2vnr7ycfk6midbzxcwd28qj3bgb50cz-icu4c-75.1-dev/include -c -o src/errors.o src/errors.c606 > gcc -Wall -Wmissing-prototypes -Wpointer-arith -Wdeclaration-after-statement -Werror=vla -Wendif-labels -Wmissing-format-attribute -Wimplicit-fallthrough=3 -Wcast-function-type -Wshadow=compatible-local -Wformat-security -fno-strict-aliasing -fwrapv -fexcess-precision=standard -Wno-format-truncation -Wno-stringop-truncation -g -O2 -std=c11 -Wextra -Wall -Werror -Wno-declaration-after-statement -Wno-vla -Wno-long-long -Wmissing-variable-declarations -fPIC -fvisibility=hidden -DEXTVERSION=\"0.20.0\" -I. -I./ -I/nix/store/9q4p23a2y63xn8safzzn6lbn07bnkshs-postgresql-17.11/include/server -I/nix/store/9q4p23a2y63xn8safzzn6lbn07bnkshs-postgresql-17.11/include/internal -D_GNU_SOURCE -I/nix/store/p17klc3qq4nl9ihfwqfpi8cnqvcf92xz-libxml2-2.15.1-dev/include/libxml2 -I/nix/store/mglbi4dy4kpx7v1dcgf6iincp5x38hsc-lz4-1.10.0-dev/include -I/nix/store/g41q9md9rdcr3lkydi6f8zd6fza3h1q4-zstd-1.5.7-dev/include -I/nix/store/n2vnr7ycfk6midbzxcwd28qj3bgb50cz-icu4c-75.1-dev/include -c -o src/event.o src/event.c607 > In file included from /nix/store/jviasb44hibgh09829gbmbssbz2jjnhz-curl-8.17.0-dev/include/curl/curl.h:3333,608 > from /nix/store/jviasb44hibgh09829gbmbssbz2jjnhz-curl-8.17.0-dev/include/curl/multi.h:51,609 > from src/event.h:4,610 > from src/event.c:6:611 > /nix/store/jviasb44hibgh09829gbmbssbz2jjnhz-curl-8.17.0-dev/include/curl/multi.h:429:23: error: expected identifier or '(' before '__extension__'612 > 429 | CURL_EXTERN CURLMcode curl_multi_setopt(CURLM *multi_handle,613 > | ^~~~~~~~~~~~~~~~~614 > /nix/store/jviasb44hibgh09829gbmbssbz2jjnhz-curl-8.17.0-dev/include/curl/multi.h:429:23: error: expected identifier or '(' before ')' token615 > 429 | CURL_EXTERN CURLMcode curl_multi_setopt(CURLM *multi_handle,616 > | ^~~~~~~~~~~~~~~~~617 > make: *** [<builtin>: src/event.o] Error 1618 For full logs, run:619 nix log /nix/store/b1pyvgjyn940h95bbnsp15qmb0qli5gd-pg_net-0.20.0.drv620error: Cannot build '/nix/store/b1pyvgjyn940h95bbnsp15qmb0qli5gd-pg_net-0.20.0.drv'.621 Reason: builder failed with exit code 1.622 Output paths:623 /nix/store/r13hlgma95j03wagv3kcyfxmdmxs0dx6-pg_net-0.20.0624error: Cannot build '/nix/store/y02vszvrhs7b6kn8llgwzdmnmhqiymzk-pg_net.drv'.625 Reason: 4 dependencies failed.626 Output paths:627 /nix/store/279d7pzxppyz66f6rw8fplifvz9b6s0s-pg_net628error: build of '/nix/store/rfdqkjkjdwz7ydrwlfn9cdy68zz9z6rf-pg_net-0.7.drv' on 'ssh-ng://nixbot-remote-build@78.232.36.247' failed: Cannot build '/nix/store/rfdqkjkjdwz7ydrwlfn9cdy68zz9z6rf-pg_net-0.7.drv'.629 Reason: builder failed with exit code 2.630 Output paths:631 /nix/store/yxd26zp7dvdq20sqsk13x0lk0bqd7j9i-pg_net-0.7632 Last 25 log lines:633 > | ^~~~~~~~~~~~~~634 > src/util.h:6:11: warning: call to 'Wcurl_easy_setopt_err_long' declared with attribute warning: curl_easy_setopt expects a long argument [-Wattribute-warning]635 > 6 | if (curl_easy_setopt(hdl, opt, prm) != CURLE_OK) \636 > | ^~~~~~~~~~~~~~~~637 > src/core.c:108:3: note: in expansion of macro 'CURL_EZ_SETOPT'638 > 108 | CURL_EZ_SETOPT(curl_ez_handle, CURLOPT_TIMEOUT_MS, timeout_milliseconds);639 > | ^~~~~~~~~~~~~~640 > src/util.h:6:11: warning: call to 'Wcurl_easy_setopt_err_long' declared with attribute warning: curl_easy_setopt expects a long argument [-Wattribute-warning]641 > 6 | if (curl_easy_setopt(hdl, opt, prm) != CURLE_OK) \642 > | ^~~~~~~~~~~~~~~~643 > src/core.c:110:3: note: in expansion of macro 'CURL_EZ_SETOPT'644 > 110 | CURL_EZ_SETOPT(curl_ez_handle, CURLOPT_FOLLOWLOCATION, true);645 > | ^~~~~~~~~~~~~~646 > gcc -Wall -Wmissing-prototypes -Wpointer-arith -Wdeclaration-after-statement -Werror=vla -Wendif-labels -Wmissing-format-attribute -Wimplicit-fallthrough=3 -Wcast-function-type -Wformat-security -fno-strict-aliasing -fwrapv -fexcess-precision=standard -Wno-deprecated-non-prototype -Wno-format-truncation -Wno-stringop-truncation -g -O2 -std=gnu17 -std=c11 -Werror -Wno-declaration-after-statement -fPIC -DEXTVERSION=\"0.13.0\" -I. -I./ -I/nix/store/48l45fvi99n90x6p9i4cs1lmzby6cb73-postgresql-15.19/include/server -I/nix/store/48l45fvi99n90x6p9i4cs1lmzby6cb73-postgresql-15.19/include/internal -D_GNU_SOURCE -I/nix/store/p17klc3qq4nl9ihfwqfpi8cnqvcf92xz-libxml2-2.15.1-dev/include/libxml2 -I/nix/store/mglbi4dy4kpx7v1dcgf6iincp5x38hsc-lz4-1.10.0-dev/include -I/nix/store/g41q9md9rdcr3lkydi6f8zd6fza3h1q4-zstd-1.5.7-dev/include -I/nix/store/n2vnr7ycfk6midbzxcwd28qj3bgb50cz-icu4c-75.1-dev/include -c -o src/event.o src/event.c647 > In file included from /nix/store/jviasb44hibgh09829gbmbssbz2jjnhz-curl-8.17.0-dev/include/curl/curl.h:3333,648 > from /nix/store/jviasb44hibgh09829gbmbssbz2jjnhz-curl-8.17.0-dev/include/curl/multi.h:51,649 > from src/event.h:4,650 > from src/event.c:6:651 > /nix/store/jviasb44hibgh09829gbmbssbz2jjnhz-curl-8.17.0-dev/include/curl/multi.h:429:23: error: expected identifier or '(' before '__extension__'652 > 429 | CURL_EXTERN CURLMcode curl_multi_setopt(CURLM *multi_handle,653 > | ^~~~~~~~~~~~~~~~~654 > /nix/store/jviasb44hibgh09829gbmbssbz2jjnhz-curl-8.17.0-dev/include/curl/multi.h:429:23: error: expected identifier or '(' before ')' token655 > 429 | CURL_EXTERN CURLMcode curl_multi_setopt(CURLM *multi_handle,656 > | ^~~~~~~~~~~~~~~~~657 > make: *** [<builtin>: src/event.o] Error 1658 For full logs, run:659 nix log /nix/store/rfdqkjkjdwz7ydrwlfn9cdy68zz9z6rf-pg_net-0.7.drv660error: Cannot build '/nix/store/rfdqkjkjdwz7ydrwlfn9cdy68zz9z6rf-pg_net-0.7.drv'.661 Reason: builder failed with exit code 1.662 Output paths:663 /nix/store/yxd26zp7dvdq20sqsk13x0lk0bqd7j9i-pg_net-0.7664error: build of '/nix/store/nwcnf7x9i2zdx48936w9ixsnxzhbab16-pg_net-0.20.0.drv' on 'ssh-ng://nixbot-remote-build@78.232.36.247' failed: Cannot build '/nix/store/nwcnf7x9i2zdx48936w9ixsnxzhbab16-pg_net-0.20.0.drv'.665 Reason: builder failed with exit code 2.666 Output paths:667 /nix/store/5abg792kgyfqqg3w6nh6wfm1jallf5hq-pg_net-0.20.0668 Last 22 log lines:669 > Running phase: unpackPhase670 > unpacking source archive /nix/store/3783i7yhcfqnyv5ndli22gcr11ap151m-source671 > source root is source672 > Running phase: patchPhase673 > Running phase: updateAutotoolsGnuConfigScriptsPhase674 > Running phase: configurePhase675 > no configure script, doing nothing676 > Running phase: buildPhase677 > gcc -Wall -Wmissing-prototypes -Wpointer-arith -Wdeclaration-after-statement -Werror=vla -Wendif-labels -Wmissing-format-attribute -Wimplicit-fallthrough=3 -Wcast-function-type -Wformat-security -fno-strict-aliasing -fwrapv -fexcess-precision=standard -Wno-deprecated-non-prototype -Wno-format-truncation -Wno-stringop-truncation -g -O2 -std=gnu17 -std=c11 -Wextra -Wall -Werror -Wno-declaration-after-statement -Wno-vla -Wno-long-long -Wmissing-variable-declarations -fPIC -DEXTVERSION=\"0.20.0\" -I. -I./ -I/nix/store/48l45fvi99n90x6p9i4cs1lmzby6cb73-postgresql-15.19/include/server -I/nix/store/48l45fvi99n90x6p9i4cs1lmzby6cb73-postgresql-15.19/include/internal -D_GNU_SOURCE -I/nix/store/p17klc3qq4nl9ihfwqfpi8cnqvcf92xz-libxml2-2.15.1-dev/include/libxml2 -I/nix/store/mglbi4dy4kpx7v1dcgf6iincp5x38hsc-lz4-1.10.0-dev/include -I/nix/store/g41q9md9rdcr3lkydi6f8zd6fza3h1q4-zstd-1.5.7-dev/include -I/nix/store/n2vnr7ycfk6midbzxcwd28qj3bgb50cz-icu4c-75.1-dev/include -c -o src/core.o src/core.c678 > gcc -Wall -Wmissing-prototypes -Wpointer-arith -Wdeclaration-after-statement -Werror=vla -Wendif-labels -Wmissing-format-attribute -Wimplicit-fallthrough=3 -Wcast-function-type -Wformat-security -fno-strict-aliasing -fwrapv -fexcess-precision=standard -Wno-deprecated-non-prototype -Wno-format-truncation -Wno-stringop-truncation -g -O2 -std=gnu17 -std=c11 -Wextra -Wall -Werror -Wno-declaration-after-statement -Wno-vla -Wno-long-long -Wmissing-variable-declarations -fPIC -DEXTVERSION=\"0.20.0\" -I. -I./ -I/nix/store/48l45fvi99n90x6p9i4cs1lmzby6cb73-postgresql-15.19/include/server -I/nix/store/48l45fvi99n90x6p9i4cs1lmzby6cb73-postgresql-15.19/include/internal -D_GNU_SOURCE -I/nix/store/p17klc3qq4nl9ihfwqfpi8cnqvcf92xz-libxml2-2.15.1-dev/include/libxml2 -I/nix/store/mglbi4dy4kpx7v1dcgf6iincp5x38hsc-lz4-1.10.0-dev/include -I/nix/store/g41q9md9rdcr3lkydi6f8zd6fza3h1q4-zstd-1.5.7-dev/include -I/nix/store/n2vnr7ycfk6midbzxcwd28qj3bgb50cz-icu4c-75.1-dev/include -c -o src/errors.o src/errors.c679 > gcc -Wall -Wmissing-prototypes -Wpointer-arith -Wdeclaration-after-statement -Werror=vla -Wendif-labels -Wmissing-format-attribute -Wimplicit-fallthrough=3 -Wcast-function-type -Wformat-security -fno-strict-aliasing -fwrapv -fexcess-precision=standard -Wno-deprecated-non-prototype -Wno-format-truncation -Wno-stringop-truncation -g -O2 -std=gnu17 -std=c11 -Wextra -Wall -Werror -Wno-declaration-after-statement -Wno-vla -Wno-long-long -Wmissing-variable-declarations -fPIC -DEXTVERSION=\"0.20.0\" -I. -I./ -I/nix/store/48l45fvi99n90x6p9i4cs1lmzby6cb73-postgresql-15.19/include/server -I/nix/store/48l45fvi99n90x6p9i4cs1lmzby6cb73-postgresql-15.19/include/internal -D_GNU_SOURCE -I/nix/store/p17klc3qq4nl9ihfwqfpi8cnqvcf92xz-libxml2-2.15.1-dev/include/libxml2 -I/nix/store/mglbi4dy4kpx7v1dcgf6iincp5x38hsc-lz4-1.10.0-dev/include -I/nix/store/g41q9md9rdcr3lkydi6f8zd6fza3h1q4-zstd-1.5.7-dev/include -I/nix/store/n2vnr7ycfk6midbzxcwd28qj3bgb50cz-icu4c-75.1-dev/include -c -o src/event.o src/event.c680 > In file included from /nix/store/jviasb44hibgh09829gbmbssbz2jjnhz-curl-8.17.0-dev/include/curl/curl.h:3333,681 > from /nix/store/jviasb44hibgh09829gbmbssbz2jjnhz-curl-8.17.0-dev/include/curl/multi.h:51,682 > from src/event.h:4,683 > from src/event.c:6:684 > /nix/store/jviasb44hibgh09829gbmbssbz2jjnhz-curl-8.17.0-dev/include/curl/multi.h:429:23: error: expected identifier or '(' before '__extension__'685 > 429 | CURL_EXTERN CURLMcode curl_multi_setopt(CURLM *multi_handle,686 > | ^~~~~~~~~~~~~~~~~687 > /nix/store/jviasb44hibgh09829gbmbssbz2jjnhz-curl-8.17.0-dev/include/curl/multi.h:429:23: error: expected identifier or '(' before ')' token688 > 429 | CURL_EXTERN CURLMcode curl_multi_setopt(CURLM *multi_handle,689 > | ^~~~~~~~~~~~~~~~~690 > make: *** [<builtin>: src/event.o] Error 1691 For full logs, run:692 nix log /nix/store/nwcnf7x9i2zdx48936w9ixsnxzhbab16-pg_net-0.20.0.drv693error: Cannot build '/nix/store/nwcnf7x9i2zdx48936w9ixsnxzhbab16-pg_net-0.20.0.drv'.694 Reason: builder failed with exit code 1.695 Output paths:696 /nix/store/5abg792kgyfqqg3w6nh6wfm1jallf5hq-pg_net-0.20.0697error: Cannot build '/nix/store/q7ak647qv213m4vc4fnr43i09azs1b0p-pg_net.drv'.698 Reason: 5 dependencies failed.699 Output paths:700 /nix/store/9p2ykggx0qabaqhlslb35di6b0ypkcqn-pg_net701error: Cannot build '/nix/store/2fndab8axk4hz4s30ijaxnpa1bc9z1dc-postgresql-and-plugins-17_22.drv'.702 Reason: 1 dependency failed.703 Output paths:704 /nix/store/7f3w5h6iyxryqb3j56n4af0s0y6dy58p-postgresql-and-plugins-17_22705error: Cannot build '/nix/store/w85w5162f9zdpi7g98sjlk186hrrm57p-postgresql-and-plugins-17_22.drv'.706 Reason: 1 dependency failed.707 Output paths:708 /nix/store/c1aavrr5wsqbn4rvrvnln8yaz26zzdmy-postgresql-and-plugins-17_22709error: Cannot build '/nix/store/8r4vw45si1w8qby225b0amhay9ybj6c5-postgresql-orioledb-init.drv'.710 Reason: 1 dependency failed.711 Output paths:712 /nix/store/7c9qf6616nwzqfl6fi7yqdjk4z632qzi-postgresql-orioledb-init713error: Cannot build '/nix/store/9i9flpkzn6d3cvhin3s644150jhvcazf-supabase-orioledb-db-init.drv'.714 Reason: 1 dependency failed.715 Output paths:716 /nix/store/pz04bls9r7r21l14w2igx6amqgcywm60-supabase-orioledb-db-init717error: Cannot build '/nix/store/pgysndf7sfj9ifxk4sy1w8qfx2ln1ws6-unit-postgresql.service.drv'.718 Reason: 2 dependencies failed.719 Output paths:720 /nix/store/yhvd0y4vpmxwxj7c8qkg8gqzjmgbhxfb-unit-postgresql.service721error: Cannot build '/nix/store/s4qicdb2kbzvf3lf6m8xidm4lndgs2yl-unit-supabase-db-init.service.drv'.722 Reason: 1 dependency failed.723 Output paths:724 /nix/store/rzjca48wm4mi0ky3frwwgnm28085ajsx-unit-supabase-db-init.service725error: Cannot build '/nix/store/nj44phx30461wf1ac6n8fg8cc58agpgv-postgresql-and-plugins-17.11.drv'.726 Reason: 1 dependency failed.727 Output paths:728 /nix/store/2v72vvfw2gklj608vs5y8qh2kgyjh4k4-postgresql-and-plugins-17.11729error: Cannot build '/nix/store/rn61yq57k8lhdkx7al266vkbandycwv7-postgresql-and-plugins-17.11.drv'.730 Reason: 1 dependency failed.731 Output paths:732 /nix/store/m1vznlg6iaiwn871m0bw3fywbl8l0fpb-postgresql-and-plugins-17.11733error: Cannot build '/nix/store/fakh4z5ssr1vhknp3xv3ch232i3ph2ax-postgresql-and-plugins-15.19.drv'.734 Reason: 1 dependency failed.735 Output paths:736 /nix/store/k465i8vjw8xzi46ymkk5mhqydlcg32bd-postgresql-and-plugins-15.19737error: Cannot build '/nix/store/4z7sbcap8vdzfs1smz81k2crr4sgm640-postgresql-and-plugins-15.19.drv'.738 Reason: 1 dependency failed.739 Output paths:740 /nix/store/41g9k8wa6wm6jr22hn1xa6xzvg03fmbq-postgresql-and-plugins-15.19741error: Cannot build '/nix/store/rjsqz027b1xj9q5dymzvs3wbqn2dv53m-postgresql-init.drv'.742 Reason: 1 dependency failed.743 Output paths:744 /nix/store/mjfcivwp18j0qcajcv5y1w4rgqa438bi-postgresql-init745error: Cannot build '/nix/store/wmsihsmjyk0h8yjj86lpmijxpzqwk8gg-postgresql-migrate.drv'.746 Reason: 2 dependencies failed.747 Output paths:748 /nix/store/bwkbksfm1g1wg59n8lbbs6si6a0yzz7q-postgresql-migrate749error: Cannot build '/nix/store/qbfmigmm8fk4v5nhvb8h71hmhmdaky0g-supabase-db-init.drv'.750 Reason: 1 dependency failed.751 Output paths:752 /nix/store/qfjqsqsw03kfjf61y4cq3ffffpd1pywz-supabase-db-init753error: Cannot build '/nix/store/amy1ji0k53n9qihnqys9hvlc60bncr1y-system-path.drv'.754 Reason: 2 dependencies failed.755 Output paths:756 /nix/store/2q4zyfzbw4kd12h0h8y34skah708msd6-system-path757error: Cannot build '/nix/store/czird9kid1f479i75r0fcy4ivzd3zzs8-system-path.drv'.758 Reason: 2 dependencies failed.759 Output paths:760 /nix/store/rvv6sp52n8wy28gj22n2m58vir7dsbrf-system-path761error: Cannot build '/nix/store/q4qvxkwv7rl1jac9sf5aap56gjx0n5mb-system-path.drv'.762 Reason: 1 dependency failed.763 Output paths:764 /nix/store/ai2r0wvs9817lqvy62k93driv4x5j5bq-system-path765error: Cannot build '/nix/store/7ynly7nv4iq2wvhmmg6p100h3wr2dpxd-dbus-1.drv'.766 Reason: 1 dependency failed.767 Output paths:768 /nix/store/89605rggrrq6x9va83f79s492399z47h-dbus-1769error: Cannot build '/nix/store/9in45xg9fcahx70h7alf6jg08sin568q-dbus-1.drv'.770 Reason: 1 dependency failed.771 Output paths:772 /nix/store/cnqrgpjkq8n49z3q3niffxj2sq8cdkb8-dbus-1773error: Cannot build '/nix/store/i0ygxsqq6na1vsqmbklzxrj1xy5ypk6x-dbus-1.drv'.774 Reason: 1 dependency failed.775 Output paths:776 /nix/store/49qsknqi753xh51fxzjk9hcsf48r8r6h-dbus-1777error: Cannot build '/nix/store/pml1z1qw471w7nshf5dxp826pysqs3fz-unit-postgresql-migrate.service.drv'.778 Reason: 1 dependency failed.779 Output paths:780 /nix/store/ki6wyvxqxyi3jiqkbxqc9aj74i2dvr96-unit-postgresql-migrate.service781error: Cannot build '/nix/store/n0j0873l4a8mlkz6x1bffr3skhaarc7q-unit-postgresql.service.drv'.782 Reason: 2 dependencies failed.783 Output paths:784 /nix/store/nxnv5i6dsyxjqja66lf3nyv8v4mw73zi-unit-postgresql.service785error: Cannot build '/nix/store/qsr1582sizlpmavcla4x0gbp3q52g4pd-unit-postgresql.service.drv'.786 Reason: 2 dependencies failed.787 Output paths:788 /nix/store/jdpq4p0ii46fdbn6lk9pvjhr4fn9hlk3-unit-postgresql.service789error: Cannot build '/nix/store/ggfylf6a7iwk3pn3r08m30684z8rrq5l-unit-supabase-db-init.service.drv'.790 Reason: 1 dependency failed.791 Output paths:792 /nix/store/yj5im5r7lvm21a97a04zkn267czbrw3l-unit-supabase-db-init.service793error: Cannot build '/nix/store/jffmpfrihfl3k6lfgdc4ii4a62343h7x-X-Restart-Triggers-dbus.drv'.794 Reason: 1 dependency failed.795 Output paths:796 /nix/store/m1k5hvywmxrzrl65zdy4icssmqjwk1ac-X-Restart-Triggers-dbus797error: Cannot build '/nix/store/v749g53p5djbqg3y7kfvdsw5g535j0js-X-Restart-Triggers-dbus.drv'.798 Reason: 1 dependency failed.799 Output paths:800 /nix/store/bqpmmb848k6lgjk42nmhnfh1lg16q81k-X-Restart-Triggers-dbus801error: Cannot build '/nix/store/xnzsv2ymk0qx1fdsm8ssls8mlq8852wc-X-Restart-Triggers-dbus.drv'.802 Reason: 1 dependency failed.803 Output paths:804 /nix/store/3ml8z33q2whxydfyk2l5bkanh67jj07d-X-Restart-Triggers-dbus805error: Cannot build '/nix/store/0jyfsa7sd5nhfiwbk0i0i0k7bbgigy6z-unit-dbus.service.drv'.806 Reason: 1 dependency failed.807 Output paths:808 /nix/store/m1y0mf2s98whn8ssf75ghzldgsm2i6j9-unit-dbus.service809error: Cannot build '/nix/store/5q0f5sx5mas5cc56azv1g9pm53yfrmgc-unit-dbus.service.drv'.810 Reason: 1 dependency failed.811 Output paths:812 /nix/store/a3fz85ah6idqlahgibsss3anjhwvw43y-unit-dbus.service813error: Cannot build '/nix/store/70bg25srcrfnwivfph4bhslzhigdgpxw-unit-dbus.service.drv'.814 Reason: 1 dependency failed.815 Output paths:816 /nix/store/zsgh1qgm3jy8asyqvg4qj0wb78dcrmbr-unit-dbus.service817error: Cannot build '/nix/store/acfna74pf7f063994dvxzqkrrhi623c4-unit-dbus.service.drv'.818 Reason: 1 dependency failed.819 Output paths:820 /nix/store/fcdnvsn70basffr02wx4q0yhvh3bv51y-unit-dbus.service821error: Cannot build '/nix/store/jika4rfg3aj00vq2nfqx2i6nild4nvd5-unit-dbus.service.drv'.822 Reason: 1 dependency failed.823 Output paths:824 /nix/store/hc0bpb6ixv1mffh3g5ks67ha9kjwy2n3-unit-dbus.service825error: Cannot build '/nix/store/n7wg70ga6zm8b0prwd4np0azpi732zji-unit-dbus.service.drv'.826 Reason: 1 dependency failed.827 Output paths:828 /nix/store/x3jdzx5kg815chy5a6mzhahzblz1d3dd-unit-dbus.service829error: Cannot build '/nix/store/dgm1f7y3gvjqjfv7r4gfa7pjffgzr4nj-system-units.drv'.830 Reason: 3 dependencies failed.831 Output paths:832 /nix/store/0m00w4wh2xvzhb9yxz6xjfvg0hzigwis-system-units833error: Cannot build '/nix/store/vrslgxqykax3yi5mlrpiq0v1rq1ilnic-system-units.drv'.834 Reason: 3 dependencies failed.835 Output paths:836 /nix/store/52gkyknb3wx4k2jxapxdj48s5dcan612-system-units837error: Cannot build '/nix/store/ydkqsx664pp5ndcfl70c84mvxgixix01-system-units.drv'.838 Reason: 3 dependencies failed.839 Output paths:840 /nix/store/jzv8qrmiimbc1ndwa0a2rv9vrnkyngs2-system-units841error: Cannot build '/nix/store/a03cbyqm7arwjx83nc7jiwxkbbifg33w-user-units.drv'.842 Reason: 1 dependency failed.843 Output paths:844 /nix/store/8z053plx5r60s6ssccv8vp3v16frx3vh-user-units845error: Cannot build '/nix/store/bmn9rg4vrb07wyj1ls41afzdzcmhdqcm-user-units.drv'.846 Reason: 1 dependency failed.847 Output paths:848 /nix/store/w1bmfz9y06hf43vfs2dfhkbjnqqlb8vc-user-units849error: Cannot build '/nix/store/cpy2j0c5ribiykpjaig0axzryxzh1g69-user-units.drv'.850 Reason: 1 dependency failed.851 Output paths:852 /nix/store/k4q74vb1knwhdc9f757lwy0j04ivgldp-user-units853error: Cannot build '/nix/store/p6pnncmb31ibp4zxf61fbkkb0fmq4xai-etc.drv'.854 Reason: 4 dependencies failed.855 Output paths:856 /nix/store/9200yznkvplcyd5h6zzspwiji64ylhk3-etc857error: Cannot build '/nix/store/sc9b344gbckg6fqywin6bhhs882d6mxa-etc.drv'.858 Reason: 4 dependencies failed.859 Output paths:860 /nix/store/ckxf8wib3vwm6y41vzjr6qn5s96fai06-etc861error: Cannot build '/nix/store/y3dck3diii9z9x0w771pz541gjd0zwh3-etc.drv'.862 Reason: 4 dependencies failed.863 Output paths:864 /nix/store/0gg4z38348708b6snq8hbw2p0f6212am-etc865error: Cannot build '/nix/store/k4pazrfsvz1hsx7l4d0jsxvan5b3dq49-activate.drv'.866 Reason: 1 dependency failed.867 Output paths:868 /nix/store/kgg6la0id0ridfi2n5d6hjwrslqrr0lc-activate869error: Cannot build '/nix/store/srl146pjpar66ijj6l2zw99pmy6wpkl9-activate.drv'.870 Reason: 1 dependency failed.871 Output paths:872 /nix/store/fl857c057c4yxg6bzz5fxi20v1j54dm8-activate873error: Cannot build '/nix/store/x6cijf4csfmd0dc8sqmiajj5dwi4h3dg-activate.drv'.874 Reason: 1 dependency failed.875 Output paths:876 /nix/store/klnbpbna9j60p0z0p03vzc4aybrh66qm-activate877error: Cannot build '/nix/store/cgyqy4j1g2s9zbh87ddwhr7wn9rssarl-nixos-system-server-test.drv'.878 Reason: 3 dependencies failed.879 Output paths:880 /nix/store/w86xsbl1gwsw6jzbir4a2ydiraxdq237-nixos-system-server-test881error: Cannot build '/nix/store/m7z7bg6jaainvrfsikwclppim5yf6kn3-nixos-system-server-test.drv'.882 Reason: 3 dependencies failed.883 Output paths:884 /nix/store/b0ffbnx9s6yib8182ff9056hg0528yi5-nixos-system-server-test885error: Cannot build '/nix/store/sjl12wxd1wb23d9hzlzyqrq731lbrgpb-nixos-system-server-test.drv'.886 Reason: 5 dependencies failed.887 Output paths:888 /nix/store/h0xwxq0y2dhkic248nn5f8l5knznirly-nixos-system-server-test889error: Cannot build '/nix/store/qv2lxny9548lwqjzpi75n12qpyc0fm56-closure-info.drv'.890 Reason: 1 dependency failed.891 Output paths:892 /nix/store/r8bjdjr1r4w0maq6ykhq3hjqyx7fd9s0-closure-info893error: Cannot build '/nix/store/8vx14rz8lihgxgq3s0daqnbhbvnsf97x-run-nixos-vm.drv'.894 Reason: 2 dependencies failed.895 Output paths:896 /nix/store/4wmw3mf35qifw3d3kn3h8nzvi66cglw6-run-nixos-vm897error: Cannot build '/nix/store/63q2a748lli2nxvrk228r5l81997jmzh-nixos-vm.drv'.898 Reason: 2 dependencies failed.899 Output paths:900 /nix/store/rqsj38mgp07g96pmqjy91wzp8n7x75wq-nixos-vm901error: Cannot build '/nix/store/vlgcshpwwrznfq7w25ysnhszlz6af34y-nixos-test-driver-pgrouting.drv'.902 Reason: 2 dependencies failed.903 Output paths:904 /nix/store/bjpaj6dpx8833k81pr84d4xc06b62wab-nixos-test-driver-pgrouting905error: Cannot build '/nix/store/r16fc6ff6kqbnvsskz35s4wq344cjr0q-vm-test-run-pgrouting.drv'.906 Reason: 1 dependency failed.907 Output paths:908 /nix/store/zicr36fv0wr5s6y41qwv47nq681m5ifs-vm-test-run-pgrouting