setup
checks.aarch64-linux.ext-pg_net
· build #133
· raw
1these 72 derivations will be built:2 /nix/store/0n0iaya9csx9by2pimrx1yglzw8dp4zs-pg_net-0.13.0.drv3 /nix/store/7iq4z475k625nsn9wc9nf4vxa7x1f1qd-pg_net-0.19.5.drv4 /nix/store/cfrc2vk3cgabx1447j2n7s3zxraq6395-pg_net-0.14.0.drv5 /nix/store/iwq28h7yniccm9ra8q6dc0wma0l6hnqn-pg_net-0.6.drv6 /nix/store/nw3d144zhshkgx1z66g9g2wg5829w36n-pg_net-0.7.1.drv7 /nix/store/nwcnf7x9i2zdx48936w9ixsnxzhbab16-pg_net-0.20.0.drv8 /nix/store/rfdqkjkjdwz7ydrwlfn9cdy68zz9z6rf-pg_net-0.7.drv9 /nix/store/whvqb38akl195470ks3jads9kmq2i9gj-pg_net-0.8.0.drv10 /nix/store/zy29jzcj1bsz7760wbmlg78czaddsrni-pg_net-0.20.3.drv11 /nix/store/q7ak647qv213m4vc4fnr43i09azs1b0p-pg_net.drv12 /nix/store/1a1qnr1vlfld9ccz74ha0a8azqdwjw88-postgresql-15-pg_net.drv13 /nix/store/0nn0jglvy3w5hd868rilks6acxx242hj-pg_net-0.19.5.drv14 /nix/store/83ycsfk9ivb7sah3lq89d8hy5rxj5vpp-pg_net-0.20.3.drv15 /nix/store/a0ldx82cv1chkbdks86c8mjp8ps4lfgn-pg_net-0.20.0.drv16 /nix/store/lbqp8bfrqa2xm82ma6wyq1gijyajh6kh-pg_net-0.13.0.drv17 /nix/store/rdglczxf0sk4hhwsppqw13zl43vf5wr0-pg_net-0.14.0.drv18 /nix/store/w7547z9slhcibw4s6cwkag6w1f49317s-pg_net-0.20.4.drv19 /nix/store/vvs47f973jig6lflvm7cidm6m20glpy5-pg_net.drv20 /nix/store/3va8cnvmsy7yy6484xp00h00q2782js6-postgresql-orioledb-17-pg_net.drv21 /nix/store/al6g5cvx86v4ljmh3sg6hmlsl3ab3bwf-pg_net-0.20.3.drv22 /nix/store/b1pyvgjyn940h95bbnsp15qmb0qli5gd-pg_net-0.20.0.drv23 /nix/store/g6nfp5n056kw2jvfzldzxrrrxfpfcka0-pg_net-0.13.0.drv24 /nix/store/xwiwd8fzjgv67zb2ji446a8vxjj3s7bs-pg_net-0.14.0.drv25 /nix/store/yf5z0qi17vprkjz68rqyp804sx929g9n-pg_net-0.19.5.drv26 /nix/store/y02vszvrhs7b6kn8llgwzdmnmhqiymzk-pg_net.drv27 /nix/store/ihfd6321rkb08ldslxkvkkkryxzhcnaj-postgresql-17-pg_net.drv28 /nix/store/9lhfy5qmzar65jprk9kp04vka42mwbg6-postgresql-configfile-check.drv29 /nix/store/x35zc9l5qndwmq9009gjij92i6lzshdz-system-path.drv30 /nix/store/41abwlsxl1wxvzy03xz9lkrns89lz7hg-dbus-1.drv31 /nix/store/xlnvqlilz2kbi4a1g8m2z6accgnc1piv-X-Restart-Triggers-dbus.drv32 /nix/store/1w7vlbiqj13ddykgllq80q4bcnsknfnv-unit-dbus.service.drv33 /nix/store/kwf0zbd4a57rg54w7bk44nxsng0aq3rj-user-units.drv34 /nix/store/0lf4x0my2i4wyx9lq8f4kahvc271sspj-unit-postgresql.service.drv35 /nix/store/pmmnrhp85bqx3abn8j5nv9491n3p53gr-unit-script-postgresql-migrate-start.drv36 /nix/store/4fnz4a1mxllv94wkgif96ldz5xf7n9bv-unit-postgresql-migrate.service.drv37 /nix/store/5sn3my2gywmjx099kv88g93mf0rm027q-unit-dbus.service.drv38 /nix/store/k2kz5ircvn9fscsg528ila2scfqv973k-unit-postgresql-setup.service.drv39 /nix/store/x90y5fzqjfk2y17x68ghf3da7wwhhply-system-units.drv40 /nix/store/n2frqfc1kylk2xbhqv3r4gj2vxxgvlfm-etc.drv41 /nix/store/ffrn2h8xhmqdx5wkyvfjsyf1vax0rg2y-activate.drv42 /nix/store/57flrny3rq7rc9rv3h77kggv0hysfsgq-nixos-system-server-test.drv43 /nix/store/5j4p6hdzsa07nlnxfsdpr247idvlhsys-postgresql-configfile-check.drv44 /nix/store/d1n9y6glfg776zp45dqfa1ryrwrlfknf-system-path.drv45 /nix/store/36anhgawm3wlfpxkrxb4i7sc5zw75cg0-dbus-1.drv46 /nix/store/35if5xjxvpzcjkxpfizsmkirpk7jgg4s-unit-postgresql-setup.service.drv47 /nix/store/bk1xa15q19dfv5hp0c08k5h5qg46vd07-unit-postgresql.service.drv48 /nix/store/rni3fjyl9gb5zpb88kfvnic52h36w8xh-X-Restart-Triggers-dbus.drv49 /nix/store/s71669b8p3al15pl3cv5pgvd2mlr2lyq-unit-dbus.service.drv50 /nix/store/cqv29j3d8l7jxw83zb1wh5zaaa1ggpm5-system-units.drv51 /nix/store/17pcpb1y2cq8f6k8fbhjxfsy1gl66563-unit-dbus.service.drv52 /nix/store/jkxxp5c8ywln8bxc00lb3ww3767309b1-user-units.drv53 /nix/store/i7mhymcwfr6v6rl8id080bx9qw7dk1sq-etc.drv54 /nix/store/qd6hhvs3dzvdgi367972d9402s2hb7c1-activate.drv55 /nix/store/bpv9n6bl39932kj5fp4i6j9vbm4m35wh-nixos-system-server-test.drv56 /nix/store/65pcag4cdsa8f7f9xy9l6pkgijhn13dp-unit-postgresql.service.drv57 /nix/store/h4h3k2qrd28xwa33ynx57x9yvjjj055a-system-path.drv58 /nix/store/l5vzbn3lwbrj1x2f6kvk2vmaf872x3q3-dbus-1.drv59 /nix/store/rav6ifamvjw5zhdrbzc54950rhj4a1g2-X-Restart-Triggers-dbus.drv60 /nix/store/9sbxqx3l25qlzl96sq7kwz6a6kljfgxq-unit-dbus.service.drv61 /nix/store/iig751xbs970xdhbka47gkh27x0nc2y7-unit-postgresql-setup.service.drv62 /nix/store/b2q4z0pa53l331dlcp0fry7kml8xqbmd-system-units.drv63 /nix/store/hrd9nivqqfipa7wcch4navia6a8hpsa1-unit-dbus.service.drv64 /nix/store/fzv58jzvy8vydp9qv66p0rpimk7iafn0-user-units.drv65 /nix/store/vlf5zj4lhvzfappa7mjiszcqs2z45cq4-etc.drv66 /nix/store/c0pw8adyfxl9h10h7i60clh6j4wp0ihv-activate.drv67 /nix/store/drmwc4fv2sc972x5d9xhhx4v4747dd3l-postgresql-configfile-check.drv68 /nix/store/cr9gqp360aag74h0zxnby8lmrkakaa89-nixos-system-server-test.drv69 /nix/store/hva8a05prgcnig8fs0qfdgjb2qi2m851-closure-info.drv70 /nix/store/fl43w0ns5ahvwn1nfw1ijgy2dfvhdvw1-run-nixos-vm.drv71 /nix/store/zchaivrvnd0znakz1wym2zdp5vpdn34m-nixos-vm.drv72 /nix/store/3pdfhngjis8zda7lpz818wcxasj06l9m-nixos-test-driver-pg_net.drv73 /nix/store/0613kg0kjkzgjmnq823x9qcn51j4dq04-vm-test-run-pg_net.drv74error: build of '/nix/store/0n0iaya9csx9by2pimrx1yglzw8dp4zs-pg_net-0.13.0.drv' on 'ssh-ng://nixbot-remote-build@78.232.36.247' failed: Cannot build '/nix/store/0n0iaya9csx9by2pimrx1yglzw8dp4zs-pg_net-0.13.0.drv'.75 Reason: builder failed with exit code 2.76 Output paths:77 /nix/store/14dkr1mhbrh869r2k75r03ngw6q7c4ma-pg_net-0.13.078 Last 25 log lines:79 > | ^~~~~~~~~~~~~~80 > src/util.h:6:11: warning: call to 'Wcurl_easy_setopt_err_long' declared with attribute warning: curl_easy_setopt expects a long argument [-Wattribute-warning]81 > 6 | if (curl_easy_setopt(hdl, opt, prm) != CURLE_OK) \82 > | ^~~~~~~~~~~~~~~~83 > src/core.c:108:3: note: in expansion of macro 'CURL_EZ_SETOPT'84 > 108 | CURL_EZ_SETOPT(curl_ez_handle, CURLOPT_TIMEOUT_MS, timeout_milliseconds);85 > | ^~~~~~~~~~~~~~86 > src/util.h:6:11: warning: call to 'Wcurl_easy_setopt_err_long' declared with attribute warning: curl_easy_setopt expects a long argument [-Wattribute-warning]87 > 6 | if (curl_easy_setopt(hdl, opt, prm) != CURLE_OK) \88 > | ^~~~~~~~~~~~~~~~89 > src/core.c:110:3: note: in expansion of macro 'CURL_EZ_SETOPT'90 > 110 | CURL_EZ_SETOPT(curl_ez_handle, CURLOPT_FOLLOWLOCATION, true);91 > | ^~~~~~~~~~~~~~92 > gcc -Wall -Wmissing-prototypes -Wpointer-arith -Wdeclaration-after-statement -Werror=vla -Wendif-labels -Wmissing-format-attribute -Wimplicit-fallthrough=3 -Wcast-function-type -Wformat-security -fno-strict-aliasing -fwrapv -fexcess-precision=standard -Wno-deprecated-non-prototype -Wno-format-truncation -Wno-stringop-truncation -g -O2 -std=gnu17 -std=c11 -Werror -Wno-declaration-after-statement -fPIC -DEXTVERSION=\"0.13.0\" -I. -I./ -I/nix/store/48l45fvi99n90x6p9i4cs1lmzby6cb73-postgresql-15.19/include/server -I/nix/store/48l45fvi99n90x6p9i4cs1lmzby6cb73-postgresql-15.19/include/internal -D_GNU_SOURCE -I/nix/store/p17klc3qq4nl9ihfwqfpi8cnqvcf92xz-libxml2-2.15.1-dev/include/libxml2 -I/nix/store/mglbi4dy4kpx7v1dcgf6iincp5x38hsc-lz4-1.10.0-dev/include -I/nix/store/g41q9md9rdcr3lkydi6f8zd6fza3h1q4-zstd-1.5.7-dev/include -I/nix/store/n2vnr7ycfk6midbzxcwd28qj3bgb50cz-icu4c-75.1-dev/include -c -o src/event.o src/event.c93 > In file included from /nix/store/jviasb44hibgh09829gbmbssbz2jjnhz-curl-8.17.0-dev/include/curl/curl.h:3333,94 > from /nix/store/jviasb44hibgh09829gbmbssbz2jjnhz-curl-8.17.0-dev/include/curl/multi.h:51,95 > from src/event.h:4,96 > from src/event.c:6:97 > /nix/store/jviasb44hibgh09829gbmbssbz2jjnhz-curl-8.17.0-dev/include/curl/multi.h:429:23: error: expected identifier or '(' before '__extension__'98 > 429 | CURL_EXTERN CURLMcode curl_multi_setopt(CURLM *multi_handle,99 > | ^~~~~~~~~~~~~~~~~100 > /nix/store/jviasb44hibgh09829gbmbssbz2jjnhz-curl-8.17.0-dev/include/curl/multi.h:429:23: error: expected identifier or '(' before ')' token101 > 429 | CURL_EXTERN CURLMcode curl_multi_setopt(CURLM *multi_handle,102 > | ^~~~~~~~~~~~~~~~~103 > make: *** [<builtin>: src/event.o] Error 1104 For full logs, run:105 nix log /nix/store/0n0iaya9csx9by2pimrx1yglzw8dp4zs-pg_net-0.13.0.drv106error: Cannot build '/nix/store/0n0iaya9csx9by2pimrx1yglzw8dp4zs-pg_net-0.13.0.drv'.107 Reason: builder failed with exit code 1.108 Output paths:109 /nix/store/14dkr1mhbrh869r2k75r03ngw6q7c4ma-pg_net-0.13.0110error: build of '/nix/store/g6nfp5n056kw2jvfzldzxrrrxfpfcka0-pg_net-0.13.0.drv' on 'ssh-ng://nixbot-remote-build@78.232.36.247' failed: Cannot build '/nix/store/g6nfp5n056kw2jvfzldzxrrrxfpfcka0-pg_net-0.13.0.drv'.111 Reason: builder failed with exit code 2.112 Output paths:113 /nix/store/0z6qc5i8vhckm5s9j7br24f5kfxsgds5-pg_net-0.13.0114 Last 25 log lines:115 > | ^~~~~~~~~~~~~~116 > src/util.h:6:11: warning: call to 'Wcurl_easy_setopt_err_long' declared with attribute warning: curl_easy_setopt expects a long argument [-Wattribute-warning]117 > 6 | if (curl_easy_setopt(hdl, opt, prm) != CURLE_OK) \118 > | ^~~~~~~~~~~~~~~~119 > src/core.c:108:3: note: in expansion of macro 'CURL_EZ_SETOPT'120 > 108 | CURL_EZ_SETOPT(curl_ez_handle, CURLOPT_TIMEOUT_MS, timeout_milliseconds);121 > | ^~~~~~~~~~~~~~122 > src/util.h:6:11: warning: call to 'Wcurl_easy_setopt_err_long' declared with attribute warning: curl_easy_setopt expects a long argument [-Wattribute-warning]123 > 6 | if (curl_easy_setopt(hdl, opt, prm) != CURLE_OK) \124 > | ^~~~~~~~~~~~~~~~125 > src/core.c:110:3: note: in expansion of macro 'CURL_EZ_SETOPT'126 > 110 | CURL_EZ_SETOPT(curl_ez_handle, CURLOPT_FOLLOWLOCATION, true);127 > | ^~~~~~~~~~~~~~128 > gcc -Wall -Wmissing-prototypes -Wpointer-arith -Wdeclaration-after-statement -Werror=vla -Wendif-labels -Wmissing-format-attribute -Wimplicit-fallthrough=3 -Wcast-function-type -Wshadow=compatible-local -Wformat-security -fno-strict-aliasing -fwrapv -fexcess-precision=standard -Wno-format-truncation -Wno-stringop-truncation -g -O2 -std=c11 -Werror -Wno-declaration-after-statement -fPIC -fvisibility=hidden -DEXTVERSION=\"0.13.0\" -I. -I./ -I/nix/store/9q4p23a2y63xn8safzzn6lbn07bnkshs-postgresql-17.11/include/server -I/nix/store/9q4p23a2y63xn8safzzn6lbn07bnkshs-postgresql-17.11/include/internal -D_GNU_SOURCE -I/nix/store/p17klc3qq4nl9ihfwqfpi8cnqvcf92xz-libxml2-2.15.1-dev/include/libxml2 -I/nix/store/mglbi4dy4kpx7v1dcgf6iincp5x38hsc-lz4-1.10.0-dev/include -I/nix/store/g41q9md9rdcr3lkydi6f8zd6fza3h1q4-zstd-1.5.7-dev/include -I/nix/store/n2vnr7ycfk6midbzxcwd28qj3bgb50cz-icu4c-75.1-dev/include -c -o src/event.o src/event.c129 > In file included from /nix/store/jviasb44hibgh09829gbmbssbz2jjnhz-curl-8.17.0-dev/include/curl/curl.h:3333,130 > from /nix/store/jviasb44hibgh09829gbmbssbz2jjnhz-curl-8.17.0-dev/include/curl/multi.h:51,131 > from src/event.h:4,132 > from src/event.c:6:133 > /nix/store/jviasb44hibgh09829gbmbssbz2jjnhz-curl-8.17.0-dev/include/curl/multi.h:429:23: error: expected identifier or '(' before '__extension__'134 > 429 | CURL_EXTERN CURLMcode curl_multi_setopt(CURLM *multi_handle,135 > | ^~~~~~~~~~~~~~~~~136 > /nix/store/jviasb44hibgh09829gbmbssbz2jjnhz-curl-8.17.0-dev/include/curl/multi.h:429:23: error: expected identifier or '(' before ')' token137 > 429 | CURL_EXTERN CURLMcode curl_multi_setopt(CURLM *multi_handle,138 > | ^~~~~~~~~~~~~~~~~139 > make: *** [<builtin>: src/event.o] Error 1140 For full logs, run:141 nix log /nix/store/g6nfp5n056kw2jvfzldzxrrrxfpfcka0-pg_net-0.13.0.drv142error: Cannot build '/nix/store/g6nfp5n056kw2jvfzldzxrrrxfpfcka0-pg_net-0.13.0.drv'.143 Reason: builder failed with exit code 1.144 Output paths:145 /nix/store/0z6qc5i8vhckm5s9j7br24f5kfxsgds5-pg_net-0.13.0146error: build of '/nix/store/cfrc2vk3cgabx1447j2n7s3zxraq6395-pg_net-0.14.0.drv' on 'ssh-ng://nixbot-remote-build@78.232.36.247' failed: Cannot build '/nix/store/cfrc2vk3cgabx1447j2n7s3zxraq6395-pg_net-0.14.0.drv'.147 Reason: builder failed with exit code 2.148 Output paths:149 /nix/store/m4c4b79prkz8x60agzy6dy9bn0cdcy0d-pg_net-0.14.0150 Last 25 log lines:151 > src/errors.h:6:11: warning: call to 'Wcurl_easy_setopt_err_long' declared with attribute warning: curl_easy_setopt expects a long argument [-Wattribute-warning]152 > 6 | if (curl_easy_setopt(hdl, opt, prm) != CURLE_OK) \153 > | ^~~~~~~~~~~~~~~~154 > src/core.c:134:3: note: in expansion of macro 'EREPORT_CURL_SETOPT'155 > 134 | EREPORT_CURL_SETOPT(curl_ez_handle, CURLOPT_TIMEOUT_MS, cdata->timeout_milliseconds);156 > | ^~~~~~~~~~~~~~~~~~~157 > src/errors.h:6:11: warning: call to 'Wcurl_easy_setopt_err_long' declared with attribute warning: curl_easy_setopt expects a long argument [-Wattribute-warning]158 > 6 | if (curl_easy_setopt(hdl, opt, prm) != CURLE_OK) \159 > | ^~~~~~~~~~~~~~~~160 > src/core.c:136:3: note: in expansion of macro 'EREPORT_CURL_SETOPT'161 > 136 | EREPORT_CURL_SETOPT(curl_ez_handle, CURLOPT_FOLLOWLOCATION, true);162 > | ^~~~~~~~~~~~~~~~~~~163 > gcc -Wall -Wmissing-prototypes -Wpointer-arith -Wdeclaration-after-statement -Werror=vla -Wendif-labels -Wmissing-format-attribute -Wimplicit-fallthrough=3 -Wcast-function-type -Wformat-security -fno-strict-aliasing -fwrapv -fexcess-precision=standard -Wno-deprecated-non-prototype -Wno-format-truncation -Wno-stringop-truncation -g -O2 -std=gnu17 -std=c11 -Werror -Wno-declaration-after-statement -fPIC -DEXTVERSION=\"0.14.0\" -I. -I./ -I/nix/store/48l45fvi99n90x6p9i4cs1lmzby6cb73-postgresql-15.19/include/server -I/nix/store/48l45fvi99n90x6p9i4cs1lmzby6cb73-postgresql-15.19/include/internal -D_GNU_SOURCE -I/nix/store/p17klc3qq4nl9ihfwqfpi8cnqvcf92xz-libxml2-2.15.1-dev/include/libxml2 -I/nix/store/mglbi4dy4kpx7v1dcgf6iincp5x38hsc-lz4-1.10.0-dev/include -I/nix/store/g41q9md9rdcr3lkydi6f8zd6fza3h1q4-zstd-1.5.7-dev/include -I/nix/store/n2vnr7ycfk6midbzxcwd28qj3bgb50cz-icu4c-75.1-dev/include -c -o src/errors.o src/errors.c164 > gcc -Wall -Wmissing-prototypes -Wpointer-arith -Wdeclaration-after-statement -Werror=vla -Wendif-labels -Wmissing-format-attribute -Wimplicit-fallthrough=3 -Wcast-function-type -Wformat-security -fno-strict-aliasing -fwrapv -fexcess-precision=standard -Wno-deprecated-non-prototype -Wno-format-truncation -Wno-stringop-truncation -g -O2 -std=gnu17 -std=c11 -Werror -Wno-declaration-after-statement -fPIC -DEXTVERSION=\"0.14.0\" -I. -I./ -I/nix/store/48l45fvi99n90x6p9i4cs1lmzby6cb73-postgresql-15.19/include/server -I/nix/store/48l45fvi99n90x6p9i4cs1lmzby6cb73-postgresql-15.19/include/internal -D_GNU_SOURCE -I/nix/store/p17klc3qq4nl9ihfwqfpi8cnqvcf92xz-libxml2-2.15.1-dev/include/libxml2 -I/nix/store/mglbi4dy4kpx7v1dcgf6iincp5x38hsc-lz4-1.10.0-dev/include -I/nix/store/g41q9md9rdcr3lkydi6f8zd6fza3h1q4-zstd-1.5.7-dev/include -I/nix/store/n2vnr7ycfk6midbzxcwd28qj3bgb50cz-icu4c-75.1-dev/include -c -o src/event.o src/event.c165 > In file included from /nix/store/jviasb44hibgh09829gbmbssbz2jjnhz-curl-8.17.0-dev/include/curl/curl.h:3333,166 > from /nix/store/jviasb44hibgh09829gbmbssbz2jjnhz-curl-8.17.0-dev/include/curl/multi.h:51,167 > from src/event.h:4,168 > from src/event.c:6:169 > /nix/store/jviasb44hibgh09829gbmbssbz2jjnhz-curl-8.17.0-dev/include/curl/multi.h:429:23: error: expected identifier or '(' before '__extension__'170 > 429 | CURL_EXTERN CURLMcode curl_multi_setopt(CURLM *multi_handle,171 > | ^~~~~~~~~~~~~~~~~172 > /nix/store/jviasb44hibgh09829gbmbssbz2jjnhz-curl-8.17.0-dev/include/curl/multi.h:429:23: error: expected identifier or '(' before ')' token173 > 429 | CURL_EXTERN CURLMcode curl_multi_setopt(CURLM *multi_handle,174 > | ^~~~~~~~~~~~~~~~~175 > make: *** [<builtin>: src/event.o] Error 1176 For full logs, run:177 nix log /nix/store/cfrc2vk3cgabx1447j2n7s3zxraq6395-pg_net-0.14.0.drv178error: Cannot build '/nix/store/cfrc2vk3cgabx1447j2n7s3zxraq6395-pg_net-0.14.0.drv'.179 Reason: builder failed with exit code 1.180 Output paths:181 /nix/store/m4c4b79prkz8x60agzy6dy9bn0cdcy0d-pg_net-0.14.0182error: build of '/nix/store/lbqp8bfrqa2xm82ma6wyq1gijyajh6kh-pg_net-0.13.0.drv' on 'ssh-ng://nixbot-remote-build@78.232.36.247' failed: Cannot build '/nix/store/lbqp8bfrqa2xm82ma6wyq1gijyajh6kh-pg_net-0.13.0.drv'.183 Reason: builder failed with exit code 2.184 Output paths:185 /nix/store/517wbr5c7xb4fvch9kn0zim5j3hnjzpa-pg_net-0.13.0186 Last 25 log lines:187 > | ^~~~~~~~~~~~~~188 > src/util.h:6:11: warning: call to 'Wcurl_easy_setopt_err_long' declared with attribute warning: curl_easy_setopt expects a long argument [-Wattribute-warning]189 > 6 | if (curl_easy_setopt(hdl, opt, prm) != CURLE_OK) \190 > | ^~~~~~~~~~~~~~~~191 > src/core.c:108:3: note: in expansion of macro 'CURL_EZ_SETOPT'192 > 108 | CURL_EZ_SETOPT(curl_ez_handle, CURLOPT_TIMEOUT_MS, timeout_milliseconds);193 > | ^~~~~~~~~~~~~~194 > src/util.h:6:11: warning: call to 'Wcurl_easy_setopt_err_long' declared with attribute warning: curl_easy_setopt expects a long argument [-Wattribute-warning]195 > 6 | if (curl_easy_setopt(hdl, opt, prm) != CURLE_OK) \196 > | ^~~~~~~~~~~~~~~~197 > src/core.c:110:3: note: in expansion of macro 'CURL_EZ_SETOPT'198 > 110 | CURL_EZ_SETOPT(curl_ez_handle, CURLOPT_FOLLOWLOCATION, true);199 > | ^~~~~~~~~~~~~~200 > gcc -Wall -Wmissing-prototypes -Wpointer-arith -Wdeclaration-after-statement -Werror=vla -Wendif-labels -Wmissing-format-attribute -Wimplicit-fallthrough=3 -Wcast-function-type -Wshadow=compatible-local -Wformat-security -fno-strict-aliasing -fwrapv -fexcess-precision=standard -Wno-format-truncation -Wno-stringop-truncation -moutline-atomics -g -O2 -std=c11 -Werror -Wno-declaration-after-statement -fPIC -fvisibility=hidden -DEXTVERSION=\"0.13.0\" -I. -I./ -I/nix/store/wq2kfr0rkb0hdmf1iwi3mi8pxycakzmq-postgresql-17_22/include/server -I/nix/store/wq2kfr0rkb0hdmf1iwi3mi8pxycakzmq-postgresql-17_22/include/internal -D_GNU_SOURCE -I/nix/store/p17klc3qq4nl9ihfwqfpi8cnqvcf92xz-libxml2-2.15.1-dev/include/libxml2 -I/nix/store/mglbi4dy4kpx7v1dcgf6iincp5x38hsc-lz4-1.10.0-dev/include -I/nix/store/g41q9md9rdcr3lkydi6f8zd6fza3h1q4-zstd-1.5.7-dev/include -I/nix/store/n2vnr7ycfk6midbzxcwd28qj3bgb50cz-icu4c-75.1-dev/include -c -o src/event.o src/event.c201 > In file included from /nix/store/jviasb44hibgh09829gbmbssbz2jjnhz-curl-8.17.0-dev/include/curl/curl.h:3333,202 > from /nix/store/jviasb44hibgh09829gbmbssbz2jjnhz-curl-8.17.0-dev/include/curl/multi.h:51,203 > from src/event.h:4,204 > from src/event.c:6:205 > /nix/store/jviasb44hibgh09829gbmbssbz2jjnhz-curl-8.17.0-dev/include/curl/multi.h:429:23: error: expected identifier or '(' before '__extension__'206 > 429 | CURL_EXTERN CURLMcode curl_multi_setopt(CURLM *multi_handle,207 > | ^~~~~~~~~~~~~~~~~208 > /nix/store/jviasb44hibgh09829gbmbssbz2jjnhz-curl-8.17.0-dev/include/curl/multi.h:429:23: error: expected identifier or '(' before ')' token209 > 429 | CURL_EXTERN CURLMcode curl_multi_setopt(CURLM *multi_handle,210 > | ^~~~~~~~~~~~~~~~~211 > make: *** [<builtin>: src/event.o] Error 1212 For full logs, run:213 nix log /nix/store/lbqp8bfrqa2xm82ma6wyq1gijyajh6kh-pg_net-0.13.0.drv214error: Cannot build '/nix/store/lbqp8bfrqa2xm82ma6wyq1gijyajh6kh-pg_net-0.13.0.drv'.215 Reason: builder failed with exit code 1.216 Output paths:217 /nix/store/517wbr5c7xb4fvch9kn0zim5j3hnjzpa-pg_net-0.13.0218error: build of '/nix/store/rdglczxf0sk4hhwsppqw13zl43vf5wr0-pg_net-0.14.0.drv' on 'ssh-ng://nixbot-remote-build@78.232.36.247' failed: Cannot build '/nix/store/rdglczxf0sk4hhwsppqw13zl43vf5wr0-pg_net-0.14.0.drv'.219 Reason: builder failed with exit code 2.220 Output paths:221 /nix/store/dljg9dqcggn0gx9wwgbw43zdg392qhq2-pg_net-0.14.0222 Last 25 log lines:223 > src/errors.h:6:11: warning: call to 'Wcurl_easy_setopt_err_long' declared with attribute warning: curl_easy_setopt expects a long argument [-Wattribute-warning]224 > 6 | if (curl_easy_setopt(hdl, opt, prm) != CURLE_OK) \225 > | ^~~~~~~~~~~~~~~~226 > src/core.c:134:3: note: in expansion of macro 'EREPORT_CURL_SETOPT'227 > 134 | EREPORT_CURL_SETOPT(curl_ez_handle, CURLOPT_TIMEOUT_MS, cdata->timeout_milliseconds);228 > | ^~~~~~~~~~~~~~~~~~~229 > src/errors.h:6:11: warning: call to 'Wcurl_easy_setopt_err_long' declared with attribute warning: curl_easy_setopt expects a long argument [-Wattribute-warning]230 > 6 | if (curl_easy_setopt(hdl, opt, prm) != CURLE_OK) \231 > | ^~~~~~~~~~~~~~~~232 > src/core.c:136:3: note: in expansion of macro 'EREPORT_CURL_SETOPT'233 > 136 | EREPORT_CURL_SETOPT(curl_ez_handle, CURLOPT_FOLLOWLOCATION, true);234 > | ^~~~~~~~~~~~~~~~~~~235 > gcc -Wall -Wmissing-prototypes -Wpointer-arith -Wdeclaration-after-statement -Werror=vla -Wendif-labels -Wmissing-format-attribute -Wimplicit-fallthrough=3 -Wcast-function-type -Wshadow=compatible-local -Wformat-security -fno-strict-aliasing -fwrapv -fexcess-precision=standard -Wno-format-truncation -Wno-stringop-truncation -moutline-atomics -g -O2 -std=c11 -Werror -Wno-declaration-after-statement -fPIC -fvisibility=hidden -DEXTVERSION=\"0.14.0\" -I. -I./ -I/nix/store/wq2kfr0rkb0hdmf1iwi3mi8pxycakzmq-postgresql-17_22/include/server -I/nix/store/wq2kfr0rkb0hdmf1iwi3mi8pxycakzmq-postgresql-17_22/include/internal -D_GNU_SOURCE -I/nix/store/p17klc3qq4nl9ihfwqfpi8cnqvcf92xz-libxml2-2.15.1-dev/include/libxml2 -I/nix/store/mglbi4dy4kpx7v1dcgf6iincp5x38hsc-lz4-1.10.0-dev/include -I/nix/store/g41q9md9rdcr3lkydi6f8zd6fza3h1q4-zstd-1.5.7-dev/include -I/nix/store/n2vnr7ycfk6midbzxcwd28qj3bgb50cz-icu4c-75.1-dev/include -c -o src/errors.o src/errors.c236 > gcc -Wall -Wmissing-prototypes -Wpointer-arith -Wdeclaration-after-statement -Werror=vla -Wendif-labels -Wmissing-format-attribute -Wimplicit-fallthrough=3 -Wcast-function-type -Wshadow=compatible-local -Wformat-security -fno-strict-aliasing -fwrapv -fexcess-precision=standard -Wno-format-truncation -Wno-stringop-truncation -moutline-atomics -g -O2 -std=c11 -Werror -Wno-declaration-after-statement -fPIC -fvisibility=hidden -DEXTVERSION=\"0.14.0\" -I. -I./ -I/nix/store/wq2kfr0rkb0hdmf1iwi3mi8pxycakzmq-postgresql-17_22/include/server -I/nix/store/wq2kfr0rkb0hdmf1iwi3mi8pxycakzmq-postgresql-17_22/include/internal -D_GNU_SOURCE -I/nix/store/p17klc3qq4nl9ihfwqfpi8cnqvcf92xz-libxml2-2.15.1-dev/include/libxml2 -I/nix/store/mglbi4dy4kpx7v1dcgf6iincp5x38hsc-lz4-1.10.0-dev/include -I/nix/store/g41q9md9rdcr3lkydi6f8zd6fza3h1q4-zstd-1.5.7-dev/include -I/nix/store/n2vnr7ycfk6midbzxcwd28qj3bgb50cz-icu4c-75.1-dev/include -c -o src/event.o src/event.c237 > In file included from /nix/store/jviasb44hibgh09829gbmbssbz2jjnhz-curl-8.17.0-dev/include/curl/curl.h:3333,238 > from /nix/store/jviasb44hibgh09829gbmbssbz2jjnhz-curl-8.17.0-dev/include/curl/multi.h:51,239 > from src/event.h:4,240 > from src/event.c:6:241 > /nix/store/jviasb44hibgh09829gbmbssbz2jjnhz-curl-8.17.0-dev/include/curl/multi.h:429:23: error: expected identifier or '(' before '__extension__'242 > 429 | CURL_EXTERN CURLMcode curl_multi_setopt(CURLM *multi_handle,243 > | ^~~~~~~~~~~~~~~~~244 > /nix/store/jviasb44hibgh09829gbmbssbz2jjnhz-curl-8.17.0-dev/include/curl/multi.h:429:23: error: expected identifier or '(' before ')' token245 > 429 | CURL_EXTERN CURLMcode curl_multi_setopt(CURLM *multi_handle,246 > | ^~~~~~~~~~~~~~~~~247 > make: *** [<builtin>: src/event.o] Error 1248 For full logs, run:249 nix log /nix/store/rdglczxf0sk4hhwsppqw13zl43vf5wr0-pg_net-0.14.0.drv250error: Cannot build '/nix/store/rdglczxf0sk4hhwsppqw13zl43vf5wr0-pg_net-0.14.0.drv'.251 Reason: builder failed with exit code 1.252 Output paths:253 /nix/store/dljg9dqcggn0gx9wwgbw43zdg392qhq2-pg_net-0.14.0254error: build of '/nix/store/xwiwd8fzjgv67zb2ji446a8vxjj3s7bs-pg_net-0.14.0.drv' on 'ssh-ng://nixbot-remote-build@78.232.36.247' failed: Cannot build '/nix/store/xwiwd8fzjgv67zb2ji446a8vxjj3s7bs-pg_net-0.14.0.drv'.255 Reason: builder failed with exit code 2.256 Output paths:257 /nix/store/0bq877r81wz036mv2my23krgmx5r2xkg-pg_net-0.14.0258 Last 25 log lines:259 > src/errors.h:6:11: warning: call to 'Wcurl_easy_setopt_err_long' declared with attribute warning: curl_easy_setopt expects a long argument [-Wattribute-warning]260 > 6 | if (curl_easy_setopt(hdl, opt, prm) != CURLE_OK) \261 > | ^~~~~~~~~~~~~~~~262 > src/core.c:134:3: note: in expansion of macro 'EREPORT_CURL_SETOPT'263 > 134 | EREPORT_CURL_SETOPT(curl_ez_handle, CURLOPT_TIMEOUT_MS, cdata->timeout_milliseconds);264 > | ^~~~~~~~~~~~~~~~~~~265 > src/errors.h:6:11: warning: call to 'Wcurl_easy_setopt_err_long' declared with attribute warning: curl_easy_setopt expects a long argument [-Wattribute-warning]266 > 6 | if (curl_easy_setopt(hdl, opt, prm) != CURLE_OK) \267 > | ^~~~~~~~~~~~~~~~268 > src/core.c:136:3: note: in expansion of macro 'EREPORT_CURL_SETOPT'269 > 136 | EREPORT_CURL_SETOPT(curl_ez_handle, CURLOPT_FOLLOWLOCATION, true);270 > | ^~~~~~~~~~~~~~~~~~~271 > gcc -Wall -Wmissing-prototypes -Wpointer-arith -Wdeclaration-after-statement -Werror=vla -Wendif-labels -Wmissing-format-attribute -Wimplicit-fallthrough=3 -Wcast-function-type -Wshadow=compatible-local -Wformat-security -fno-strict-aliasing -fwrapv -fexcess-precision=standard -Wno-format-truncation -Wno-stringop-truncation -g -O2 -std=c11 -Werror -Wno-declaration-after-statement -fPIC -fvisibility=hidden -DEXTVERSION=\"0.14.0\" -I. -I./ -I/nix/store/9q4p23a2y63xn8safzzn6lbn07bnkshs-postgresql-17.11/include/server -I/nix/store/9q4p23a2y63xn8safzzn6lbn07bnkshs-postgresql-17.11/include/internal -D_GNU_SOURCE -I/nix/store/p17klc3qq4nl9ihfwqfpi8cnqvcf92xz-libxml2-2.15.1-dev/include/libxml2 -I/nix/store/mglbi4dy4kpx7v1dcgf6iincp5x38hsc-lz4-1.10.0-dev/include -I/nix/store/g41q9md9rdcr3lkydi6f8zd6fza3h1q4-zstd-1.5.7-dev/include -I/nix/store/n2vnr7ycfk6midbzxcwd28qj3bgb50cz-icu4c-75.1-dev/include -c -o src/errors.o src/errors.c272 > gcc -Wall -Wmissing-prototypes -Wpointer-arith -Wdeclaration-after-statement -Werror=vla -Wendif-labels -Wmissing-format-attribute -Wimplicit-fallthrough=3 -Wcast-function-type -Wshadow=compatible-local -Wformat-security -fno-strict-aliasing -fwrapv -fexcess-precision=standard -Wno-format-truncation -Wno-stringop-truncation -g -O2 -std=c11 -Werror -Wno-declaration-after-statement -fPIC -fvisibility=hidden -DEXTVERSION=\"0.14.0\" -I. -I./ -I/nix/store/9q4p23a2y63xn8safzzn6lbn07bnkshs-postgresql-17.11/include/server -I/nix/store/9q4p23a2y63xn8safzzn6lbn07bnkshs-postgresql-17.11/include/internal -D_GNU_SOURCE -I/nix/store/p17klc3qq4nl9ihfwqfpi8cnqvcf92xz-libxml2-2.15.1-dev/include/libxml2 -I/nix/store/mglbi4dy4kpx7v1dcgf6iincp5x38hsc-lz4-1.10.0-dev/include -I/nix/store/g41q9md9rdcr3lkydi6f8zd6fza3h1q4-zstd-1.5.7-dev/include -I/nix/store/n2vnr7ycfk6midbzxcwd28qj3bgb50cz-icu4c-75.1-dev/include -c -o src/event.o src/event.c273 > In file included from /nix/store/jviasb44hibgh09829gbmbssbz2jjnhz-curl-8.17.0-dev/include/curl/curl.h:3333,274 > from /nix/store/jviasb44hibgh09829gbmbssbz2jjnhz-curl-8.17.0-dev/include/curl/multi.h:51,275 > from src/event.h:4,276 > from src/event.c:6:277 > /nix/store/jviasb44hibgh09829gbmbssbz2jjnhz-curl-8.17.0-dev/include/curl/multi.h:429:23: error: expected identifier or '(' before '__extension__'278 > 429 | CURL_EXTERN CURLMcode curl_multi_setopt(CURLM *multi_handle,279 > | ^~~~~~~~~~~~~~~~~280 > /nix/store/jviasb44hibgh09829gbmbssbz2jjnhz-curl-8.17.0-dev/include/curl/multi.h:429:23: error: expected identifier or '(' before ')' token281 > 429 | CURL_EXTERN CURLMcode curl_multi_setopt(CURLM *multi_handle,282 > | ^~~~~~~~~~~~~~~~~283 > make: *** [<builtin>: src/event.o] Error 1284 For full logs, run:285 nix log /nix/store/xwiwd8fzjgv67zb2ji446a8vxjj3s7bs-pg_net-0.14.0.drv286error: Cannot build '/nix/store/xwiwd8fzjgv67zb2ji446a8vxjj3s7bs-pg_net-0.14.0.drv'.287 Reason: builder failed with exit code 1.288 Output paths:289 /nix/store/0bq877r81wz036mv2my23krgmx5r2xkg-pg_net-0.14.0290error: build of '/nix/store/0nn0jglvy3w5hd868rilks6acxx242hj-pg_net-0.19.5.drv' on 'ssh-ng://nixbot-remote-build@78.232.36.247' failed: Cannot build '/nix/store/0nn0jglvy3w5hd868rilks6acxx242hj-pg_net-0.19.5.drv'.291 Reason: builder failed with exit code 2.292 Output paths:293 /nix/store/4301s7p0rsq58k2f9hrs6ar4c2a8ya3d-pg_net-0.19.5294 Last 22 log lines:295 > Running phase: unpackPhase296 > unpacking source archive /nix/store/5zgdqy3bz93jyn79pizxc1hks0cdcadw-source297 > source root is source298 > Running phase: patchPhase299 > Running phase: updateAutotoolsGnuConfigScriptsPhase300 > Running phase: configurePhase301 > no configure script, doing nothing302 > Running phase: buildPhase303 > gcc -Wall -Wmissing-prototypes -Wpointer-arith -Wdeclaration-after-statement -Werror=vla -Wendif-labels -Wmissing-format-attribute -Wimplicit-fallthrough=3 -Wcast-function-type -Wshadow=compatible-local -Wformat-security -fno-strict-aliasing -fwrapv -fexcess-precision=standard -Wno-format-truncation -Wno-stringop-truncation -moutline-atomics -g -O2 -std=c11 -Wextra -Wall -Werror -Wno-declaration-after-statement -Wno-vla -Wno-long-long -Wmissing-variable-declarations -fPIC -fvisibility=hidden -DEXTVERSION=\"0.19.5\" -I. -I./ -I/nix/store/wq2kfr0rkb0hdmf1iwi3mi8pxycakzmq-postgresql-17_22/include/server -I/nix/store/wq2kfr0rkb0hdmf1iwi3mi8pxycakzmq-postgresql-17_22/include/internal -D_GNU_SOURCE -I/nix/store/p17klc3qq4nl9ihfwqfpi8cnqvcf92xz-libxml2-2.15.1-dev/include/libxml2 -I/nix/store/mglbi4dy4kpx7v1dcgf6iincp5x38hsc-lz4-1.10.0-dev/include -I/nix/store/g41q9md9rdcr3lkydi6f8zd6fza3h1q4-zstd-1.5.7-dev/include -I/nix/store/n2vnr7ycfk6midbzxcwd28qj3bgb50cz-icu4c-75.1-dev/include -c -o src/core.o src/core.c304 > gcc -Wall -Wmissing-prototypes -Wpointer-arith -Wdeclaration-after-statement -Werror=vla -Wendif-labels -Wmissing-format-attribute -Wimplicit-fallthrough=3 -Wcast-function-type -Wshadow=compatible-local -Wformat-security -fno-strict-aliasing -fwrapv -fexcess-precision=standard -Wno-format-truncation -Wno-stringop-truncation -moutline-atomics -g -O2 -std=c11 -Wextra -Wall -Werror -Wno-declaration-after-statement -Wno-vla -Wno-long-long -Wmissing-variable-declarations -fPIC -fvisibility=hidden -DEXTVERSION=\"0.19.5\" -I. -I./ -I/nix/store/wq2kfr0rkb0hdmf1iwi3mi8pxycakzmq-postgresql-17_22/include/server -I/nix/store/wq2kfr0rkb0hdmf1iwi3mi8pxycakzmq-postgresql-17_22/include/internal -D_GNU_SOURCE -I/nix/store/p17klc3qq4nl9ihfwqfpi8cnqvcf92xz-libxml2-2.15.1-dev/include/libxml2 -I/nix/store/mglbi4dy4kpx7v1dcgf6iincp5x38hsc-lz4-1.10.0-dev/include -I/nix/store/g41q9md9rdcr3lkydi6f8zd6fza3h1q4-zstd-1.5.7-dev/include -I/nix/store/n2vnr7ycfk6midbzxcwd28qj3bgb50cz-icu4c-75.1-dev/include -c -o src/errors.o src/errors.c305 > gcc -Wall -Wmissing-prototypes -Wpointer-arith -Wdeclaration-after-statement -Werror=vla -Wendif-labels -Wmissing-format-attribute -Wimplicit-fallthrough=3 -Wcast-function-type -Wshadow=compatible-local -Wformat-security -fno-strict-aliasing -fwrapv -fexcess-precision=standard -Wno-format-truncation -Wno-stringop-truncation -moutline-atomics -g -O2 -std=c11 -Wextra -Wall -Werror -Wno-declaration-after-statement -Wno-vla -Wno-long-long -Wmissing-variable-declarations -fPIC -fvisibility=hidden -DEXTVERSION=\"0.19.5\" -I. -I./ -I/nix/store/wq2kfr0rkb0hdmf1iwi3mi8pxycakzmq-postgresql-17_22/include/server -I/nix/store/wq2kfr0rkb0hdmf1iwi3mi8pxycakzmq-postgresql-17_22/include/internal -D_GNU_SOURCE -I/nix/store/p17klc3qq4nl9ihfwqfpi8cnqvcf92xz-libxml2-2.15.1-dev/include/libxml2 -I/nix/store/mglbi4dy4kpx7v1dcgf6iincp5x38hsc-lz4-1.10.0-dev/include -I/nix/store/g41q9md9rdcr3lkydi6f8zd6fza3h1q4-zstd-1.5.7-dev/include -I/nix/store/n2vnr7ycfk6midbzxcwd28qj3bgb50cz-icu4c-75.1-dev/include -c -o src/event.o src/event.c306 > In file included from /nix/store/jviasb44hibgh09829gbmbssbz2jjnhz-curl-8.17.0-dev/include/curl/curl.h:3333,307 > from /nix/store/jviasb44hibgh09829gbmbssbz2jjnhz-curl-8.17.0-dev/include/curl/multi.h:51,308 > from src/event.h:4,309 > from src/event.c:6:310 > /nix/store/jviasb44hibgh09829gbmbssbz2jjnhz-curl-8.17.0-dev/include/curl/multi.h:429:23: error: expected identifier or '(' before '__extension__'311 > 429 | CURL_EXTERN CURLMcode curl_multi_setopt(CURLM *multi_handle,312 > | ^~~~~~~~~~~~~~~~~313 > /nix/store/jviasb44hibgh09829gbmbssbz2jjnhz-curl-8.17.0-dev/include/curl/multi.h:429:23: error: expected identifier or '(' before ')' token314 > 429 | CURL_EXTERN CURLMcode curl_multi_setopt(CURLM *multi_handle,315 > | ^~~~~~~~~~~~~~~~~316 > make: *** [<builtin>: src/event.o] Error 1317 For full logs, run:318 nix log /nix/store/0nn0jglvy3w5hd868rilks6acxx242hj-pg_net-0.19.5.drv319error: Cannot build '/nix/store/0nn0jglvy3w5hd868rilks6acxx242hj-pg_net-0.19.5.drv'.320 Reason: builder failed with exit code 1.321 Output paths:322 /nix/store/4301s7p0rsq58k2f9hrs6ar4c2a8ya3d-pg_net-0.19.5323error: build of '/nix/store/7iq4z475k625nsn9wc9nf4vxa7x1f1qd-pg_net-0.19.5.drv' on 'ssh-ng://nixbot-remote-build@78.232.36.247' failed: Cannot build '/nix/store/7iq4z475k625nsn9wc9nf4vxa7x1f1qd-pg_net-0.19.5.drv'.324 Reason: builder failed with exit code 2.325 Output paths:326 /nix/store/mx90q334pqf6iwkyb9vk1wzl5nhmqmiv-pg_net-0.19.5327 Last 22 log lines:328 > Running phase: unpackPhase329 > unpacking source archive /nix/store/5zgdqy3bz93jyn79pizxc1hks0cdcadw-source330 > source root is source331 > Running phase: patchPhase332 > Running phase: updateAutotoolsGnuConfigScriptsPhase333 > Running phase: configurePhase334 > no configure script, doing nothing335 > Running phase: buildPhase336 > gcc -Wall -Wmissing-prototypes -Wpointer-arith -Wdeclaration-after-statement -Werror=vla -Wendif-labels -Wmissing-format-attribute -Wimplicit-fallthrough=3 -Wcast-function-type -Wformat-security -fno-strict-aliasing -fwrapv -fexcess-precision=standard -Wno-deprecated-non-prototype -Wno-format-truncation -Wno-stringop-truncation -g -O2 -std=gnu17 -std=c11 -Wextra -Wall -Werror -Wno-declaration-after-statement -Wno-vla -Wno-long-long -Wmissing-variable-declarations -fPIC -DEXTVERSION=\"0.19.5\" -I. -I./ -I/nix/store/48l45fvi99n90x6p9i4cs1lmzby6cb73-postgresql-15.19/include/server -I/nix/store/48l45fvi99n90x6p9i4cs1lmzby6cb73-postgresql-15.19/include/internal -D_GNU_SOURCE -I/nix/store/p17klc3qq4nl9ihfwqfpi8cnqvcf92xz-libxml2-2.15.1-dev/include/libxml2 -I/nix/store/mglbi4dy4kpx7v1dcgf6iincp5x38hsc-lz4-1.10.0-dev/include -I/nix/store/g41q9md9rdcr3lkydi6f8zd6fza3h1q4-zstd-1.5.7-dev/include -I/nix/store/n2vnr7ycfk6midbzxcwd28qj3bgb50cz-icu4c-75.1-dev/include -c -o src/core.o src/core.c337 > gcc -Wall -Wmissing-prototypes -Wpointer-arith -Wdeclaration-after-statement -Werror=vla -Wendif-labels -Wmissing-format-attribute -Wimplicit-fallthrough=3 -Wcast-function-type -Wformat-security -fno-strict-aliasing -fwrapv -fexcess-precision=standard -Wno-deprecated-non-prototype -Wno-format-truncation -Wno-stringop-truncation -g -O2 -std=gnu17 -std=c11 -Wextra -Wall -Werror -Wno-declaration-after-statement -Wno-vla -Wno-long-long -Wmissing-variable-declarations -fPIC -DEXTVERSION=\"0.19.5\" -I. -I./ -I/nix/store/48l45fvi99n90x6p9i4cs1lmzby6cb73-postgresql-15.19/include/server -I/nix/store/48l45fvi99n90x6p9i4cs1lmzby6cb73-postgresql-15.19/include/internal -D_GNU_SOURCE -I/nix/store/p17klc3qq4nl9ihfwqfpi8cnqvcf92xz-libxml2-2.15.1-dev/include/libxml2 -I/nix/store/mglbi4dy4kpx7v1dcgf6iincp5x38hsc-lz4-1.10.0-dev/include -I/nix/store/g41q9md9rdcr3lkydi6f8zd6fza3h1q4-zstd-1.5.7-dev/include -I/nix/store/n2vnr7ycfk6midbzxcwd28qj3bgb50cz-icu4c-75.1-dev/include -c -o src/errors.o src/errors.c338 > gcc -Wall -Wmissing-prototypes -Wpointer-arith -Wdeclaration-after-statement -Werror=vla -Wendif-labels -Wmissing-format-attribute -Wimplicit-fallthrough=3 -Wcast-function-type -Wformat-security -fno-strict-aliasing -fwrapv -fexcess-precision=standard -Wno-deprecated-non-prototype -Wno-format-truncation -Wno-stringop-truncation -g -O2 -std=gnu17 -std=c11 -Wextra -Wall -Werror -Wno-declaration-after-statement -Wno-vla -Wno-long-long -Wmissing-variable-declarations -fPIC -DEXTVERSION=\"0.19.5\" -I. -I./ -I/nix/store/48l45fvi99n90x6p9i4cs1lmzby6cb73-postgresql-15.19/include/server -I/nix/store/48l45fvi99n90x6p9i4cs1lmzby6cb73-postgresql-15.19/include/internal -D_GNU_SOURCE -I/nix/store/p17klc3qq4nl9ihfwqfpi8cnqvcf92xz-libxml2-2.15.1-dev/include/libxml2 -I/nix/store/mglbi4dy4kpx7v1dcgf6iincp5x38hsc-lz4-1.10.0-dev/include -I/nix/store/g41q9md9rdcr3lkydi6f8zd6fza3h1q4-zstd-1.5.7-dev/include -I/nix/store/n2vnr7ycfk6midbzxcwd28qj3bgb50cz-icu4c-75.1-dev/include -c -o src/event.o src/event.c339 > In file included from /nix/store/jviasb44hibgh09829gbmbssbz2jjnhz-curl-8.17.0-dev/include/curl/curl.h:3333,340 > from /nix/store/jviasb44hibgh09829gbmbssbz2jjnhz-curl-8.17.0-dev/include/curl/multi.h:51,341 > from src/event.h:4,342 > from src/event.c:6:343 > /nix/store/jviasb44hibgh09829gbmbssbz2jjnhz-curl-8.17.0-dev/include/curl/multi.h:429:23: error: expected identifier or '(' before '__extension__'344 > 429 | CURL_EXTERN CURLMcode curl_multi_setopt(CURLM *multi_handle,345 > | ^~~~~~~~~~~~~~~~~346 > /nix/store/jviasb44hibgh09829gbmbssbz2jjnhz-curl-8.17.0-dev/include/curl/multi.h:429:23: error: expected identifier or '(' before ')' token347 > 429 | CURL_EXTERN CURLMcode curl_multi_setopt(CURLM *multi_handle,348 > | ^~~~~~~~~~~~~~~~~349 > make: *** [<builtin>: src/event.o] Error 1350 For full logs, run:351 nix log /nix/store/7iq4z475k625nsn9wc9nf4vxa7x1f1qd-pg_net-0.19.5.drv352error: Cannot build '/nix/store/7iq4z475k625nsn9wc9nf4vxa7x1f1qd-pg_net-0.19.5.drv'.353 Reason: builder failed with exit code 1.354 Output paths:355 /nix/store/mx90q334pqf6iwkyb9vk1wzl5nhmqmiv-pg_net-0.19.5356error: build of '/nix/store/nwcnf7x9i2zdx48936w9ixsnxzhbab16-pg_net-0.20.0.drv' on 'ssh-ng://nixbot-remote-build@78.232.36.247' failed: Cannot build '/nix/store/nwcnf7x9i2zdx48936w9ixsnxzhbab16-pg_net-0.20.0.drv'.357 Reason: builder failed with exit code 2.358 Output paths:359 /nix/store/5abg792kgyfqqg3w6nh6wfm1jallf5hq-pg_net-0.20.0360 Last 22 log lines:361 > Running phase: unpackPhase362 > unpacking source archive /nix/store/3783i7yhcfqnyv5ndli22gcr11ap151m-source363 > source root is source364 > Running phase: patchPhase365 > Running phase: updateAutotoolsGnuConfigScriptsPhase366 > Running phase: configurePhase367 > no configure script, doing nothing368 > Running phase: buildPhase369 > gcc -Wall -Wmissing-prototypes -Wpointer-arith -Wdeclaration-after-statement -Werror=vla -Wendif-labels -Wmissing-format-attribute -Wimplicit-fallthrough=3 -Wcast-function-type -Wformat-security -fno-strict-aliasing -fwrapv -fexcess-precision=standard -Wno-deprecated-non-prototype -Wno-format-truncation -Wno-stringop-truncation -g -O2 -std=gnu17 -std=c11 -Wextra -Wall -Werror -Wno-declaration-after-statement -Wno-vla -Wno-long-long -Wmissing-variable-declarations -fPIC -DEXTVERSION=\"0.20.0\" -I. -I./ -I/nix/store/48l45fvi99n90x6p9i4cs1lmzby6cb73-postgresql-15.19/include/server -I/nix/store/48l45fvi99n90x6p9i4cs1lmzby6cb73-postgresql-15.19/include/internal -D_GNU_SOURCE -I/nix/store/p17klc3qq4nl9ihfwqfpi8cnqvcf92xz-libxml2-2.15.1-dev/include/libxml2 -I/nix/store/mglbi4dy4kpx7v1dcgf6iincp5x38hsc-lz4-1.10.0-dev/include -I/nix/store/g41q9md9rdcr3lkydi6f8zd6fza3h1q4-zstd-1.5.7-dev/include -I/nix/store/n2vnr7ycfk6midbzxcwd28qj3bgb50cz-icu4c-75.1-dev/include -c -o src/core.o src/core.c370 > gcc -Wall -Wmissing-prototypes -Wpointer-arith -Wdeclaration-after-statement -Werror=vla -Wendif-labels -Wmissing-format-attribute -Wimplicit-fallthrough=3 -Wcast-function-type -Wformat-security -fno-strict-aliasing -fwrapv -fexcess-precision=standard -Wno-deprecated-non-prototype -Wno-format-truncation -Wno-stringop-truncation -g -O2 -std=gnu17 -std=c11 -Wextra -Wall -Werror -Wno-declaration-after-statement -Wno-vla -Wno-long-long -Wmissing-variable-declarations -fPIC -DEXTVERSION=\"0.20.0\" -I. -I./ -I/nix/store/48l45fvi99n90x6p9i4cs1lmzby6cb73-postgresql-15.19/include/server -I/nix/store/48l45fvi99n90x6p9i4cs1lmzby6cb73-postgresql-15.19/include/internal -D_GNU_SOURCE -I/nix/store/p17klc3qq4nl9ihfwqfpi8cnqvcf92xz-libxml2-2.15.1-dev/include/libxml2 -I/nix/store/mglbi4dy4kpx7v1dcgf6iincp5x38hsc-lz4-1.10.0-dev/include -I/nix/store/g41q9md9rdcr3lkydi6f8zd6fza3h1q4-zstd-1.5.7-dev/include -I/nix/store/n2vnr7ycfk6midbzxcwd28qj3bgb50cz-icu4c-75.1-dev/include -c -o src/errors.o src/errors.c371 > gcc -Wall -Wmissing-prototypes -Wpointer-arith -Wdeclaration-after-statement -Werror=vla -Wendif-labels -Wmissing-format-attribute -Wimplicit-fallthrough=3 -Wcast-function-type -Wformat-security -fno-strict-aliasing -fwrapv -fexcess-precision=standard -Wno-deprecated-non-prototype -Wno-format-truncation -Wno-stringop-truncation -g -O2 -std=gnu17 -std=c11 -Wextra -Wall -Werror -Wno-declaration-after-statement -Wno-vla -Wno-long-long -Wmissing-variable-declarations -fPIC -DEXTVERSION=\"0.20.0\" -I. -I./ -I/nix/store/48l45fvi99n90x6p9i4cs1lmzby6cb73-postgresql-15.19/include/server -I/nix/store/48l45fvi99n90x6p9i4cs1lmzby6cb73-postgresql-15.19/include/internal -D_GNU_SOURCE -I/nix/store/p17klc3qq4nl9ihfwqfpi8cnqvcf92xz-libxml2-2.15.1-dev/include/libxml2 -I/nix/store/mglbi4dy4kpx7v1dcgf6iincp5x38hsc-lz4-1.10.0-dev/include -I/nix/store/g41q9md9rdcr3lkydi6f8zd6fza3h1q4-zstd-1.5.7-dev/include -I/nix/store/n2vnr7ycfk6midbzxcwd28qj3bgb50cz-icu4c-75.1-dev/include -c -o src/event.o src/event.c372 > In file included from /nix/store/jviasb44hibgh09829gbmbssbz2jjnhz-curl-8.17.0-dev/include/curl/curl.h:3333,373 > from /nix/store/jviasb44hibgh09829gbmbssbz2jjnhz-curl-8.17.0-dev/include/curl/multi.h:51,374 > from src/event.h:4,375 > from src/event.c:6:376 > /nix/store/jviasb44hibgh09829gbmbssbz2jjnhz-curl-8.17.0-dev/include/curl/multi.h:429:23: error: expected identifier or '(' before '__extension__'377 > 429 | CURL_EXTERN CURLMcode curl_multi_setopt(CURLM *multi_handle,378 > | ^~~~~~~~~~~~~~~~~379 > /nix/store/jviasb44hibgh09829gbmbssbz2jjnhz-curl-8.17.0-dev/include/curl/multi.h:429:23: error: expected identifier or '(' before ')' token380 > 429 | CURL_EXTERN CURLMcode curl_multi_setopt(CURLM *multi_handle,381 > | ^~~~~~~~~~~~~~~~~382 > make: *** [<builtin>: src/event.o] Error 1383 For full logs, run:384 nix log /nix/store/nwcnf7x9i2zdx48936w9ixsnxzhbab16-pg_net-0.20.0.drv385error: Cannot build '/nix/store/nwcnf7x9i2zdx48936w9ixsnxzhbab16-pg_net-0.20.0.drv'.386 Reason: builder failed with exit code 1.387 Output paths:388 /nix/store/5abg792kgyfqqg3w6nh6wfm1jallf5hq-pg_net-0.20.0389error: build of '/nix/store/yf5z0qi17vprkjz68rqyp804sx929g9n-pg_net-0.19.5.drv' on 'ssh-ng://nixbot-remote-build@78.232.36.247' failed: Cannot build '/nix/store/yf5z0qi17vprkjz68rqyp804sx929g9n-pg_net-0.19.5.drv'.390 Reason: builder failed with exit code 2.391 Output paths:392 /nix/store/910sp8g3bfhhfdcqhihd5al828k3839f-pg_net-0.19.5393 Last 22 log lines:394 > Running phase: unpackPhase395 > unpacking source archive /nix/store/5zgdqy3bz93jyn79pizxc1hks0cdcadw-source396 > source root is source397 > Running phase: patchPhase398 > Running phase: updateAutotoolsGnuConfigScriptsPhase399 > Running phase: configurePhase400 > no configure script, doing nothing401 > Running phase: buildPhase402 > gcc -Wall -Wmissing-prototypes -Wpointer-arith -Wdeclaration-after-statement -Werror=vla -Wendif-labels -Wmissing-format-attribute -Wimplicit-fallthrough=3 -Wcast-function-type -Wshadow=compatible-local -Wformat-security -fno-strict-aliasing -fwrapv -fexcess-precision=standard -Wno-format-truncation -Wno-stringop-truncation -g -O2 -std=c11 -Wextra -Wall -Werror -Wno-declaration-after-statement -Wno-vla -Wno-long-long -Wmissing-variable-declarations -fPIC -fvisibility=hidden -DEXTVERSION=\"0.19.5\" -I. -I./ -I/nix/store/9q4p23a2y63xn8safzzn6lbn07bnkshs-postgresql-17.11/include/server -I/nix/store/9q4p23a2y63xn8safzzn6lbn07bnkshs-postgresql-17.11/include/internal -D_GNU_SOURCE -I/nix/store/p17klc3qq4nl9ihfwqfpi8cnqvcf92xz-libxml2-2.15.1-dev/include/libxml2 -I/nix/store/mglbi4dy4kpx7v1dcgf6iincp5x38hsc-lz4-1.10.0-dev/include -I/nix/store/g41q9md9rdcr3lkydi6f8zd6fza3h1q4-zstd-1.5.7-dev/include -I/nix/store/n2vnr7ycfk6midbzxcwd28qj3bgb50cz-icu4c-75.1-dev/include -c -o src/core.o src/core.c403 > gcc -Wall -Wmissing-prototypes -Wpointer-arith -Wdeclaration-after-statement -Werror=vla -Wendif-labels -Wmissing-format-attribute -Wimplicit-fallthrough=3 -Wcast-function-type -Wshadow=compatible-local -Wformat-security -fno-strict-aliasing -fwrapv -fexcess-precision=standard -Wno-format-truncation -Wno-stringop-truncation -g -O2 -std=c11 -Wextra -Wall -Werror -Wno-declaration-after-statement -Wno-vla -Wno-long-long -Wmissing-variable-declarations -fPIC -fvisibility=hidden -DEXTVERSION=\"0.19.5\" -I. -I./ -I/nix/store/9q4p23a2y63xn8safzzn6lbn07bnkshs-postgresql-17.11/include/server -I/nix/store/9q4p23a2y63xn8safzzn6lbn07bnkshs-postgresql-17.11/include/internal -D_GNU_SOURCE -I/nix/store/p17klc3qq4nl9ihfwqfpi8cnqvcf92xz-libxml2-2.15.1-dev/include/libxml2 -I/nix/store/mglbi4dy4kpx7v1dcgf6iincp5x38hsc-lz4-1.10.0-dev/include -I/nix/store/g41q9md9rdcr3lkydi6f8zd6fza3h1q4-zstd-1.5.7-dev/include -I/nix/store/n2vnr7ycfk6midbzxcwd28qj3bgb50cz-icu4c-75.1-dev/include -c -o src/errors.o src/errors.c404 > gcc -Wall -Wmissing-prototypes -Wpointer-arith -Wdeclaration-after-statement -Werror=vla -Wendif-labels -Wmissing-format-attribute -Wimplicit-fallthrough=3 -Wcast-function-type -Wshadow=compatible-local -Wformat-security -fno-strict-aliasing -fwrapv -fexcess-precision=standard -Wno-format-truncation -Wno-stringop-truncation -g -O2 -std=c11 -Wextra -Wall -Werror -Wno-declaration-after-statement -Wno-vla -Wno-long-long -Wmissing-variable-declarations -fPIC -fvisibility=hidden -DEXTVERSION=\"0.19.5\" -I. -I./ -I/nix/store/9q4p23a2y63xn8safzzn6lbn07bnkshs-postgresql-17.11/include/server -I/nix/store/9q4p23a2y63xn8safzzn6lbn07bnkshs-postgresql-17.11/include/internal -D_GNU_SOURCE -I/nix/store/p17klc3qq4nl9ihfwqfpi8cnqvcf92xz-libxml2-2.15.1-dev/include/libxml2 -I/nix/store/mglbi4dy4kpx7v1dcgf6iincp5x38hsc-lz4-1.10.0-dev/include -I/nix/store/g41q9md9rdcr3lkydi6f8zd6fza3h1q4-zstd-1.5.7-dev/include -I/nix/store/n2vnr7ycfk6midbzxcwd28qj3bgb50cz-icu4c-75.1-dev/include -c -o src/event.o src/event.c405 > In file included from /nix/store/jviasb44hibgh09829gbmbssbz2jjnhz-curl-8.17.0-dev/include/curl/curl.h:3333,406 > from /nix/store/jviasb44hibgh09829gbmbssbz2jjnhz-curl-8.17.0-dev/include/curl/multi.h:51,407 > from src/event.h:4,408 > from src/event.c:6:409 > /nix/store/jviasb44hibgh09829gbmbssbz2jjnhz-curl-8.17.0-dev/include/curl/multi.h:429:23: error: expected identifier or '(' before '__extension__'410 > 429 | CURL_EXTERN CURLMcode curl_multi_setopt(CURLM *multi_handle,411 > | ^~~~~~~~~~~~~~~~~412 > /nix/store/jviasb44hibgh09829gbmbssbz2jjnhz-curl-8.17.0-dev/include/curl/multi.h:429:23: error: expected identifier or '(' before ')' token413 > 429 | CURL_EXTERN CURLMcode curl_multi_setopt(CURLM *multi_handle,414 > | ^~~~~~~~~~~~~~~~~415 > make: *** [<builtin>: src/event.o] Error 1416 For full logs, run:417 nix log /nix/store/yf5z0qi17vprkjz68rqyp804sx929g9n-pg_net-0.19.5.drv418error: Cannot build '/nix/store/yf5z0qi17vprkjz68rqyp804sx929g9n-pg_net-0.19.5.drv'.419 Reason: builder failed with exit code 1.420 Output paths:421 /nix/store/910sp8g3bfhhfdcqhihd5al828k3839f-pg_net-0.19.5422error: build of '/nix/store/a0ldx82cv1chkbdks86c8mjp8ps4lfgn-pg_net-0.20.0.drv' on 'ssh-ng://nixbot-remote-build@78.232.36.247' failed: Cannot build '/nix/store/a0ldx82cv1chkbdks86c8mjp8ps4lfgn-pg_net-0.20.0.drv'.423 Reason: builder failed with exit code 2.424 Output paths:425 /nix/store/j9hxarpn08mgqpwavw7wdypm8adf921z-pg_net-0.20.0426 Last 22 log lines:427 > Running phase: unpackPhase428 > unpacking source archive /nix/store/3783i7yhcfqnyv5ndli22gcr11ap151m-source429 > source root is source430 > Running phase: patchPhase431 > Running phase: updateAutotoolsGnuConfigScriptsPhase432 > Running phase: configurePhase433 > no configure script, doing nothing434 > Running phase: buildPhase435 > gcc -Wall -Wmissing-prototypes -Wpointer-arith -Wdeclaration-after-statement -Werror=vla -Wendif-labels -Wmissing-format-attribute -Wimplicit-fallthrough=3 -Wcast-function-type -Wshadow=compatible-local -Wformat-security -fno-strict-aliasing -fwrapv -fexcess-precision=standard -Wno-format-truncation -Wno-stringop-truncation -moutline-atomics -g -O2 -std=c11 -Wextra -Wall -Werror -Wno-declaration-after-statement -Wno-vla -Wno-long-long -Wmissing-variable-declarations -fPIC -fvisibility=hidden -DEXTVERSION=\"0.20.0\" -I. -I./ -I/nix/store/wq2kfr0rkb0hdmf1iwi3mi8pxycakzmq-postgresql-17_22/include/server -I/nix/store/wq2kfr0rkb0hdmf1iwi3mi8pxycakzmq-postgresql-17_22/include/internal -D_GNU_SOURCE -I/nix/store/p17klc3qq4nl9ihfwqfpi8cnqvcf92xz-libxml2-2.15.1-dev/include/libxml2 -I/nix/store/mglbi4dy4kpx7v1dcgf6iincp5x38hsc-lz4-1.10.0-dev/include -I/nix/store/g41q9md9rdcr3lkydi6f8zd6fza3h1q4-zstd-1.5.7-dev/include -I/nix/store/n2vnr7ycfk6midbzxcwd28qj3bgb50cz-icu4c-75.1-dev/include -c -o src/core.o src/core.c436 > gcc -Wall -Wmissing-prototypes -Wpointer-arith -Wdeclaration-after-statement -Werror=vla -Wendif-labels -Wmissing-format-attribute -Wimplicit-fallthrough=3 -Wcast-function-type -Wshadow=compatible-local -Wformat-security -fno-strict-aliasing -fwrapv -fexcess-precision=standard -Wno-format-truncation -Wno-stringop-truncation -moutline-atomics -g -O2 -std=c11 -Wextra -Wall -Werror -Wno-declaration-after-statement -Wno-vla -Wno-long-long -Wmissing-variable-declarations -fPIC -fvisibility=hidden -DEXTVERSION=\"0.20.0\" -I. -I./ -I/nix/store/wq2kfr0rkb0hdmf1iwi3mi8pxycakzmq-postgresql-17_22/include/server -I/nix/store/wq2kfr0rkb0hdmf1iwi3mi8pxycakzmq-postgresql-17_22/include/internal -D_GNU_SOURCE -I/nix/store/p17klc3qq4nl9ihfwqfpi8cnqvcf92xz-libxml2-2.15.1-dev/include/libxml2 -I/nix/store/mglbi4dy4kpx7v1dcgf6iincp5x38hsc-lz4-1.10.0-dev/include -I/nix/store/g41q9md9rdcr3lkydi6f8zd6fza3h1q4-zstd-1.5.7-dev/include -I/nix/store/n2vnr7ycfk6midbzxcwd28qj3bgb50cz-icu4c-75.1-dev/include -c -o src/errors.o src/errors.c437 > gcc -Wall -Wmissing-prototypes -Wpointer-arith -Wdeclaration-after-statement -Werror=vla -Wendif-labels -Wmissing-format-attribute -Wimplicit-fallthrough=3 -Wcast-function-type -Wshadow=compatible-local -Wformat-security -fno-strict-aliasing -fwrapv -fexcess-precision=standard -Wno-format-truncation -Wno-stringop-truncation -moutline-atomics -g -O2 -std=c11 -Wextra -Wall -Werror -Wno-declaration-after-statement -Wno-vla -Wno-long-long -Wmissing-variable-declarations -fPIC -fvisibility=hidden -DEXTVERSION=\"0.20.0\" -I. -I./ -I/nix/store/wq2kfr0rkb0hdmf1iwi3mi8pxycakzmq-postgresql-17_22/include/server -I/nix/store/wq2kfr0rkb0hdmf1iwi3mi8pxycakzmq-postgresql-17_22/include/internal -D_GNU_SOURCE -I/nix/store/p17klc3qq4nl9ihfwqfpi8cnqvcf92xz-libxml2-2.15.1-dev/include/libxml2 -I/nix/store/mglbi4dy4kpx7v1dcgf6iincp5x38hsc-lz4-1.10.0-dev/include -I/nix/store/g41q9md9rdcr3lkydi6f8zd6fza3h1q4-zstd-1.5.7-dev/include -I/nix/store/n2vnr7ycfk6midbzxcwd28qj3bgb50cz-icu4c-75.1-dev/include -c -o src/event.o src/event.c438 > In file included from /nix/store/jviasb44hibgh09829gbmbssbz2jjnhz-curl-8.17.0-dev/include/curl/curl.h:3333,439 > from /nix/store/jviasb44hibgh09829gbmbssbz2jjnhz-curl-8.17.0-dev/include/curl/multi.h:51,440 > from src/event.h:4,441 > from src/event.c:6:442 > /nix/store/jviasb44hibgh09829gbmbssbz2jjnhz-curl-8.17.0-dev/include/curl/multi.h:429:23: error: expected identifier or '(' before '__extension__'443 > 429 | CURL_EXTERN CURLMcode curl_multi_setopt(CURLM *multi_handle,444 > | ^~~~~~~~~~~~~~~~~445 > /nix/store/jviasb44hibgh09829gbmbssbz2jjnhz-curl-8.17.0-dev/include/curl/multi.h:429:23: error: expected identifier or '(' before ')' token446 > 429 | CURL_EXTERN CURLMcode curl_multi_setopt(CURLM *multi_handle,447 > | ^~~~~~~~~~~~~~~~~448 > make: *** [<builtin>: src/event.o] Error 1449 For full logs, run:450 nix log /nix/store/a0ldx82cv1chkbdks86c8mjp8ps4lfgn-pg_net-0.20.0.drv451error: Cannot build '/nix/store/a0ldx82cv1chkbdks86c8mjp8ps4lfgn-pg_net-0.20.0.drv'.452 Reason: builder failed with exit code 1.453 Output paths:454 /nix/store/j9hxarpn08mgqpwavw7wdypm8adf921z-pg_net-0.20.0455error: Cannot build '/nix/store/vvs47f973jig6lflvm7cidm6m20glpy5-pg_net.drv'.456 Reason: 4 dependencies failed.457 Output paths:458 /nix/store/b0bs0di9wnr2lphh29rb3cyghbrpflly-pg_net459error: Cannot build '/nix/store/3va8cnvmsy7yy6484xp00h00q2782js6-postgresql-orioledb-17-pg_net.drv'.460 Reason: 1 dependency failed.461 Output paths:462 /nix/store/yzn3jb9zwsz13s5lany0rmm1m2p16wdj-postgresql-orioledb-17-pg_net463error: Cannot build '/nix/store/5j4p6hdzsa07nlnxfsdpr247idvlhsys-postgresql-configfile-check.drv'.464 Reason: 1 dependency failed.465 Output paths:466 /nix/store/y6shxr3g3mlk99nxikq5cib9nvglascl-postgresql-configfile-check467error: Cannot build '/nix/store/d1n9y6glfg776zp45dqfa1ryrwrlfknf-system-path.drv'.468 Reason: 1 dependency failed.469 Output paths:470 /nix/store/mzfjvwxgwsf7izp9vq7hcffa55h8d0lq-system-path471error: Cannot build '/nix/store/35if5xjxvpzcjkxpfizsmkirpk7jgg4s-unit-postgresql-setup.service.drv'.472 Reason: 1 dependency failed.473 Output paths:474 /nix/store/a63ahp09j5zdkhyds4aphmrciavd629l-unit-postgresql-setup.service475error: Cannot build '/nix/store/bk1xa15q19dfv5hp0c08k5h5qg46vd07-unit-postgresql.service.drv'.476 Reason: 1 dependency failed.477 Output paths:478 /nix/store/5xyxbbf85xn7r6s4jzpyq4qxl3inxpiv-unit-postgresql.service479error: Cannot build '/nix/store/36anhgawm3wlfpxkrxb4i7sc5zw75cg0-dbus-1.drv'.480 Reason: 1 dependency failed.481 Output paths:482 /nix/store/3lqi77n89jdpm15w3i8p233b4cysnp52-dbus-1483error: Cannot build '/nix/store/rni3fjyl9gb5zpb88kfvnic52h36w8xh-X-Restart-Triggers-dbus.drv'.484 Reason: 1 dependency failed.485 Output paths:486 /nix/store/d63n81dfpf8i88vr8p842bb07fvg06y8-X-Restart-Triggers-dbus487error: Cannot build '/nix/store/17pcpb1y2cq8f6k8fbhjxfsy1gl66563-unit-dbus.service.drv'.488 Reason: 1 dependency failed.489 Output paths:490 /nix/store/h5qv3lb6j99ahp4znakzpjwmljvipi4r-unit-dbus.service491error: Cannot build '/nix/store/s71669b8p3al15pl3cv5pgvd2mlr2lyq-unit-dbus.service.drv'.492 Reason: 1 dependency failed.493 Output paths:494 /nix/store/df6lvn66nhziwm0y3lrzmagar6zmdz21-unit-dbus.service495error: Cannot build '/nix/store/cqv29j3d8l7jxw83zb1wh5zaaa1ggpm5-system-units.drv'.496 Reason: 3 dependencies failed.497 Output paths:498 /nix/store/5jrlk7fw0cm68qpak78crkisnnwjizfz-system-units499error: Cannot build '/nix/store/jkxxp5c8ywln8bxc00lb3ww3767309b1-user-units.drv'.500 Reason: 1 dependency failed.501 Output paths:502 /nix/store/1cr5capxwamkl5njvm6zm1ax29hh5lly-user-units503error: Cannot build '/nix/store/i7mhymcwfr6v6rl8id080bx9qw7dk1sq-etc.drv'.504 Reason: 4 dependencies failed.505 Output paths:506 /nix/store/43smmh58ww8iq829wk4s8ay2scv5sq4q-etc507error: Cannot build '/nix/store/qd6hhvs3dzvdgi367972d9402s2hb7c1-activate.drv'.508 Reason: 1 dependency failed.509 Output paths:510 /nix/store/cnp4sbxs4sscps7jkny9nz2m5qzc4gq6-activate511error: Cannot build '/nix/store/bpv9n6bl39932kj5fp4i6j9vbm4m35wh-nixos-system-server-test.drv'.512 Reason: 4 dependencies failed.513 Output paths:514 /nix/store/hbwwa2cjd9fvcp2il5cjqhzcdfd4592s-nixos-system-server-test515error: build of '/nix/store/b1pyvgjyn940h95bbnsp15qmb0qli5gd-pg_net-0.20.0.drv' on 'ssh-ng://nixbot-remote-build@78.232.36.247' failed: Cannot build '/nix/store/b1pyvgjyn940h95bbnsp15qmb0qli5gd-pg_net-0.20.0.drv'.516 Reason: builder failed with exit code 2.517 Output paths:518 /nix/store/r13hlgma95j03wagv3kcyfxmdmxs0dx6-pg_net-0.20.0519 Last 22 log lines:520 > Running phase: unpackPhase521 > unpacking source archive /nix/store/3783i7yhcfqnyv5ndli22gcr11ap151m-source522 > source root is source523 > Running phase: patchPhase524 > Running phase: updateAutotoolsGnuConfigScriptsPhase525 > Running phase: configurePhase526 > no configure script, doing nothing527 > Running phase: buildPhase528 > gcc -Wall -Wmissing-prototypes -Wpointer-arith -Wdeclaration-after-statement -Werror=vla -Wendif-labels -Wmissing-format-attribute -Wimplicit-fallthrough=3 -Wcast-function-type -Wshadow=compatible-local -Wformat-security -fno-strict-aliasing -fwrapv -fexcess-precision=standard -Wno-format-truncation -Wno-stringop-truncation -g -O2 -std=c11 -Wextra -Wall -Werror -Wno-declaration-after-statement -Wno-vla -Wno-long-long -Wmissing-variable-declarations -fPIC -fvisibility=hidden -DEXTVERSION=\"0.20.0\" -I. -I./ -I/nix/store/9q4p23a2y63xn8safzzn6lbn07bnkshs-postgresql-17.11/include/server -I/nix/store/9q4p23a2y63xn8safzzn6lbn07bnkshs-postgresql-17.11/include/internal -D_GNU_SOURCE -I/nix/store/p17klc3qq4nl9ihfwqfpi8cnqvcf92xz-libxml2-2.15.1-dev/include/libxml2 -I/nix/store/mglbi4dy4kpx7v1dcgf6iincp5x38hsc-lz4-1.10.0-dev/include -I/nix/store/g41q9md9rdcr3lkydi6f8zd6fza3h1q4-zstd-1.5.7-dev/include -I/nix/store/n2vnr7ycfk6midbzxcwd28qj3bgb50cz-icu4c-75.1-dev/include -c -o src/core.o src/core.c529 > gcc -Wall -Wmissing-prototypes -Wpointer-arith -Wdeclaration-after-statement -Werror=vla -Wendif-labels -Wmissing-format-attribute -Wimplicit-fallthrough=3 -Wcast-function-type -Wshadow=compatible-local -Wformat-security -fno-strict-aliasing -fwrapv -fexcess-precision=standard -Wno-format-truncation -Wno-stringop-truncation -g -O2 -std=c11 -Wextra -Wall -Werror -Wno-declaration-after-statement -Wno-vla -Wno-long-long -Wmissing-variable-declarations -fPIC -fvisibility=hidden -DEXTVERSION=\"0.20.0\" -I. -I./ -I/nix/store/9q4p23a2y63xn8safzzn6lbn07bnkshs-postgresql-17.11/include/server -I/nix/store/9q4p23a2y63xn8safzzn6lbn07bnkshs-postgresql-17.11/include/internal -D_GNU_SOURCE -I/nix/store/p17klc3qq4nl9ihfwqfpi8cnqvcf92xz-libxml2-2.15.1-dev/include/libxml2 -I/nix/store/mglbi4dy4kpx7v1dcgf6iincp5x38hsc-lz4-1.10.0-dev/include -I/nix/store/g41q9md9rdcr3lkydi6f8zd6fza3h1q4-zstd-1.5.7-dev/include -I/nix/store/n2vnr7ycfk6midbzxcwd28qj3bgb50cz-icu4c-75.1-dev/include -c -o src/errors.o src/errors.c530 > gcc -Wall -Wmissing-prototypes -Wpointer-arith -Wdeclaration-after-statement -Werror=vla -Wendif-labels -Wmissing-format-attribute -Wimplicit-fallthrough=3 -Wcast-function-type -Wshadow=compatible-local -Wformat-security -fno-strict-aliasing -fwrapv -fexcess-precision=standard -Wno-format-truncation -Wno-stringop-truncation -g -O2 -std=c11 -Wextra -Wall -Werror -Wno-declaration-after-statement -Wno-vla -Wno-long-long -Wmissing-variable-declarations -fPIC -fvisibility=hidden -DEXTVERSION=\"0.20.0\" -I. -I./ -I/nix/store/9q4p23a2y63xn8safzzn6lbn07bnkshs-postgresql-17.11/include/server -I/nix/store/9q4p23a2y63xn8safzzn6lbn07bnkshs-postgresql-17.11/include/internal -D_GNU_SOURCE -I/nix/store/p17klc3qq4nl9ihfwqfpi8cnqvcf92xz-libxml2-2.15.1-dev/include/libxml2 -I/nix/store/mglbi4dy4kpx7v1dcgf6iincp5x38hsc-lz4-1.10.0-dev/include -I/nix/store/g41q9md9rdcr3lkydi6f8zd6fza3h1q4-zstd-1.5.7-dev/include -I/nix/store/n2vnr7ycfk6midbzxcwd28qj3bgb50cz-icu4c-75.1-dev/include -c -o src/event.o src/event.c531 > In file included from /nix/store/jviasb44hibgh09829gbmbssbz2jjnhz-curl-8.17.0-dev/include/curl/curl.h:3333,532 > from /nix/store/jviasb44hibgh09829gbmbssbz2jjnhz-curl-8.17.0-dev/include/curl/multi.h:51,533 > from src/event.h:4,534 > from src/event.c:6:535 > /nix/store/jviasb44hibgh09829gbmbssbz2jjnhz-curl-8.17.0-dev/include/curl/multi.h:429:23: error: expected identifier or '(' before '__extension__'536 > 429 | CURL_EXTERN CURLMcode curl_multi_setopt(CURLM *multi_handle,537 > | ^~~~~~~~~~~~~~~~~538 > /nix/store/jviasb44hibgh09829gbmbssbz2jjnhz-curl-8.17.0-dev/include/curl/multi.h:429:23: error: expected identifier or '(' before ')' token539 > 429 | CURL_EXTERN CURLMcode curl_multi_setopt(CURLM *multi_handle,540 > | ^~~~~~~~~~~~~~~~~541 > make: *** [<builtin>: src/event.o] Error 1542 For full logs, run:543 nix log /nix/store/b1pyvgjyn940h95bbnsp15qmb0qli5gd-pg_net-0.20.0.drv544error: Cannot build '/nix/store/b1pyvgjyn940h95bbnsp15qmb0qli5gd-pg_net-0.20.0.drv'.545 Reason: builder failed with exit code 1.546 Output paths:547 /nix/store/r13hlgma95j03wagv3kcyfxmdmxs0dx6-pg_net-0.20.0548error: Cannot build '/nix/store/y02vszvrhs7b6kn8llgwzdmnmhqiymzk-pg_net.drv'.549 Reason: 4 dependencies failed.550 Output paths:551 /nix/store/279d7pzxppyz66f6rw8fplifvz9b6s0s-pg_net552error: Cannot build '/nix/store/ihfd6321rkb08ldslxkvkkkryxzhcnaj-postgresql-17-pg_net.drv'.553 Reason: 1 dependency failed.554 Output paths:555 /nix/store/gni40r9n604pwl75wi7h1x9wsmd77lb7-postgresql-17-pg_net556error: Cannot build '/nix/store/9lhfy5qmzar65jprk9kp04vka42mwbg6-postgresql-configfile-check.drv'.557 Reason: 1 dependency failed.558 Output paths:559 /nix/store/iqcsxaw4xm7azd6zs2688xngpf5pdb59-postgresql-configfile-check560error: Cannot build '/nix/store/x35zc9l5qndwmq9009gjij92i6lzshdz-system-path.drv'.561 Reason: 1 dependency failed.562 Output paths:563 /nix/store/9nb2dwa7jj1s2i02f19mfp4gw3d0mjw5-system-path564error: Cannot build '/nix/store/k2kz5ircvn9fscsg528ila2scfqv973k-unit-postgresql-setup.service.drv'.565 Reason: 1 dependency failed.566 Output paths:567 /nix/store/c7rvn11cvfgs0lv6kgqp559yz0mk5lbi-unit-postgresql-setup.service568error: Cannot build '/nix/store/0lf4x0my2i4wyx9lq8f4kahvc271sspj-unit-postgresql.service.drv'.569 Reason: 1 dependency failed.570 Output paths:571 /nix/store/fldwidzyrjsq0ahrpfskhyihz1mfssb7-unit-postgresql.service572error: Cannot build '/nix/store/41abwlsxl1wxvzy03xz9lkrns89lz7hg-dbus-1.drv'.573 Reason: 1 dependency failed.574 Output paths:575 /nix/store/87snbry9wchjqdg2v9zng4x40bzq9z8f-dbus-1576error: Cannot build '/nix/store/xlnvqlilz2kbi4a1g8m2z6accgnc1piv-X-Restart-Triggers-dbus.drv'.577 Reason: 1 dependency failed.578 Output paths:579 /nix/store/8g0zsmavqll22r0hskfinpc8rs87lzf3-X-Restart-Triggers-dbus580error: Cannot build '/nix/store/1w7vlbiqj13ddykgllq80q4bcnsknfnv-unit-dbus.service.drv'.581 Reason: 1 dependency failed.582 Output paths:583 /nix/store/qhwhpd2mv0svskyr817q3c6hqmmaal2p-unit-dbus.service584error: Cannot build '/nix/store/5sn3my2gywmjx099kv88g93mf0rm027q-unit-dbus.service.drv'.585 Reason: 1 dependency failed.586 Output paths:587 /nix/store/1jwh2g48ywl4sazzdlfckh3fhag3rx3c-unit-dbus.service588error: Cannot build '/nix/store/kwf0zbd4a57rg54w7bk44nxsng0aq3rj-user-units.drv'.589 Reason: 1 dependency failed.590 Output paths:591 /nix/store/82jbh7hv8hsi61j65wzysknf10wa5ird-user-units592error: build of '/nix/store/rfdqkjkjdwz7ydrwlfn9cdy68zz9z6rf-pg_net-0.7.drv' on 'ssh-ng://nixbot-remote-build@78.232.36.247' failed: Cannot build '/nix/store/rfdqkjkjdwz7ydrwlfn9cdy68zz9z6rf-pg_net-0.7.drv'.593 Reason: builder failed with exit code 2.594 Output paths:595 /nix/store/yxd26zp7dvdq20sqsk13x0lk0bqd7j9i-pg_net-0.7596 Last 25 log lines:597 > | ^~~~~~~~~~~~~~598 > src/util.h:6:11: warning: call to 'Wcurl_easy_setopt_err_long' declared with attribute warning: curl_easy_setopt expects a long argument [-Wattribute-warning]599 > 6 | if (curl_easy_setopt(hdl, opt, prm) != CURLE_OK) \600 > | ^~~~~~~~~~~~~~~~601 > src/core.c:108:3: note: in expansion of macro 'CURL_EZ_SETOPT'602 > 108 | CURL_EZ_SETOPT(curl_ez_handle, CURLOPT_TIMEOUT_MS, timeout_milliseconds);603 > | ^~~~~~~~~~~~~~604 > src/util.h:6:11: warning: call to 'Wcurl_easy_setopt_err_long' declared with attribute warning: curl_easy_setopt expects a long argument [-Wattribute-warning]605 > 6 | if (curl_easy_setopt(hdl, opt, prm) != CURLE_OK) \606 > | ^~~~~~~~~~~~~~~~607 > src/core.c:110:3: note: in expansion of macro 'CURL_EZ_SETOPT'608 > 110 | CURL_EZ_SETOPT(curl_ez_handle, CURLOPT_FOLLOWLOCATION, true);609 > | ^~~~~~~~~~~~~~610 > gcc -Wall -Wmissing-prototypes -Wpointer-arith -Wdeclaration-after-statement -Werror=vla -Wendif-labels -Wmissing-format-attribute -Wimplicit-fallthrough=3 -Wcast-function-type -Wformat-security -fno-strict-aliasing -fwrapv -fexcess-precision=standard -Wno-deprecated-non-prototype -Wno-format-truncation -Wno-stringop-truncation -g -O2 -std=gnu17 -std=c11 -Werror -Wno-declaration-after-statement -fPIC -DEXTVERSION=\"0.13.0\" -I. -I./ -I/nix/store/48l45fvi99n90x6p9i4cs1lmzby6cb73-postgresql-15.19/include/server -I/nix/store/48l45fvi99n90x6p9i4cs1lmzby6cb73-postgresql-15.19/include/internal -D_GNU_SOURCE -I/nix/store/p17klc3qq4nl9ihfwqfpi8cnqvcf92xz-libxml2-2.15.1-dev/include/libxml2 -I/nix/store/mglbi4dy4kpx7v1dcgf6iincp5x38hsc-lz4-1.10.0-dev/include -I/nix/store/g41q9md9rdcr3lkydi6f8zd6fza3h1q4-zstd-1.5.7-dev/include -I/nix/store/n2vnr7ycfk6midbzxcwd28qj3bgb50cz-icu4c-75.1-dev/include -c -o src/event.o src/event.c611 > In file included from /nix/store/jviasb44hibgh09829gbmbssbz2jjnhz-curl-8.17.0-dev/include/curl/curl.h:3333,612 > from /nix/store/jviasb44hibgh09829gbmbssbz2jjnhz-curl-8.17.0-dev/include/curl/multi.h:51,613 > from src/event.h:4,614 > from src/event.c:6:615 > /nix/store/jviasb44hibgh09829gbmbssbz2jjnhz-curl-8.17.0-dev/include/curl/multi.h:429:23: error: expected identifier or '(' before '__extension__'616 > 429 | CURL_EXTERN CURLMcode curl_multi_setopt(CURLM *multi_handle,617 > | ^~~~~~~~~~~~~~~~~618 > /nix/store/jviasb44hibgh09829gbmbssbz2jjnhz-curl-8.17.0-dev/include/curl/multi.h:429:23: error: expected identifier or '(' before ')' token619 > 429 | CURL_EXTERN CURLMcode curl_multi_setopt(CURLM *multi_handle,620 > | ^~~~~~~~~~~~~~~~~621 > make: *** [<builtin>: src/event.o] Error 1622 For full logs, run:623 nix log /nix/store/rfdqkjkjdwz7ydrwlfn9cdy68zz9z6rf-pg_net-0.7.drv624error: Cannot build '/nix/store/rfdqkjkjdwz7ydrwlfn9cdy68zz9z6rf-pg_net-0.7.drv'.625 Reason: builder failed with exit code 1.626 Output paths:627 /nix/store/yxd26zp7dvdq20sqsk13x0lk0bqd7j9i-pg_net-0.7628error: Cannot build '/nix/store/q7ak647qv213m4vc4fnr43i09azs1b0p-pg_net.drv'.629 Reason: 5 dependencies failed.630 Output paths:631 /nix/store/9p2ykggx0qabaqhlslb35di6b0ypkcqn-pg_net632error: Cannot build '/nix/store/1a1qnr1vlfld9ccz74ha0a8azqdwjw88-postgresql-15-pg_net.drv'.633 Reason: 1 dependency failed.634 Output paths:635 /nix/store/35n6rwn98nl2802azslmm8n6z48zyv2q-postgresql-15-pg_net636error: Cannot build '/nix/store/drmwc4fv2sc972x5d9xhhx4v4747dd3l-postgresql-configfile-check.drv'.637 Reason: 1 dependency failed.638 Output paths:639 /nix/store/z2ps0ryl2rr1drwij6p55w42msazm742-postgresql-configfile-check640error: Cannot build '/nix/store/h4h3k2qrd28xwa33ynx57x9yvjjj055a-system-path.drv'.641 Reason: 1 dependency failed.642 Output paths:643 /nix/store/v5rq6hpmha3qn165n0lqz4ajyklb6l0p-system-path644error: Cannot build '/nix/store/iig751xbs970xdhbka47gkh27x0nc2y7-unit-postgresql-setup.service.drv'.645 Reason: 1 dependency failed.646 Output paths:647 /nix/store/vn5whj9na52xnd20kc8y34c745zhl8jp-unit-postgresql-setup.service648error: Cannot build '/nix/store/65pcag4cdsa8f7f9xy9l6pkgijhn13dp-unit-postgresql.service.drv'.649 Reason: 1 dependency failed.650 Output paths:651 /nix/store/yvr0z0b3ax2sazmcvvwb9claca97dbv0-unit-postgresql.service652error: Cannot build '/nix/store/pmmnrhp85bqx3abn8j5nv9491n3p53gr-unit-script-postgresql-migrate-start.drv'.653 Reason: 2 dependencies failed.654 Output paths:655 /nix/store/iyaj7dcqaxx5xxchbk52n0a02201rd57-unit-script-postgresql-migrate-start656error: Cannot build '/nix/store/l5vzbn3lwbrj1x2f6kvk2vmaf872x3q3-dbus-1.drv'.657 Reason: 1 dependency failed.658 Output paths:659 /nix/store/zygpyhz8p7gph681g9wl51zvprb2q9xd-dbus-1660error: Cannot build '/nix/store/4fnz4a1mxllv94wkgif96ldz5xf7n9bv-unit-postgresql-migrate.service.drv'.661 Reason: 1 dependency failed.662 Output paths:663 /nix/store/wmsw8jd0n56gqn8xzf8h59qcfc87pacs-unit-postgresql-migrate.service664error: Cannot build '/nix/store/rav6ifamvjw5zhdrbzc54950rhj4a1g2-X-Restart-Triggers-dbus.drv'.665 Reason: 1 dependency failed.666 Output paths:667 /nix/store/xma9ym31pfr5ihy5zzgba0wdxhzcbw6n-X-Restart-Triggers-dbus668error: Cannot build '/nix/store/x90y5fzqjfk2y17x68ghf3da7wwhhply-system-units.drv'.669 Reason: 4 dependencies failed.670 Output paths:671 /nix/store/5b10n53s61a0dqhykjyln4cd5q9xl4fd-system-units672error: Cannot build '/nix/store/n2frqfc1kylk2xbhqv3r4gj2vxxgvlfm-etc.drv'.673 Reason: 4 dependencies failed.674 Output paths:675 /nix/store/0hzna8kpnq6j9hv4dfkvbc7rj5i0kp4w-etc676error: Cannot build '/nix/store/9sbxqx3l25qlzl96sq7kwz6a6kljfgxq-unit-dbus.service.drv'.677 Reason: 1 dependency failed.678 Output paths:679 /nix/store/y397npq6yqxf1pgvncmydj9qhca0dah7-unit-dbus.service680error: Cannot build '/nix/store/hrd9nivqqfipa7wcch4navia6a8hpsa1-unit-dbus.service.drv'.681 Reason: 1 dependency failed.682 Output paths:683 /nix/store/xj9x9jgqiaw24xq859lf1ivmylm33da9-unit-dbus.service684error: Cannot build '/nix/store/ffrn2h8xhmqdx5wkyvfjsyf1vax0rg2y-activate.drv'.685 Reason: 1 dependency failed.686 Output paths:687 /nix/store/w3zx2dpk0nr9qcrjjg9b9hfci1mhlr48-activate688error: Cannot build '/nix/store/b2q4z0pa53l331dlcp0fry7kml8xqbmd-system-units.drv'.689 Reason: 3 dependencies failed.690 Output paths:691 /nix/store/bzgn4ppwjhx0i1kf75h05rhxhrpjjajg-system-units692error: Cannot build '/nix/store/fzv58jzvy8vydp9qv66p0rpimk7iafn0-user-units.drv'.693 Reason: 1 dependency failed.694 Output paths:695 /nix/store/17s2c96ydnh0358nndzxrxxc8q489gap-user-units696error: Cannot build '/nix/store/vlf5zj4lhvzfappa7mjiszcqs2z45cq4-etc.drv'.697 Reason: 4 dependencies failed.698 Output paths:699 /nix/store/cbx75czxv0c9jy084qyg2n2ymhh8sc6i-etc700error: Cannot build '/nix/store/57flrny3rq7rc9rv3h77kggv0hysfsgq-nixos-system-server-test.drv'.701 Reason: 4 dependencies failed.702 Output paths:703 /nix/store/5rqlnyvd5vqqv2b6hmbbggvn5c51h1cr-nixos-system-server-test704error: Cannot build '/nix/store/c0pw8adyfxl9h10h7i60clh6j4wp0ihv-activate.drv'.705 Reason: 1 dependency failed.706 Output paths:707 /nix/store/r0g3n1igqhcqnj9sy9wy5mqf94sspd32-activate708error: Cannot build '/nix/store/cr9gqp360aag74h0zxnby8lmrkakaa89-nixos-system-server-test.drv'.709 Reason: 6 dependencies failed.710 Output paths:711 /nix/store/2vxmmwayyngmn909nrwhvrb922ywxyz3-nixos-system-server-test712error: Cannot build '/nix/store/hva8a05prgcnig8fs0qfdgjb2qi2m851-closure-info.drv'.713 Reason: 1 dependency failed.714 Output paths:715 /nix/store/1bmapnfdzki8iykwk3mf3c03pfmh278p-closure-info716error: Cannot build '/nix/store/fl43w0ns5ahvwn1nfw1ijgy2dfvhdvw1-run-nixos-vm.drv'.717 Reason: 2 dependencies failed.718 Output paths:719 /nix/store/8943zpr8nncnf1lm9a5hv9xbisp7jnbk-run-nixos-vm720error: Cannot build '/nix/store/zchaivrvnd0znakz1wym2zdp5vpdn34m-nixos-vm.drv'.721 Reason: 2 dependencies failed.722 Output paths:723 /nix/store/fd49bcb4xx37f7wx9y7dan1mxm4p7n6q-nixos-vm724error: Cannot build '/nix/store/3pdfhngjis8zda7lpz818wcxasj06l9m-nixos-test-driver-pg_net.drv'.725 Reason: 5 dependencies failed.726 Output paths:727 /nix/store/inqnhvifp3plkkai8h15d3pgr3hsamji-nixos-test-driver-pg_net728error: Cannot build '/nix/store/0613kg0kjkzgjmnq823x9qcn51j4dq04-vm-test-run-pg_net.drv'.729 Reason: 1 dependency failed.730 Output paths:731 /nix/store/s960mas0bwsp43br83iwhxbmmyns1m26-vm-test-run-pg_net