setup
checks.aarch64-linux.ext-orioledb
· build #133
· raw
1these 171 derivations will be built:2 /nix/store/0cmixqwsz3vb82j49j1mhvyk8crg4dcw-wrappers-0.6.0.drv3 /nix/store/0i6b8yy32fc4mgfm75w94gw9ja033kw5-wrappers-0.5.5.drv4 /nix/store/h1vl8vpk154yppn5lcqms2680igi0mmj-postgis-3.3.2.drv5 /nix/store/2ylkw9crapb58vd5g0vj602jfyb1p3r6-postgis.drv6 /nix/store/58cinn47vbvwr1wxdkspmvi9cj27b07h-safeupdate-1.4.drv7 /nix/store/6c0mnd757hvxppfyrsf4cb1wgnbd4111-safeupdate.drv8 /nix/store/k4swwy7459wf558rbrraclsr4sjccz0h-pgmq-1.4.4.drv9 /nix/store/8zsadvm8mv18kpy4qy724ps2jlbsik0w-pgmq.drv10 /nix/store/4wk9vb1q3kdnhj8hsq8pwgbp82glwg9w-timescaledb-2.9.1.drv11 /nix/store/9wzj3wh6sczzk849dmjwvmnkshggakxp-timescaledb.drv12 /nix/store/2nmg9sxx50xmndps3714hbvwjyd5rqv0-vector-0.8.2.drv13 /nix/store/alajylsl9b90m65n0ps0mkbkw679x4sn-vector-0.6.2.drv14 /nix/store/jmilv9h5p0v4grgqnhfn22i7zl352ybh-vector-0.7.4.drv15 /nix/store/q3mdjvqpw4xbwcjy5y1ps1igxsjvx133-vector-0.7.0.drv16 /nix/store/v5dnr617av2jgk6kpddxbxxqjqgl5kzg-vector-0.8.0.drv17 /nix/store/z40s48rz55qgpw6g6wiqi68hkfas4h1l-vector-0.6.0.drv18 /nix/store/9zndhfzc45vrfn297g1hav7m6ba3rlzk-vector.drv19 /nix/store/c08rdgxba5n6zhyp78l8sd6fhnbc4a4c-pgsodium-3.1.7.drv20 /nix/store/hh2jpg5qdwgdwzi96qcay1a5ffhi0f4i-pgsodium-3.1.6.drv21 /nix/store/jwrjvb9m50v44sla4jpig83jab7zn17x-pgsodium-3.1.8.drv22 /nix/store/m1xdmpffkflwgdin5ljvfh72wxq5lxpx-pgsodium-3.1.5.drv23 /nix/store/a9laaq557mna86dm87lq3211xy5h2zyl-pgsodium.drv24 /nix/store/i0gq8yqxp5h7l782n2ki94b1d62m6zsg-plpgsql_check-2.2.drv25 /nix/store/q117a7mx5d5bzln8xg24fh1vfzq7bsz4-plpgsql_check-2.7.drv26 /nix/store/rj6qw8pwvr91cy6qyp8xibrw4arrpj9j-plpgsql_check-2.8.drv27 /nix/store/c782i897gj20c0r8bmphf8p6r5s5wdli-plpgsql_check.drv28 /nix/store/b139hl0gpc9icb6j6q28gl1chw7i9260-rum-1.3.drv29 /nix/store/csvzp35khfq15v5g275y14094s58v10k-rum.drv30 /nix/store/c2pcswnd4yfp02pas6a7grpm0fmk70wx-supabase_vault-0.3.1.drv31 /nix/store/jb3j93i6ljmvqkv5cnv3lh3d9zn4zcjz-supabase_vault-0.2.8.drv32 /nix/store/gc3nb7r1a8rbf6f8yf4zs2nnb65awkxq-supabase_vault.drv33 /nix/store/7inhp3jz4x6l1m2i6aa1w6bbb91r1hay-pgroonga-3.2.5.drv34 /nix/store/xim497rkcncpxb5vvyli3j4jnziyybgy-pgroonga-3.0.7.drv35 /nix/store/gdd3j67qcdibplv1d440a6gsix87s5xs-pgroonga.drv36 /nix/store/ihx5q75k74a4cqq4k9bwnl5yin262kq2-pgrouting-3.4.1.drv37 /nix/store/hf9dly2ryx969lw950ld454fqfa6c41r-pgrouting.drv38 /nix/store/82vdx9lfkbv67j79qzi9yzvqrj043w52-wal2json-2.6.drv39 /nix/store/iz713zhjyn0lym6ls12i9vxca9cxf4hi-wal2json.drv40 /nix/store/7lzcc5d36122752hpjb6lij6sc2ai2a0-plv8-3.1.5.drv41 /nix/store/87brzrl1nsm8z4my02aldnxd8fb0i69x-plv8-3.1.4.drv42 /nix/store/k6nh1vivj2dgh0jk2mpsiy4p5v6sjyzk-plv8.drv43 /nix/store/lhdnha0m1rqpv0cmivzv3s7znjmgxc14-plan_filter.drv44 /nix/store/0n0iaya9csx9by2pimrx1yglzw8dp4zs-pg_net-0.13.0.drv45 /nix/store/7iq4z475k625nsn9wc9nf4vxa7x1f1qd-pg_net-0.19.5.drv46 /nix/store/cfrc2vk3cgabx1447j2n7s3zxraq6395-pg_net-0.14.0.drv47 /nix/store/iwq28h7yniccm9ra8q6dc0wma0l6hnqn-pg_net-0.6.drv48 /nix/store/nw3d144zhshkgx1z66g9g2wg5829w36n-pg_net-0.7.1.drv49 /nix/store/nwcnf7x9i2zdx48936w9ixsnxzhbab16-pg_net-0.20.0.drv50 /nix/store/rfdqkjkjdwz7ydrwlfn9cdy68zz9z6rf-pg_net-0.7.drv51 /nix/store/whvqb38akl195470ks3jads9kmq2i9gj-pg_net-0.8.0.drv52 /nix/store/zy29jzcj1bsz7760wbmlg78czaddsrni-pg_net-0.20.3.drv53 /nix/store/q7ak647qv213m4vc4fnr43i09azs1b0p-pg_net.drv54 /nix/store/sxzi0qg4ingw35zkbi2pk2vfgxbq5k2a-pgtap.drv55 /nix/store/21s45rg3i2jfhdarxmqf3dr79allgdgh-wrappers-0.4.5.drv56 /nix/store/56j6z0f3g50m72cj7ynr22p9fdml79q9-wrappers-0.5.3.drv57 /nix/store/9m4hgq2s9z1cy1508wymdcl2n1w3ky5h-wrappers-0.6.2.drv58 /nix/store/f3b53aqd65czxnbbash43yraza54ds7k-wrappers-0.4.3.drv59 /nix/store/fpcwzjw9wdhbljjpcjlbz4w6236qzl70-wrappers-0.3.0.drv60 /nix/store/iimlppn24xgvgjvnm4xp8z9bxl4p4p1d-wrappers-0.4.1.drv61 /nix/store/l3ww3jfvj5l8bp25p66wrjziy8m0vi23-wrappers-0.5.0.drv62 /nix/store/ns9rs9anq0rsl3sh1rhxmqcsll7lkjd0-wrappers-0.5.6.drv63 /nix/store/nvjw377g2m07i1z93mngr72qhpjmafvy-wrappers-0.4.6.drv64 /nix/store/qzn17ml7z84zcmcw96j0z0f6m9j6y7qm-wrappers-0.5.4.drv65 /nix/store/xbhixx8nl4iifcfi17lpavbs9cxcg5ka-wrappers-0.6.1.drv66 /nix/store/y06jjr5k7hk7zs8gzilg4g50b184va6a-wrappers-0.4.2.drv67 /nix/store/y1qh08g7i9w1x2s10rq7ammigljy82kw-wrappers-0.4.4.drv68 /nix/store/z1yzqa9qzq4ri1f58lngsljs0abhgjz5-wrappers-0.5.7.drv69 /nix/store/xcq8s20l2ynk52356w6nqkdw7379h4g4-wrappers.drv70 /nix/store/3m1k34jx4kw90mcghzrp83c2dfhrwab8-pg_repack-1.5.1.drv71 /nix/store/iwgg2la44vzaaa2ja2xyaydck2jab651-pg_repack-1.5.2.drv72 /nix/store/xd0qgx5kfkw00jgxs1v9rm4ksfdjky95-pg_repack.drv73 /nix/store/fakh4z5ssr1vhknp3xv3ch232i3ph2ax-postgresql-and-plugins-15.19.drv74 /nix/store/4z7sbcap8vdzfs1smz81k2crr4sgm640-postgresql-and-plugins-15.19.drv75 /nix/store/q4qvxkwv7rl1jac9sf5aap56gjx0n5mb-system-path.drv76 /nix/store/9in45xg9fcahx70h7alf6jg08sin568q-dbus-1.drv77 /nix/store/jffmpfrihfl3k6lfgdc4ii4a62343h7x-X-Restart-Triggers-dbus.drv78 /nix/store/0jyfsa7sd5nhfiwbk0i0i0k7bbgigy6z-unit-dbus.service.drv79 /nix/store/0nn0jglvy3w5hd868rilks6acxx242hj-pg_net-0.19.5.drv80 /nix/store/0q3jswlrym436vq3yzd7nmxpfpc7zbw7-wrappers-0.5.6.drv81 /nix/store/1k3nzf8206jy6jjwdb50jn8rij79dvvj-plan_filter-0.1.drv82 /nix/store/17zhj6r14i4xx0fmzclykpcnyicwhbga-plan_filter.drv83 /nix/store/1hza0wxglhyl1641a3yki78kp045s8x2-wrappers-0.5.7.drv84 /nix/store/1mkhz1wanb7sx61imr6wqda0cqnvnj8q-wal2json-2.6.drv85 /nix/store/2wp2aqp71l4218m1z0aas6789yx18sv3-pgrouting-3.4.1.drv86 /nix/store/564f4p7z536irjy1x7a6i39nk3n3g2r2-pgrouting.drv87 /nix/store/k4qjk97aggz30jlgv2hdqka8fy8z07pg-supabase_vault-0.3.1.drv88 /nix/store/z8jynkjsnrfphim33c02aci4n6i2s9la-supabase_vault-0.2.8.drv89 /nix/store/8ir53vjiqz9rhip8arbxd2b58d0j67w0-supabase_vault.drv90 /nix/store/9sv9z7i53r40xnrigr8aywi98izk30rb-wal2json.drv91 /nix/store/g3yy08xhp6kakigznjmymrvasv6xhzz4-rum-1.3.drv92 /nix/store/apcx516gwjdivwb00nzvgwwq26mp6kbp-rum.drv93 /nix/store/ynjdlqr0w8h7ici1xdnsr79mwnzmyyri-pgroonga-3.2.5.drv94 /nix/store/c7b5vgzvlwgra3bhwq5fjzl0cg8lxq53-pgroonga.drv95 /nix/store/axpz1dvivwnmwkkcs392nj9cp1zs4x4h-pg_repack-1.4.8.drv96 /nix/store/gpxphj5cc5qbfjvp1kckicqwibgb6870-pg_repack-1.5.0.drv97 /nix/store/nynlpdydjmjk2fk2fsjz9bws5n6pjjyv-pg_repack-1.5.1.drv98 /nix/store/sa036niivyjgc2rqi9xh890msxh349l9-pg_repack-1.5.2.drv99 /nix/store/f4jr9drjzv7wfj2rxqg6fxg4ki5xv8aq-pg_repack.drv100 /nix/store/3cgs2dl0nwcsnwa5j7vkkp9vnqrax686-wrappers-0.6.0.drv101 /nix/store/74dcpcc376carhrdcf8ka4zmkawz1yv6-wrappers-0.5.4.drv102 /nix/store/92vrj7bj8hswwppxa34pv4a5mcishcns-wrappers-0.4.4.drv103 /nix/store/96l1zwmvz2ffcdfraaalfc6lvhah4kbz-wrappers-0.5.5.drv104 /nix/store/adcv6z66z4kpsasjjh1mcxa915lbdppl-wrappers-0.4.5.drv105 /nix/store/b4n3d1kid5pcaqfl3fjnjmc425dgg1p1-wrappers-0.5.0.drv106 /nix/store/jcd2gw4vawwnh0pmxhl4pl3ll6adggx5-wrappers-0.6.2.drv107 /nix/store/vxwdlzq8s4jj92x0jpc4sl9drjywlalq-wrappers-0.6.3.drv108 /nix/store/xwhq66cqc0ms922bxlcgc1jwff6kqv8g-wrappers-0.5.3.drv109 /nix/store/y6kq63cxxc5v5jh87mv9wpbvk0p4ayfg-wrappers-0.6.1.drv110 /nix/store/zdyyj4cgmfdl46zb5ycwmwr6d30w6mbx-wrappers-0.4.6.drv111 /nix/store/fn58ja37h9fw7mszrd75faxdb0999f0i-wrappers.drv112 /nix/store/9yiwshvqw6zii2gdbjn3whic00kdi2kk-vector-0.7.4.drv113 /nix/store/gd4y86918lqw8gzxg8nqrz8sy2dqq9fb-vector-0.7.0.drv114 /nix/store/gdgmh15k0z47wvlyk7n79hg9mm7jzisl-vector-0.6.2.drv115 /nix/store/hs3bxh6aa4yj96k9qp50af7qy1jchwk3-vector-0.6.0.drv116 /nix/store/j5mchw8xwd04x2c28fmf7pccna5x7y95-vector-0.8.2.drv117 /nix/store/qa8qkhza8bf74v69dzxgqvy2mjf799yl-vector-0.8.0.drv118 /nix/store/g5mv4minlqr25pj8gqhzcns6w7bwzaph-vector.drv119 /nix/store/lkbp0bzzg49y6z9h7ms156q0jsiq6qh4-safeupdate-1.4.drv120 /nix/store/icwncd52zxyvvybn79pvj2s9day934p8-safeupdate.drv121 /nix/store/9kmiqqmclsl8d77yd54al2d2wlwc6dp1-pgsodium-3.0.4.drv122 /nix/store/ckl9zg69wqkncwizrd6lln7h5492wwn6-pgsodium-3.1.6.drv123 /nix/store/lhi0y1xi9i9i1c8kg95nfhdw95j3dz3r-pgsodium-3.1.5.drv124 /nix/store/msmzmvngp6cx4yl0dwgzp3iv7bv796wg-pgsodium-3.1.8.drv125 /nix/store/zwypkv0vf8m8ybs536jq5wglvhfwdx8y-pgsodium-3.1.7.drv126 /nix/store/l68xzbdq736nzdnwvr9q3x29wcngcsj1-pgsodium.drv127 /nix/store/apd0c6nk3x333r1xj0sl2m3cr96pbizv-postgis-3.3.7.drv128 /nix/store/r12320b80inhy5aq434asc4sa8w6bn0g-postgis.drv129 /nix/store/36hfvpcvdxj64718i9mhil3db8835a6q-plpgsql_check-2.7.drv130 /nix/store/9lpr8r6zwzid07ihmr89rnxqcwv0yfja-plpgsql_check-2.8.drv131 /nix/store/rly88629k74w1nj10q0l6mg2jvd3nr1g-plpgsql_check.drv132 /nix/store/83ycsfk9ivb7sah3lq89d8hy5rxj5vpp-pg_net-0.20.3.drv133 /nix/store/a0ldx82cv1chkbdks86c8mjp8ps4lfgn-pg_net-0.20.0.drv134 /nix/store/lbqp8bfrqa2xm82ma6wyq1gijyajh6kh-pg_net-0.13.0.drv135 /nix/store/rdglczxf0sk4hhwsppqw13zl43vf5wr0-pg_net-0.14.0.drv136 /nix/store/w7547z9slhcibw4s6cwkag6w1f49317s-pg_net-0.20.4.drv137 /nix/store/vvs47f973jig6lflvm7cidm6m20glpy5-pg_net.drv138 /nix/store/y1p5dlzmilwxqbf3a4c7hl6gp9p84wsl-pgmq-1.5.1.drv139 /nix/store/y5rgrfmhzrjr0j6zil7ksqdbcglh0s8i-pgmq.drv140 /nix/store/zf19xpsa8jj4bmx09awww0z16cm79z4g-pgtap.drv141 /nix/store/2fndab8axk4hz4s30ijaxnpa1bc9z1dc-postgresql-and-plugins-17_22.drv142 /nix/store/70bg25srcrfnwivfph4bhslzhigdgpxw-unit-dbus.service.drv143 /nix/store/i3fy4azgna3zl2za0k3pwx70f2sk6hk8-receipt.drv144 /nix/store/w85w5162f9zdpi7g98sjlk186hrrm57p-postgresql-and-plugins-17_22.drv145 /nix/store/amy1ji0k53n9qihnqys9hvlc60bncr1y-system-path.drv146 /nix/store/7ynly7nv4iq2wvhmmg6p100h3wr2dpxd-dbus-1.drv147 /nix/store/v749g53p5djbqg3y7kfvdsw5g535j0js-X-Restart-Triggers-dbus.drv148 /nix/store/n7wg70ga6zm8b0prwd4np0azpi732zji-unit-dbus.service.drv149 /nix/store/bmn9rg4vrb07wyj1ls41afzdzcmhdqcm-user-units.drv150 /nix/store/jika4rfg3aj00vq2nfqx2i6nild4nvd5-unit-dbus.service.drv151 /nix/store/8r4vw45si1w8qby225b0amhay9ybj6c5-postgresql-orioledb-init.drv152 /nix/store/pgysndf7sfj9ifxk4sy1w8qfx2ln1ws6-unit-postgresql.service.drv153 /nix/store/9i9flpkzn6d3cvhin3s644150jhvcazf-supabase-orioledb-db-init.drv154 /nix/store/s4qicdb2kbzvf3lf6m8xidm4lndgs2yl-unit-supabase-db-init.service.drv155 /nix/store/dgm1f7y3gvjqjfv7r4gfa7pjffgzr4nj-system-units.drv156 /nix/store/sc9b344gbckg6fqywin6bhhs882d6mxa-etc.drv157 /nix/store/k4pazrfsvz1hsx7l4d0jsxvan5b3dq49-activate.drv158 /nix/store/m7z7bg6jaainvrfsikwclppim5yf6kn3-nixos-system-server-test.drv159 /nix/store/cpy2j0c5ribiykpjaig0axzryxzh1g69-user-units.drv160 /nix/store/qbfmigmm8fk4v5nhvb8h71hmhmdaky0g-supabase-db-init.drv161 /nix/store/ggfylf6a7iwk3pn3r08m30684z8rrq5l-unit-supabase-db-init.service.drv162 /nix/store/rjsqz027b1xj9q5dymzvs3wbqn2dv53m-postgresql-init.drv163 /nix/store/qsr1582sizlpmavcla4x0gbp3q52g4pd-unit-postgresql.service.drv164 /nix/store/ydkqsx664pp5ndcfl70c84mvxgixix01-system-units.drv165 /nix/store/y3dck3diii9z9x0w771pz541gjd0zwh3-etc.drv166 /nix/store/srl146pjpar66ijj6l2zw99pmy6wpkl9-activate.drv167 /nix/store/9g1i5nj6ki5iylj9b1pa0va72jlmn1wv-nixos-system-server-test.drv168 /nix/store/9ycfv0ahkkahnmw940x08dad2zr7sjgj-closure-info.drv169 /nix/store/jdnzjqsb96phjza6plwl0lk5bm803l44-run-nixos-vm.drv170 /nix/store/7krir41flncm1mmnhx0r153vwam5gr2r-nixos-vm.drv171 /nix/store/yngk2c0qc51lqsp65kmrwf9fwx1v4n7d-nixos-test-driver-orioledb.drv172 /nix/store/l8123sbvlv02rwm614affqrci9pdigmr-vm-test-run-orioledb.drv173error: build of '/nix/store/7iq4z475k625nsn9wc9nf4vxa7x1f1qd-pg_net-0.19.5.drv' on 'ssh-ng://nixbot-remote-build@78.232.36.247' failed: Cannot build '/nix/store/7iq4z475k625nsn9wc9nf4vxa7x1f1qd-pg_net-0.19.5.drv'.174 Reason: builder failed with exit code 2.175 Output paths:176 /nix/store/mx90q334pqf6iwkyb9vk1wzl5nhmqmiv-pg_net-0.19.5177 Last 22 log lines:178 > Running phase: unpackPhase179 > unpacking source archive /nix/store/5zgdqy3bz93jyn79pizxc1hks0cdcadw-source180 > source root is source181 > Running phase: patchPhase182 > Running phase: updateAutotoolsGnuConfigScriptsPhase183 > Running phase: configurePhase184 > no configure script, doing nothing185 > Running phase: buildPhase186 > gcc -Wall -Wmissing-prototypes -Wpointer-arith -Wdeclaration-after-statement -Werror=vla -Wendif-labels -Wmissing-format-attribute -Wimplicit-fallthrough=3 -Wcast-function-type -Wformat-security -fno-strict-aliasing -fwrapv -fexcess-precision=standard -Wno-deprecated-non-prototype -Wno-format-truncation -Wno-stringop-truncation -g -O2 -std=gnu17 -std=c11 -Wextra -Wall -Werror -Wno-declaration-after-statement -Wno-vla -Wno-long-long -Wmissing-variable-declarations -fPIC -DEXTVERSION=\"0.19.5\" -I. -I./ -I/nix/store/48l45fvi99n90x6p9i4cs1lmzby6cb73-postgresql-15.19/include/server -I/nix/store/48l45fvi99n90x6p9i4cs1lmzby6cb73-postgresql-15.19/include/internal -D_GNU_SOURCE -I/nix/store/p17klc3qq4nl9ihfwqfpi8cnqvcf92xz-libxml2-2.15.1-dev/include/libxml2 -I/nix/store/mglbi4dy4kpx7v1dcgf6iincp5x38hsc-lz4-1.10.0-dev/include -I/nix/store/g41q9md9rdcr3lkydi6f8zd6fza3h1q4-zstd-1.5.7-dev/include -I/nix/store/n2vnr7ycfk6midbzxcwd28qj3bgb50cz-icu4c-75.1-dev/include -c -o src/core.o src/core.c187 > gcc -Wall -Wmissing-prototypes -Wpointer-arith -Wdeclaration-after-statement -Werror=vla -Wendif-labels -Wmissing-format-attribute -Wimplicit-fallthrough=3 -Wcast-function-type -Wformat-security -fno-strict-aliasing -fwrapv -fexcess-precision=standard -Wno-deprecated-non-prototype -Wno-format-truncation -Wno-stringop-truncation -g -O2 -std=gnu17 -std=c11 -Wextra -Wall -Werror -Wno-declaration-after-statement -Wno-vla -Wno-long-long -Wmissing-variable-declarations -fPIC -DEXTVERSION=\"0.19.5\" -I. -I./ -I/nix/store/48l45fvi99n90x6p9i4cs1lmzby6cb73-postgresql-15.19/include/server -I/nix/store/48l45fvi99n90x6p9i4cs1lmzby6cb73-postgresql-15.19/include/internal -D_GNU_SOURCE -I/nix/store/p17klc3qq4nl9ihfwqfpi8cnqvcf92xz-libxml2-2.15.1-dev/include/libxml2 -I/nix/store/mglbi4dy4kpx7v1dcgf6iincp5x38hsc-lz4-1.10.0-dev/include -I/nix/store/g41q9md9rdcr3lkydi6f8zd6fza3h1q4-zstd-1.5.7-dev/include -I/nix/store/n2vnr7ycfk6midbzxcwd28qj3bgb50cz-icu4c-75.1-dev/include -c -o src/errors.o src/errors.c188 > gcc -Wall -Wmissing-prototypes -Wpointer-arith -Wdeclaration-after-statement -Werror=vla -Wendif-labels -Wmissing-format-attribute -Wimplicit-fallthrough=3 -Wcast-function-type -Wformat-security -fno-strict-aliasing -fwrapv -fexcess-precision=standard -Wno-deprecated-non-prototype -Wno-format-truncation -Wno-stringop-truncation -g -O2 -std=gnu17 -std=c11 -Wextra -Wall -Werror -Wno-declaration-after-statement -Wno-vla -Wno-long-long -Wmissing-variable-declarations -fPIC -DEXTVERSION=\"0.19.5\" -I. -I./ -I/nix/store/48l45fvi99n90x6p9i4cs1lmzby6cb73-postgresql-15.19/include/server -I/nix/store/48l45fvi99n90x6p9i4cs1lmzby6cb73-postgresql-15.19/include/internal -D_GNU_SOURCE -I/nix/store/p17klc3qq4nl9ihfwqfpi8cnqvcf92xz-libxml2-2.15.1-dev/include/libxml2 -I/nix/store/mglbi4dy4kpx7v1dcgf6iincp5x38hsc-lz4-1.10.0-dev/include -I/nix/store/g41q9md9rdcr3lkydi6f8zd6fza3h1q4-zstd-1.5.7-dev/include -I/nix/store/n2vnr7ycfk6midbzxcwd28qj3bgb50cz-icu4c-75.1-dev/include -c -o src/event.o src/event.c189 > In file included from /nix/store/jviasb44hibgh09829gbmbssbz2jjnhz-curl-8.17.0-dev/include/curl/curl.h:3333,190 > from /nix/store/jviasb44hibgh09829gbmbssbz2jjnhz-curl-8.17.0-dev/include/curl/multi.h:51,191 > from src/event.h:4,192 > from src/event.c:6:193 > /nix/store/jviasb44hibgh09829gbmbssbz2jjnhz-curl-8.17.0-dev/include/curl/multi.h:429:23: error: expected identifier or '(' before '__extension__'194 > 429 | CURL_EXTERN CURLMcode curl_multi_setopt(CURLM *multi_handle,195 > | ^~~~~~~~~~~~~~~~~196 > /nix/store/jviasb44hibgh09829gbmbssbz2jjnhz-curl-8.17.0-dev/include/curl/multi.h:429:23: error: expected identifier or '(' before ')' token197 > 429 | CURL_EXTERN CURLMcode curl_multi_setopt(CURLM *multi_handle,198 > | ^~~~~~~~~~~~~~~~~199 > make: *** [<builtin>: src/event.o] Error 1200 For full logs, run:201 nix log /nix/store/7iq4z475k625nsn9wc9nf4vxa7x1f1qd-pg_net-0.19.5.drv202error: Cannot build '/nix/store/7iq4z475k625nsn9wc9nf4vxa7x1f1qd-pg_net-0.19.5.drv'.203 Reason: builder failed with exit code 1.204 Output paths:205 /nix/store/mx90q334pqf6iwkyb9vk1wzl5nhmqmiv-pg_net-0.19.5206error: build of '/nix/store/0n0iaya9csx9by2pimrx1yglzw8dp4zs-pg_net-0.13.0.drv' on 'ssh-ng://nixbot-remote-build@78.232.36.247' failed: Cannot build '/nix/store/0n0iaya9csx9by2pimrx1yglzw8dp4zs-pg_net-0.13.0.drv'.207 Reason: builder failed with exit code 2.208 Output paths:209 /nix/store/14dkr1mhbrh869r2k75r03ngw6q7c4ma-pg_net-0.13.0210 Last 25 log lines:211 > | ^~~~~~~~~~~~~~212 > src/util.h:6:11: warning: call to 'Wcurl_easy_setopt_err_long' declared with attribute warning: curl_easy_setopt expects a long argument [-Wattribute-warning]213 > 6 | if (curl_easy_setopt(hdl, opt, prm) != CURLE_OK) \214 > | ^~~~~~~~~~~~~~~~215 > src/core.c:108:3: note: in expansion of macro 'CURL_EZ_SETOPT'216 > 108 | CURL_EZ_SETOPT(curl_ez_handle, CURLOPT_TIMEOUT_MS, timeout_milliseconds);217 > | ^~~~~~~~~~~~~~218 > src/util.h:6:11: warning: call to 'Wcurl_easy_setopt_err_long' declared with attribute warning: curl_easy_setopt expects a long argument [-Wattribute-warning]219 > 6 | if (curl_easy_setopt(hdl, opt, prm) != CURLE_OK) \220 > | ^~~~~~~~~~~~~~~~221 > src/core.c:110:3: note: in expansion of macro 'CURL_EZ_SETOPT'222 > 110 | CURL_EZ_SETOPT(curl_ez_handle, CURLOPT_FOLLOWLOCATION, true);223 > | ^~~~~~~~~~~~~~224 > gcc -Wall -Wmissing-prototypes -Wpointer-arith -Wdeclaration-after-statement -Werror=vla -Wendif-labels -Wmissing-format-attribute -Wimplicit-fallthrough=3 -Wcast-function-type -Wformat-security -fno-strict-aliasing -fwrapv -fexcess-precision=standard -Wno-deprecated-non-prototype -Wno-format-truncation -Wno-stringop-truncation -g -O2 -std=gnu17 -std=c11 -Werror -Wno-declaration-after-statement -fPIC -DEXTVERSION=\"0.13.0\" -I. -I./ -I/nix/store/48l45fvi99n90x6p9i4cs1lmzby6cb73-postgresql-15.19/include/server -I/nix/store/48l45fvi99n90x6p9i4cs1lmzby6cb73-postgresql-15.19/include/internal -D_GNU_SOURCE -I/nix/store/p17klc3qq4nl9ihfwqfpi8cnqvcf92xz-libxml2-2.15.1-dev/include/libxml2 -I/nix/store/mglbi4dy4kpx7v1dcgf6iincp5x38hsc-lz4-1.10.0-dev/include -I/nix/store/g41q9md9rdcr3lkydi6f8zd6fza3h1q4-zstd-1.5.7-dev/include -I/nix/store/n2vnr7ycfk6midbzxcwd28qj3bgb50cz-icu4c-75.1-dev/include -c -o src/event.o src/event.c225 > In file included from /nix/store/jviasb44hibgh09829gbmbssbz2jjnhz-curl-8.17.0-dev/include/curl/curl.h:3333,226 > from /nix/store/jviasb44hibgh09829gbmbssbz2jjnhz-curl-8.17.0-dev/include/curl/multi.h:51,227 > from src/event.h:4,228 > from src/event.c:6:229 > /nix/store/jviasb44hibgh09829gbmbssbz2jjnhz-curl-8.17.0-dev/include/curl/multi.h:429:23: error: expected identifier or '(' before '__extension__'230 > 429 | CURL_EXTERN CURLMcode curl_multi_setopt(CURLM *multi_handle,231 > | ^~~~~~~~~~~~~~~~~232 > /nix/store/jviasb44hibgh09829gbmbssbz2jjnhz-curl-8.17.0-dev/include/curl/multi.h:429:23: error: expected identifier or '(' before ')' token233 > 429 | CURL_EXTERN CURLMcode curl_multi_setopt(CURLM *multi_handle,234 > | ^~~~~~~~~~~~~~~~~235 > make: *** [<builtin>: src/event.o] Error 1236 For full logs, run:237 nix log /nix/store/0n0iaya9csx9by2pimrx1yglzw8dp4zs-pg_net-0.13.0.drv238error: Cannot build '/nix/store/0n0iaya9csx9by2pimrx1yglzw8dp4zs-pg_net-0.13.0.drv'.239 Reason: builder failed with exit code 1.240 Output paths:241 /nix/store/14dkr1mhbrh869r2k75r03ngw6q7c4ma-pg_net-0.13.0242error: build of '/nix/store/lbqp8bfrqa2xm82ma6wyq1gijyajh6kh-pg_net-0.13.0.drv' on 'ssh-ng://nixbot-remote-build@78.232.36.247' failed: Cannot build '/nix/store/lbqp8bfrqa2xm82ma6wyq1gijyajh6kh-pg_net-0.13.0.drv'.243 Reason: builder failed with exit code 2.244 Output paths:245 /nix/store/517wbr5c7xb4fvch9kn0zim5j3hnjzpa-pg_net-0.13.0246 Last 25 log lines:247 > | ^~~~~~~~~~~~~~248 > src/util.h:6:11: warning: call to 'Wcurl_easy_setopt_err_long' declared with attribute warning: curl_easy_setopt expects a long argument [-Wattribute-warning]249 > 6 | if (curl_easy_setopt(hdl, opt, prm) != CURLE_OK) \250 > | ^~~~~~~~~~~~~~~~251 > src/core.c:108:3: note: in expansion of macro 'CURL_EZ_SETOPT'252 > 108 | CURL_EZ_SETOPT(curl_ez_handle, CURLOPT_TIMEOUT_MS, timeout_milliseconds);253 > | ^~~~~~~~~~~~~~254 > src/util.h:6:11: warning: call to 'Wcurl_easy_setopt_err_long' declared with attribute warning: curl_easy_setopt expects a long argument [-Wattribute-warning]255 > 6 | if (curl_easy_setopt(hdl, opt, prm) != CURLE_OK) \256 > | ^~~~~~~~~~~~~~~~257 > src/core.c:110:3: note: in expansion of macro 'CURL_EZ_SETOPT'258 > 110 | CURL_EZ_SETOPT(curl_ez_handle, CURLOPT_FOLLOWLOCATION, true);259 > | ^~~~~~~~~~~~~~260 > gcc -Wall -Wmissing-prototypes -Wpointer-arith -Wdeclaration-after-statement -Werror=vla -Wendif-labels -Wmissing-format-attribute -Wimplicit-fallthrough=3 -Wcast-function-type -Wshadow=compatible-local -Wformat-security -fno-strict-aliasing -fwrapv -fexcess-precision=standard -Wno-format-truncation -Wno-stringop-truncation -moutline-atomics -g -O2 -std=c11 -Werror -Wno-declaration-after-statement -fPIC -fvisibility=hidden -DEXTVERSION=\"0.13.0\" -I. -I./ -I/nix/store/wq2kfr0rkb0hdmf1iwi3mi8pxycakzmq-postgresql-17_22/include/server -I/nix/store/wq2kfr0rkb0hdmf1iwi3mi8pxycakzmq-postgresql-17_22/include/internal -D_GNU_SOURCE -I/nix/store/p17klc3qq4nl9ihfwqfpi8cnqvcf92xz-libxml2-2.15.1-dev/include/libxml2 -I/nix/store/mglbi4dy4kpx7v1dcgf6iincp5x38hsc-lz4-1.10.0-dev/include -I/nix/store/g41q9md9rdcr3lkydi6f8zd6fza3h1q4-zstd-1.5.7-dev/include -I/nix/store/n2vnr7ycfk6midbzxcwd28qj3bgb50cz-icu4c-75.1-dev/include -c -o src/event.o src/event.c261 > In file included from /nix/store/jviasb44hibgh09829gbmbssbz2jjnhz-curl-8.17.0-dev/include/curl/curl.h:3333,262 > from /nix/store/jviasb44hibgh09829gbmbssbz2jjnhz-curl-8.17.0-dev/include/curl/multi.h:51,263 > from src/event.h:4,264 > from src/event.c:6:265 > /nix/store/jviasb44hibgh09829gbmbssbz2jjnhz-curl-8.17.0-dev/include/curl/multi.h:429:23: error: expected identifier or '(' before '__extension__'266 > 429 | CURL_EXTERN CURLMcode curl_multi_setopt(CURLM *multi_handle,267 > | ^~~~~~~~~~~~~~~~~268 > /nix/store/jviasb44hibgh09829gbmbssbz2jjnhz-curl-8.17.0-dev/include/curl/multi.h:429:23: error: expected identifier or '(' before ')' token269 > 429 | CURL_EXTERN CURLMcode curl_multi_setopt(CURLM *multi_handle,270 > | ^~~~~~~~~~~~~~~~~271 > make: *** [<builtin>: src/event.o] Error 1272 For full logs, run:273 nix log /nix/store/lbqp8bfrqa2xm82ma6wyq1gijyajh6kh-pg_net-0.13.0.drv274error: Cannot build '/nix/store/lbqp8bfrqa2xm82ma6wyq1gijyajh6kh-pg_net-0.13.0.drv'.275 Reason: builder failed with exit code 1.276 Output paths:277 /nix/store/517wbr5c7xb4fvch9kn0zim5j3hnjzpa-pg_net-0.13.0278error: build of '/nix/store/cfrc2vk3cgabx1447j2n7s3zxraq6395-pg_net-0.14.0.drv' on 'ssh-ng://nixbot-remote-build@78.232.36.247' failed: Cannot build '/nix/store/cfrc2vk3cgabx1447j2n7s3zxraq6395-pg_net-0.14.0.drv'.279 Reason: builder failed with exit code 2.280 Output paths:281 /nix/store/m4c4b79prkz8x60agzy6dy9bn0cdcy0d-pg_net-0.14.0282 Last 25 log lines:283 > src/errors.h:6:11: warning: call to 'Wcurl_easy_setopt_err_long' declared with attribute warning: curl_easy_setopt expects a long argument [-Wattribute-warning]284 > 6 | if (curl_easy_setopt(hdl, opt, prm) != CURLE_OK) \285 > | ^~~~~~~~~~~~~~~~286 > src/core.c:134:3: note: in expansion of macro 'EREPORT_CURL_SETOPT'287 > 134 | EREPORT_CURL_SETOPT(curl_ez_handle, CURLOPT_TIMEOUT_MS, cdata->timeout_milliseconds);288 > | ^~~~~~~~~~~~~~~~~~~289 > src/errors.h:6:11: warning: call to 'Wcurl_easy_setopt_err_long' declared with attribute warning: curl_easy_setopt expects a long argument [-Wattribute-warning]290 > 6 | if (curl_easy_setopt(hdl, opt, prm) != CURLE_OK) \291 > | ^~~~~~~~~~~~~~~~292 > src/core.c:136:3: note: in expansion of macro 'EREPORT_CURL_SETOPT'293 > 136 | EREPORT_CURL_SETOPT(curl_ez_handle, CURLOPT_FOLLOWLOCATION, true);294 > | ^~~~~~~~~~~~~~~~~~~295 > gcc -Wall -Wmissing-prototypes -Wpointer-arith -Wdeclaration-after-statement -Werror=vla -Wendif-labels -Wmissing-format-attribute -Wimplicit-fallthrough=3 -Wcast-function-type -Wformat-security -fno-strict-aliasing -fwrapv -fexcess-precision=standard -Wno-deprecated-non-prototype -Wno-format-truncation -Wno-stringop-truncation -g -O2 -std=gnu17 -std=c11 -Werror -Wno-declaration-after-statement -fPIC -DEXTVERSION=\"0.14.0\" -I. -I./ -I/nix/store/48l45fvi99n90x6p9i4cs1lmzby6cb73-postgresql-15.19/include/server -I/nix/store/48l45fvi99n90x6p9i4cs1lmzby6cb73-postgresql-15.19/include/internal -D_GNU_SOURCE -I/nix/store/p17klc3qq4nl9ihfwqfpi8cnqvcf92xz-libxml2-2.15.1-dev/include/libxml2 -I/nix/store/mglbi4dy4kpx7v1dcgf6iincp5x38hsc-lz4-1.10.0-dev/include -I/nix/store/g41q9md9rdcr3lkydi6f8zd6fza3h1q4-zstd-1.5.7-dev/include -I/nix/store/n2vnr7ycfk6midbzxcwd28qj3bgb50cz-icu4c-75.1-dev/include -c -o src/errors.o src/errors.c296 > gcc -Wall -Wmissing-prototypes -Wpointer-arith -Wdeclaration-after-statement -Werror=vla -Wendif-labels -Wmissing-format-attribute -Wimplicit-fallthrough=3 -Wcast-function-type -Wformat-security -fno-strict-aliasing -fwrapv -fexcess-precision=standard -Wno-deprecated-non-prototype -Wno-format-truncation -Wno-stringop-truncation -g -O2 -std=gnu17 -std=c11 -Werror -Wno-declaration-after-statement -fPIC -DEXTVERSION=\"0.14.0\" -I. -I./ -I/nix/store/48l45fvi99n90x6p9i4cs1lmzby6cb73-postgresql-15.19/include/server -I/nix/store/48l45fvi99n90x6p9i4cs1lmzby6cb73-postgresql-15.19/include/internal -D_GNU_SOURCE -I/nix/store/p17klc3qq4nl9ihfwqfpi8cnqvcf92xz-libxml2-2.15.1-dev/include/libxml2 -I/nix/store/mglbi4dy4kpx7v1dcgf6iincp5x38hsc-lz4-1.10.0-dev/include -I/nix/store/g41q9md9rdcr3lkydi6f8zd6fza3h1q4-zstd-1.5.7-dev/include -I/nix/store/n2vnr7ycfk6midbzxcwd28qj3bgb50cz-icu4c-75.1-dev/include -c -o src/event.o src/event.c297 > In file included from /nix/store/jviasb44hibgh09829gbmbssbz2jjnhz-curl-8.17.0-dev/include/curl/curl.h:3333,298 > from /nix/store/jviasb44hibgh09829gbmbssbz2jjnhz-curl-8.17.0-dev/include/curl/multi.h:51,299 > from src/event.h:4,300 > from src/event.c:6:301 > /nix/store/jviasb44hibgh09829gbmbssbz2jjnhz-curl-8.17.0-dev/include/curl/multi.h:429:23: error: expected identifier or '(' before '__extension__'302 > 429 | CURL_EXTERN CURLMcode curl_multi_setopt(CURLM *multi_handle,303 > | ^~~~~~~~~~~~~~~~~304 > /nix/store/jviasb44hibgh09829gbmbssbz2jjnhz-curl-8.17.0-dev/include/curl/multi.h:429:23: error: expected identifier or '(' before ')' token305 > 429 | CURL_EXTERN CURLMcode curl_multi_setopt(CURLM *multi_handle,306 > | ^~~~~~~~~~~~~~~~~307 > make: *** [<builtin>: src/event.o] Error 1308 For full logs, run:309 nix log /nix/store/cfrc2vk3cgabx1447j2n7s3zxraq6395-pg_net-0.14.0.drv310error: Cannot build '/nix/store/cfrc2vk3cgabx1447j2n7s3zxraq6395-pg_net-0.14.0.drv'.311 Reason: builder failed with exit code 1.312 Output paths:313 /nix/store/m4c4b79prkz8x60agzy6dy9bn0cdcy0d-pg_net-0.14.0314error: build of '/nix/store/a0ldx82cv1chkbdks86c8mjp8ps4lfgn-pg_net-0.20.0.drv' on 'ssh-ng://nixbot-remote-build@78.232.36.247' failed: Cannot build '/nix/store/a0ldx82cv1chkbdks86c8mjp8ps4lfgn-pg_net-0.20.0.drv'.315 Reason: builder failed with exit code 2.316 Output paths:317 /nix/store/j9hxarpn08mgqpwavw7wdypm8adf921z-pg_net-0.20.0318 Last 22 log lines:319 > Running phase: unpackPhase320 > unpacking source archive /nix/store/3783i7yhcfqnyv5ndli22gcr11ap151m-source321 > source root is source322 > Running phase: patchPhase323 > Running phase: updateAutotoolsGnuConfigScriptsPhase324 > Running phase: configurePhase325 > no configure script, doing nothing326 > Running phase: buildPhase327 > gcc -Wall -Wmissing-prototypes -Wpointer-arith -Wdeclaration-after-statement -Werror=vla -Wendif-labels -Wmissing-format-attribute -Wimplicit-fallthrough=3 -Wcast-function-type -Wshadow=compatible-local -Wformat-security -fno-strict-aliasing -fwrapv -fexcess-precision=standard -Wno-format-truncation -Wno-stringop-truncation -moutline-atomics -g -O2 -std=c11 -Wextra -Wall -Werror -Wno-declaration-after-statement -Wno-vla -Wno-long-long -Wmissing-variable-declarations -fPIC -fvisibility=hidden -DEXTVERSION=\"0.20.0\" -I. -I./ -I/nix/store/wq2kfr0rkb0hdmf1iwi3mi8pxycakzmq-postgresql-17_22/include/server -I/nix/store/wq2kfr0rkb0hdmf1iwi3mi8pxycakzmq-postgresql-17_22/include/internal -D_GNU_SOURCE -I/nix/store/p17klc3qq4nl9ihfwqfpi8cnqvcf92xz-libxml2-2.15.1-dev/include/libxml2 -I/nix/store/mglbi4dy4kpx7v1dcgf6iincp5x38hsc-lz4-1.10.0-dev/include -I/nix/store/g41q9md9rdcr3lkydi6f8zd6fza3h1q4-zstd-1.5.7-dev/include -I/nix/store/n2vnr7ycfk6midbzxcwd28qj3bgb50cz-icu4c-75.1-dev/include -c -o src/core.o src/core.c328 > gcc -Wall -Wmissing-prototypes -Wpointer-arith -Wdeclaration-after-statement -Werror=vla -Wendif-labels -Wmissing-format-attribute -Wimplicit-fallthrough=3 -Wcast-function-type -Wshadow=compatible-local -Wformat-security -fno-strict-aliasing -fwrapv -fexcess-precision=standard -Wno-format-truncation -Wno-stringop-truncation -moutline-atomics -g -O2 -std=c11 -Wextra -Wall -Werror -Wno-declaration-after-statement -Wno-vla -Wno-long-long -Wmissing-variable-declarations -fPIC -fvisibility=hidden -DEXTVERSION=\"0.20.0\" -I. -I./ -I/nix/store/wq2kfr0rkb0hdmf1iwi3mi8pxycakzmq-postgresql-17_22/include/server -I/nix/store/wq2kfr0rkb0hdmf1iwi3mi8pxycakzmq-postgresql-17_22/include/internal -D_GNU_SOURCE -I/nix/store/p17klc3qq4nl9ihfwqfpi8cnqvcf92xz-libxml2-2.15.1-dev/include/libxml2 -I/nix/store/mglbi4dy4kpx7v1dcgf6iincp5x38hsc-lz4-1.10.0-dev/include -I/nix/store/g41q9md9rdcr3lkydi6f8zd6fza3h1q4-zstd-1.5.7-dev/include -I/nix/store/n2vnr7ycfk6midbzxcwd28qj3bgb50cz-icu4c-75.1-dev/include -c -o src/errors.o src/errors.c329 > gcc -Wall -Wmissing-prototypes -Wpointer-arith -Wdeclaration-after-statement -Werror=vla -Wendif-labels -Wmissing-format-attribute -Wimplicit-fallthrough=3 -Wcast-function-type -Wshadow=compatible-local -Wformat-security -fno-strict-aliasing -fwrapv -fexcess-precision=standard -Wno-format-truncation -Wno-stringop-truncation -moutline-atomics -g -O2 -std=c11 -Wextra -Wall -Werror -Wno-declaration-after-statement -Wno-vla -Wno-long-long -Wmissing-variable-declarations -fPIC -fvisibility=hidden -DEXTVERSION=\"0.20.0\" -I. -I./ -I/nix/store/wq2kfr0rkb0hdmf1iwi3mi8pxycakzmq-postgresql-17_22/include/server -I/nix/store/wq2kfr0rkb0hdmf1iwi3mi8pxycakzmq-postgresql-17_22/include/internal -D_GNU_SOURCE -I/nix/store/p17klc3qq4nl9ihfwqfpi8cnqvcf92xz-libxml2-2.15.1-dev/include/libxml2 -I/nix/store/mglbi4dy4kpx7v1dcgf6iincp5x38hsc-lz4-1.10.0-dev/include -I/nix/store/g41q9md9rdcr3lkydi6f8zd6fza3h1q4-zstd-1.5.7-dev/include -I/nix/store/n2vnr7ycfk6midbzxcwd28qj3bgb50cz-icu4c-75.1-dev/include -c -o src/event.o src/event.c330 > In file included from /nix/store/jviasb44hibgh09829gbmbssbz2jjnhz-curl-8.17.0-dev/include/curl/curl.h:3333,331 > from /nix/store/jviasb44hibgh09829gbmbssbz2jjnhz-curl-8.17.0-dev/include/curl/multi.h:51,332 > from src/event.h:4,333 > from src/event.c:6:334 > /nix/store/jviasb44hibgh09829gbmbssbz2jjnhz-curl-8.17.0-dev/include/curl/multi.h:429:23: error: expected identifier or '(' before '__extension__'335 > 429 | CURL_EXTERN CURLMcode curl_multi_setopt(CURLM *multi_handle,336 > | ^~~~~~~~~~~~~~~~~337 > /nix/store/jviasb44hibgh09829gbmbssbz2jjnhz-curl-8.17.0-dev/include/curl/multi.h:429:23: error: expected identifier or '(' before ')' token338 > 429 | CURL_EXTERN CURLMcode curl_multi_setopt(CURLM *multi_handle,339 > | ^~~~~~~~~~~~~~~~~340 > make: *** [<builtin>: src/event.o] Error 1341 For full logs, run:342 nix log /nix/store/a0ldx82cv1chkbdks86c8mjp8ps4lfgn-pg_net-0.20.0.drv343error: Cannot build '/nix/store/a0ldx82cv1chkbdks86c8mjp8ps4lfgn-pg_net-0.20.0.drv'.344 Reason: builder failed with exit code 1.345 Output paths:346 /nix/store/j9hxarpn08mgqpwavw7wdypm8adf921z-pg_net-0.20.0347error: build of '/nix/store/rdglczxf0sk4hhwsppqw13zl43vf5wr0-pg_net-0.14.0.drv' on 'ssh-ng://nixbot-remote-build@78.232.36.247' failed: Cannot build '/nix/store/rdglczxf0sk4hhwsppqw13zl43vf5wr0-pg_net-0.14.0.drv'.348 Reason: builder failed with exit code 2.349 Output paths:350 /nix/store/dljg9dqcggn0gx9wwgbw43zdg392qhq2-pg_net-0.14.0351 Last 25 log lines:352 > src/errors.h:6:11: warning: call to 'Wcurl_easy_setopt_err_long' declared with attribute warning: curl_easy_setopt expects a long argument [-Wattribute-warning]353 > 6 | if (curl_easy_setopt(hdl, opt, prm) != CURLE_OK) \354 > | ^~~~~~~~~~~~~~~~355 > src/core.c:134:3: note: in expansion of macro 'EREPORT_CURL_SETOPT'356 > 134 | EREPORT_CURL_SETOPT(curl_ez_handle, CURLOPT_TIMEOUT_MS, cdata->timeout_milliseconds);357 > | ^~~~~~~~~~~~~~~~~~~358 > src/errors.h:6:11: warning: call to 'Wcurl_easy_setopt_err_long' declared with attribute warning: curl_easy_setopt expects a long argument [-Wattribute-warning]359 > 6 | if (curl_easy_setopt(hdl, opt, prm) != CURLE_OK) \360 > | ^~~~~~~~~~~~~~~~361 > src/core.c:136:3: note: in expansion of macro 'EREPORT_CURL_SETOPT'362 > 136 | EREPORT_CURL_SETOPT(curl_ez_handle, CURLOPT_FOLLOWLOCATION, true);363 > | ^~~~~~~~~~~~~~~~~~~364 > gcc -Wall -Wmissing-prototypes -Wpointer-arith -Wdeclaration-after-statement -Werror=vla -Wendif-labels -Wmissing-format-attribute -Wimplicit-fallthrough=3 -Wcast-function-type -Wshadow=compatible-local -Wformat-security -fno-strict-aliasing -fwrapv -fexcess-precision=standard -Wno-format-truncation -Wno-stringop-truncation -moutline-atomics -g -O2 -std=c11 -Werror -Wno-declaration-after-statement -fPIC -fvisibility=hidden -DEXTVERSION=\"0.14.0\" -I. -I./ -I/nix/store/wq2kfr0rkb0hdmf1iwi3mi8pxycakzmq-postgresql-17_22/include/server -I/nix/store/wq2kfr0rkb0hdmf1iwi3mi8pxycakzmq-postgresql-17_22/include/internal -D_GNU_SOURCE -I/nix/store/p17klc3qq4nl9ihfwqfpi8cnqvcf92xz-libxml2-2.15.1-dev/include/libxml2 -I/nix/store/mglbi4dy4kpx7v1dcgf6iincp5x38hsc-lz4-1.10.0-dev/include -I/nix/store/g41q9md9rdcr3lkydi6f8zd6fza3h1q4-zstd-1.5.7-dev/include -I/nix/store/n2vnr7ycfk6midbzxcwd28qj3bgb50cz-icu4c-75.1-dev/include -c -o src/errors.o src/errors.c365 > gcc -Wall -Wmissing-prototypes -Wpointer-arith -Wdeclaration-after-statement -Werror=vla -Wendif-labels -Wmissing-format-attribute -Wimplicit-fallthrough=3 -Wcast-function-type -Wshadow=compatible-local -Wformat-security -fno-strict-aliasing -fwrapv -fexcess-precision=standard -Wno-format-truncation -Wno-stringop-truncation -moutline-atomics -g -O2 -std=c11 -Werror -Wno-declaration-after-statement -fPIC -fvisibility=hidden -DEXTVERSION=\"0.14.0\" -I. -I./ -I/nix/store/wq2kfr0rkb0hdmf1iwi3mi8pxycakzmq-postgresql-17_22/include/server -I/nix/store/wq2kfr0rkb0hdmf1iwi3mi8pxycakzmq-postgresql-17_22/include/internal -D_GNU_SOURCE -I/nix/store/p17klc3qq4nl9ihfwqfpi8cnqvcf92xz-libxml2-2.15.1-dev/include/libxml2 -I/nix/store/mglbi4dy4kpx7v1dcgf6iincp5x38hsc-lz4-1.10.0-dev/include -I/nix/store/g41q9md9rdcr3lkydi6f8zd6fza3h1q4-zstd-1.5.7-dev/include -I/nix/store/n2vnr7ycfk6midbzxcwd28qj3bgb50cz-icu4c-75.1-dev/include -c -o src/event.o src/event.c366 > In file included from /nix/store/jviasb44hibgh09829gbmbssbz2jjnhz-curl-8.17.0-dev/include/curl/curl.h:3333,367 > from /nix/store/jviasb44hibgh09829gbmbssbz2jjnhz-curl-8.17.0-dev/include/curl/multi.h:51,368 > from src/event.h:4,369 > from src/event.c:6:370 > /nix/store/jviasb44hibgh09829gbmbssbz2jjnhz-curl-8.17.0-dev/include/curl/multi.h:429:23: error: expected identifier or '(' before '__extension__'371 > 429 | CURL_EXTERN CURLMcode curl_multi_setopt(CURLM *multi_handle,372 > | ^~~~~~~~~~~~~~~~~373 > /nix/store/jviasb44hibgh09829gbmbssbz2jjnhz-curl-8.17.0-dev/include/curl/multi.h:429:23: error: expected identifier or '(' before ')' token374 > 429 | CURL_EXTERN CURLMcode curl_multi_setopt(CURLM *multi_handle,375 > | ^~~~~~~~~~~~~~~~~376 > make: *** [<builtin>: src/event.o] Error 1377 For full logs, run:378 nix log /nix/store/rdglczxf0sk4hhwsppqw13zl43vf5wr0-pg_net-0.14.0.drv379error: Cannot build '/nix/store/rdglczxf0sk4hhwsppqw13zl43vf5wr0-pg_net-0.14.0.drv'.380 Reason: builder failed with exit code 1.381 Output paths:382 /nix/store/dljg9dqcggn0gx9wwgbw43zdg392qhq2-pg_net-0.14.0383error: build of '/nix/store/0nn0jglvy3w5hd868rilks6acxx242hj-pg_net-0.19.5.drv' on 'ssh-ng://nixbot-remote-build@78.232.36.247' failed: Cannot build '/nix/store/0nn0jglvy3w5hd868rilks6acxx242hj-pg_net-0.19.5.drv'.384 Reason: builder failed with exit code 2.385 Output paths:386 /nix/store/4301s7p0rsq58k2f9hrs6ar4c2a8ya3d-pg_net-0.19.5387 Last 22 log lines:388 > Running phase: unpackPhase389 > unpacking source archive /nix/store/5zgdqy3bz93jyn79pizxc1hks0cdcadw-source390 > source root is source391 > Running phase: patchPhase392 > Running phase: updateAutotoolsGnuConfigScriptsPhase393 > Running phase: configurePhase394 > no configure script, doing nothing395 > Running phase: buildPhase396 > gcc -Wall -Wmissing-prototypes -Wpointer-arith -Wdeclaration-after-statement -Werror=vla -Wendif-labels -Wmissing-format-attribute -Wimplicit-fallthrough=3 -Wcast-function-type -Wshadow=compatible-local -Wformat-security -fno-strict-aliasing -fwrapv -fexcess-precision=standard -Wno-format-truncation -Wno-stringop-truncation -moutline-atomics -g -O2 -std=c11 -Wextra -Wall -Werror -Wno-declaration-after-statement -Wno-vla -Wno-long-long -Wmissing-variable-declarations -fPIC -fvisibility=hidden -DEXTVERSION=\"0.19.5\" -I. -I./ -I/nix/store/wq2kfr0rkb0hdmf1iwi3mi8pxycakzmq-postgresql-17_22/include/server -I/nix/store/wq2kfr0rkb0hdmf1iwi3mi8pxycakzmq-postgresql-17_22/include/internal -D_GNU_SOURCE -I/nix/store/p17klc3qq4nl9ihfwqfpi8cnqvcf92xz-libxml2-2.15.1-dev/include/libxml2 -I/nix/store/mglbi4dy4kpx7v1dcgf6iincp5x38hsc-lz4-1.10.0-dev/include -I/nix/store/g41q9md9rdcr3lkydi6f8zd6fza3h1q4-zstd-1.5.7-dev/include -I/nix/store/n2vnr7ycfk6midbzxcwd28qj3bgb50cz-icu4c-75.1-dev/include -c -o src/core.o src/core.c397 > gcc -Wall -Wmissing-prototypes -Wpointer-arith -Wdeclaration-after-statement -Werror=vla -Wendif-labels -Wmissing-format-attribute -Wimplicit-fallthrough=3 -Wcast-function-type -Wshadow=compatible-local -Wformat-security -fno-strict-aliasing -fwrapv -fexcess-precision=standard -Wno-format-truncation -Wno-stringop-truncation -moutline-atomics -g -O2 -std=c11 -Wextra -Wall -Werror -Wno-declaration-after-statement -Wno-vla -Wno-long-long -Wmissing-variable-declarations -fPIC -fvisibility=hidden -DEXTVERSION=\"0.19.5\" -I. -I./ -I/nix/store/wq2kfr0rkb0hdmf1iwi3mi8pxycakzmq-postgresql-17_22/include/server -I/nix/store/wq2kfr0rkb0hdmf1iwi3mi8pxycakzmq-postgresql-17_22/include/internal -D_GNU_SOURCE -I/nix/store/p17klc3qq4nl9ihfwqfpi8cnqvcf92xz-libxml2-2.15.1-dev/include/libxml2 -I/nix/store/mglbi4dy4kpx7v1dcgf6iincp5x38hsc-lz4-1.10.0-dev/include -I/nix/store/g41q9md9rdcr3lkydi6f8zd6fza3h1q4-zstd-1.5.7-dev/include -I/nix/store/n2vnr7ycfk6midbzxcwd28qj3bgb50cz-icu4c-75.1-dev/include -c -o src/errors.o src/errors.c398 > gcc -Wall -Wmissing-prototypes -Wpointer-arith -Wdeclaration-after-statement -Werror=vla -Wendif-labels -Wmissing-format-attribute -Wimplicit-fallthrough=3 -Wcast-function-type -Wshadow=compatible-local -Wformat-security -fno-strict-aliasing -fwrapv -fexcess-precision=standard -Wno-format-truncation -Wno-stringop-truncation -moutline-atomics -g -O2 -std=c11 -Wextra -Wall -Werror -Wno-declaration-after-statement -Wno-vla -Wno-long-long -Wmissing-variable-declarations -fPIC -fvisibility=hidden -DEXTVERSION=\"0.19.5\" -I. -I./ -I/nix/store/wq2kfr0rkb0hdmf1iwi3mi8pxycakzmq-postgresql-17_22/include/server -I/nix/store/wq2kfr0rkb0hdmf1iwi3mi8pxycakzmq-postgresql-17_22/include/internal -D_GNU_SOURCE -I/nix/store/p17klc3qq4nl9ihfwqfpi8cnqvcf92xz-libxml2-2.15.1-dev/include/libxml2 -I/nix/store/mglbi4dy4kpx7v1dcgf6iincp5x38hsc-lz4-1.10.0-dev/include -I/nix/store/g41q9md9rdcr3lkydi6f8zd6fza3h1q4-zstd-1.5.7-dev/include -I/nix/store/n2vnr7ycfk6midbzxcwd28qj3bgb50cz-icu4c-75.1-dev/include -c -o src/event.o src/event.c399 > In file included from /nix/store/jviasb44hibgh09829gbmbssbz2jjnhz-curl-8.17.0-dev/include/curl/curl.h:3333,400 > from /nix/store/jviasb44hibgh09829gbmbssbz2jjnhz-curl-8.17.0-dev/include/curl/multi.h:51,401 > from src/event.h:4,402 > from src/event.c:6:403 > /nix/store/jviasb44hibgh09829gbmbssbz2jjnhz-curl-8.17.0-dev/include/curl/multi.h:429:23: error: expected identifier or '(' before '__extension__'404 > 429 | CURL_EXTERN CURLMcode curl_multi_setopt(CURLM *multi_handle,405 > | ^~~~~~~~~~~~~~~~~406 > /nix/store/jviasb44hibgh09829gbmbssbz2jjnhz-curl-8.17.0-dev/include/curl/multi.h:429:23: error: expected identifier or '(' before ')' token407 > 429 | CURL_EXTERN CURLMcode curl_multi_setopt(CURLM *multi_handle,408 > | ^~~~~~~~~~~~~~~~~409 > make: *** [<builtin>: src/event.o] Error 1410 For full logs, run:411 nix log /nix/store/0nn0jglvy3w5hd868rilks6acxx242hj-pg_net-0.19.5.drv412error: Cannot build '/nix/store/0nn0jglvy3w5hd868rilks6acxx242hj-pg_net-0.19.5.drv'.413 Reason: builder failed with exit code 1.414 Output paths:415 /nix/store/4301s7p0rsq58k2f9hrs6ar4c2a8ya3d-pg_net-0.19.5416error: build of '/nix/store/nwcnf7x9i2zdx48936w9ixsnxzhbab16-pg_net-0.20.0.drv' on 'ssh-ng://nixbot-remote-build@78.232.36.247' failed: Cannot build '/nix/store/nwcnf7x9i2zdx48936w9ixsnxzhbab16-pg_net-0.20.0.drv'.417 Reason: builder failed with exit code 2.418 Output paths:419 /nix/store/5abg792kgyfqqg3w6nh6wfm1jallf5hq-pg_net-0.20.0420 Last 22 log lines:421 > Running phase: unpackPhase422 > unpacking source archive /nix/store/3783i7yhcfqnyv5ndli22gcr11ap151m-source423 > source root is source424 > Running phase: patchPhase425 > Running phase: updateAutotoolsGnuConfigScriptsPhase426 > Running phase: configurePhase427 > no configure script, doing nothing428 > Running phase: buildPhase429 > gcc -Wall -Wmissing-prototypes -Wpointer-arith -Wdeclaration-after-statement -Werror=vla -Wendif-labels -Wmissing-format-attribute -Wimplicit-fallthrough=3 -Wcast-function-type -Wformat-security -fno-strict-aliasing -fwrapv -fexcess-precision=standard -Wno-deprecated-non-prototype -Wno-format-truncation -Wno-stringop-truncation -g -O2 -std=gnu17 -std=c11 -Wextra -Wall -Werror -Wno-declaration-after-statement -Wno-vla -Wno-long-long -Wmissing-variable-declarations -fPIC -DEXTVERSION=\"0.20.0\" -I. -I./ -I/nix/store/48l45fvi99n90x6p9i4cs1lmzby6cb73-postgresql-15.19/include/server -I/nix/store/48l45fvi99n90x6p9i4cs1lmzby6cb73-postgresql-15.19/include/internal -D_GNU_SOURCE -I/nix/store/p17klc3qq4nl9ihfwqfpi8cnqvcf92xz-libxml2-2.15.1-dev/include/libxml2 -I/nix/store/mglbi4dy4kpx7v1dcgf6iincp5x38hsc-lz4-1.10.0-dev/include -I/nix/store/g41q9md9rdcr3lkydi6f8zd6fza3h1q4-zstd-1.5.7-dev/include -I/nix/store/n2vnr7ycfk6midbzxcwd28qj3bgb50cz-icu4c-75.1-dev/include -c -o src/core.o src/core.c430 > gcc -Wall -Wmissing-prototypes -Wpointer-arith -Wdeclaration-after-statement -Werror=vla -Wendif-labels -Wmissing-format-attribute -Wimplicit-fallthrough=3 -Wcast-function-type -Wformat-security -fno-strict-aliasing -fwrapv -fexcess-precision=standard -Wno-deprecated-non-prototype -Wno-format-truncation -Wno-stringop-truncation -g -O2 -std=gnu17 -std=c11 -Wextra -Wall -Werror -Wno-declaration-after-statement -Wno-vla -Wno-long-long -Wmissing-variable-declarations -fPIC -DEXTVERSION=\"0.20.0\" -I. -I./ -I/nix/store/48l45fvi99n90x6p9i4cs1lmzby6cb73-postgresql-15.19/include/server -I/nix/store/48l45fvi99n90x6p9i4cs1lmzby6cb73-postgresql-15.19/include/internal -D_GNU_SOURCE -I/nix/store/p17klc3qq4nl9ihfwqfpi8cnqvcf92xz-libxml2-2.15.1-dev/include/libxml2 -I/nix/store/mglbi4dy4kpx7v1dcgf6iincp5x38hsc-lz4-1.10.0-dev/include -I/nix/store/g41q9md9rdcr3lkydi6f8zd6fza3h1q4-zstd-1.5.7-dev/include -I/nix/store/n2vnr7ycfk6midbzxcwd28qj3bgb50cz-icu4c-75.1-dev/include -c -o src/errors.o src/errors.c431 > gcc -Wall -Wmissing-prototypes -Wpointer-arith -Wdeclaration-after-statement -Werror=vla -Wendif-labels -Wmissing-format-attribute -Wimplicit-fallthrough=3 -Wcast-function-type -Wformat-security -fno-strict-aliasing -fwrapv -fexcess-precision=standard -Wno-deprecated-non-prototype -Wno-format-truncation -Wno-stringop-truncation -g -O2 -std=gnu17 -std=c11 -Wextra -Wall -Werror -Wno-declaration-after-statement -Wno-vla -Wno-long-long -Wmissing-variable-declarations -fPIC -DEXTVERSION=\"0.20.0\" -I. -I./ -I/nix/store/48l45fvi99n90x6p9i4cs1lmzby6cb73-postgresql-15.19/include/server -I/nix/store/48l45fvi99n90x6p9i4cs1lmzby6cb73-postgresql-15.19/include/internal -D_GNU_SOURCE -I/nix/store/p17klc3qq4nl9ihfwqfpi8cnqvcf92xz-libxml2-2.15.1-dev/include/libxml2 -I/nix/store/mglbi4dy4kpx7v1dcgf6iincp5x38hsc-lz4-1.10.0-dev/include -I/nix/store/g41q9md9rdcr3lkydi6f8zd6fza3h1q4-zstd-1.5.7-dev/include -I/nix/store/n2vnr7ycfk6midbzxcwd28qj3bgb50cz-icu4c-75.1-dev/include -c -o src/event.o src/event.c432 > In file included from /nix/store/jviasb44hibgh09829gbmbssbz2jjnhz-curl-8.17.0-dev/include/curl/curl.h:3333,433 > from /nix/store/jviasb44hibgh09829gbmbssbz2jjnhz-curl-8.17.0-dev/include/curl/multi.h:51,434 > from src/event.h:4,435 > from src/event.c:6:436 > /nix/store/jviasb44hibgh09829gbmbssbz2jjnhz-curl-8.17.0-dev/include/curl/multi.h:429:23: error: expected identifier or '(' before '__extension__'437 > 429 | CURL_EXTERN CURLMcode curl_multi_setopt(CURLM *multi_handle,438 > | ^~~~~~~~~~~~~~~~~439 > /nix/store/jviasb44hibgh09829gbmbssbz2jjnhz-curl-8.17.0-dev/include/curl/multi.h:429:23: error: expected identifier or '(' before ')' token440 > 429 | CURL_EXTERN CURLMcode curl_multi_setopt(CURLM *multi_handle,441 > | ^~~~~~~~~~~~~~~~~442 > make: *** [<builtin>: src/event.o] Error 1443 For full logs, run:444 nix log /nix/store/nwcnf7x9i2zdx48936w9ixsnxzhbab16-pg_net-0.20.0.drv445error: Cannot build '/nix/store/nwcnf7x9i2zdx48936w9ixsnxzhbab16-pg_net-0.20.0.drv'.446 Reason: builder failed with exit code 1.447 Output paths:448 /nix/store/5abg792kgyfqqg3w6nh6wfm1jallf5hq-pg_net-0.20.0449error: Cannot build '/nix/store/vvs47f973jig6lflvm7cidm6m20glpy5-pg_net.drv'.450 Reason: 4 dependencies failed.451 Output paths:452 /nix/store/b0bs0di9wnr2lphh29rb3cyghbrpflly-pg_net453error: build of '/nix/store/rfdqkjkjdwz7ydrwlfn9cdy68zz9z6rf-pg_net-0.7.drv' on 'ssh-ng://nixbot-remote-build@78.232.36.247' failed: Cannot build '/nix/store/rfdqkjkjdwz7ydrwlfn9cdy68zz9z6rf-pg_net-0.7.drv'.454 Reason: builder failed with exit code 2.455 Output paths:456 /nix/store/yxd26zp7dvdq20sqsk13x0lk0bqd7j9i-pg_net-0.7457 Last 25 log lines:458 > | ^~~~~~~~~~~~~~459 > src/util.h:6:11: warning: call to 'Wcurl_easy_setopt_err_long' declared with attribute warning: curl_easy_setopt expects a long argument [-Wattribute-warning]460 > 6 | if (curl_easy_setopt(hdl, opt, prm) != CURLE_OK) \461 > | ^~~~~~~~~~~~~~~~462 > src/core.c:108:3: note: in expansion of macro 'CURL_EZ_SETOPT'463 > 108 | CURL_EZ_SETOPT(curl_ez_handle, CURLOPT_TIMEOUT_MS, timeout_milliseconds);464 > | ^~~~~~~~~~~~~~465 > src/util.h:6:11: warning: call to 'Wcurl_easy_setopt_err_long' declared with attribute warning: curl_easy_setopt expects a long argument [-Wattribute-warning]466 > 6 | if (curl_easy_setopt(hdl, opt, prm) != CURLE_OK) \467 > | ^~~~~~~~~~~~~~~~468 > src/core.c:110:3: note: in expansion of macro 'CURL_EZ_SETOPT'469 > 110 | CURL_EZ_SETOPT(curl_ez_handle, CURLOPT_FOLLOWLOCATION, true);470 > | ^~~~~~~~~~~~~~471 > gcc -Wall -Wmissing-prototypes -Wpointer-arith -Wdeclaration-after-statement -Werror=vla -Wendif-labels -Wmissing-format-attribute -Wimplicit-fallthrough=3 -Wcast-function-type -Wformat-security -fno-strict-aliasing -fwrapv -fexcess-precision=standard -Wno-deprecated-non-prototype -Wno-format-truncation -Wno-stringop-truncation -g -O2 -std=gnu17 -std=c11 -Werror -Wno-declaration-after-statement -fPIC -DEXTVERSION=\"0.13.0\" -I. -I./ -I/nix/store/48l45fvi99n90x6p9i4cs1lmzby6cb73-postgresql-15.19/include/server -I/nix/store/48l45fvi99n90x6p9i4cs1lmzby6cb73-postgresql-15.19/include/internal -D_GNU_SOURCE -I/nix/store/p17klc3qq4nl9ihfwqfpi8cnqvcf92xz-libxml2-2.15.1-dev/include/libxml2 -I/nix/store/mglbi4dy4kpx7v1dcgf6iincp5x38hsc-lz4-1.10.0-dev/include -I/nix/store/g41q9md9rdcr3lkydi6f8zd6fza3h1q4-zstd-1.5.7-dev/include -I/nix/store/n2vnr7ycfk6midbzxcwd28qj3bgb50cz-icu4c-75.1-dev/include -c -o src/event.o src/event.c472 > In file included from /nix/store/jviasb44hibgh09829gbmbssbz2jjnhz-curl-8.17.0-dev/include/curl/curl.h:3333,473 > from /nix/store/jviasb44hibgh09829gbmbssbz2jjnhz-curl-8.17.0-dev/include/curl/multi.h:51,474 > from src/event.h:4,475 > from src/event.c:6:476 > /nix/store/jviasb44hibgh09829gbmbssbz2jjnhz-curl-8.17.0-dev/include/curl/multi.h:429:23: error: expected identifier or '(' before '__extension__'477 > 429 | CURL_EXTERN CURLMcode curl_multi_setopt(CURLM *multi_handle,478 > | ^~~~~~~~~~~~~~~~~479 > /nix/store/jviasb44hibgh09829gbmbssbz2jjnhz-curl-8.17.0-dev/include/curl/multi.h:429:23: error: expected identifier or '(' before ')' token480 > 429 | CURL_EXTERN CURLMcode curl_multi_setopt(CURLM *multi_handle,481 > | ^~~~~~~~~~~~~~~~~482 > make: *** [<builtin>: src/event.o] Error 1483 For full logs, run:484 nix log /nix/store/rfdqkjkjdwz7ydrwlfn9cdy68zz9z6rf-pg_net-0.7.drv485error: Cannot build '/nix/store/rfdqkjkjdwz7ydrwlfn9cdy68zz9z6rf-pg_net-0.7.drv'.486 Reason: builder failed with exit code 1.487 Output paths:488 /nix/store/yxd26zp7dvdq20sqsk13x0lk0bqd7j9i-pg_net-0.7489error: Cannot build '/nix/store/q7ak647qv213m4vc4fnr43i09azs1b0p-pg_net.drv'.490 Reason: 5 dependencies failed.491 Output paths:492 /nix/store/9p2ykggx0qabaqhlslb35di6b0ypkcqn-pg_net493error: Cannot build '/nix/store/2fndab8axk4hz4s30ijaxnpa1bc9z1dc-postgresql-and-plugins-17_22.drv'.494 Reason: 1 dependency failed.495 Output paths:496 /nix/store/7f3w5h6iyxryqb3j56n4af0s0y6dy58p-postgresql-and-plugins-17_22497error: Cannot build '/nix/store/w85w5162f9zdpi7g98sjlk186hrrm57p-postgresql-and-plugins-17_22.drv'.498 Reason: 1 dependency failed.499 Output paths:500 /nix/store/c1aavrr5wsqbn4rvrvnln8yaz26zzdmy-postgresql-and-plugins-17_22501error: Cannot build '/nix/store/8r4vw45si1w8qby225b0amhay9ybj6c5-postgresql-orioledb-init.drv'.502 Reason: 1 dependency failed.503 Output paths:504 /nix/store/7c9qf6616nwzqfl6fi7yqdjk4z632qzi-postgresql-orioledb-init505error: Cannot build '/nix/store/9i9flpkzn6d3cvhin3s644150jhvcazf-supabase-orioledb-db-init.drv'.506 Reason: 1 dependency failed.507 Output paths:508 /nix/store/pz04bls9r7r21l14w2igx6amqgcywm60-supabase-orioledb-db-init509error: Cannot build '/nix/store/pgysndf7sfj9ifxk4sy1w8qfx2ln1ws6-unit-postgresql.service.drv'.510 Reason: 2 dependencies failed.511 Output paths:512 /nix/store/yhvd0y4vpmxwxj7c8qkg8gqzjmgbhxfb-unit-postgresql.service513error: Cannot build '/nix/store/s4qicdb2kbzvf3lf6m8xidm4lndgs2yl-unit-supabase-db-init.service.drv'.514 Reason: 1 dependency failed.515 Output paths:516 /nix/store/rzjca48wm4mi0ky3frwwgnm28085ajsx-unit-supabase-db-init.service517error: Cannot build '/nix/store/fakh4z5ssr1vhknp3xv3ch232i3ph2ax-postgresql-and-plugins-15.19.drv'.518 Reason: 1 dependency failed.519 Output paths:520 /nix/store/k465i8vjw8xzi46ymkk5mhqydlcg32bd-postgresql-and-plugins-15.19521error: Cannot build '/nix/store/4z7sbcap8vdzfs1smz81k2crr4sgm640-postgresql-and-plugins-15.19.drv'.522 Reason: 1 dependency failed.523 Output paths:524 /nix/store/41g9k8wa6wm6jr22hn1xa6xzvg03fmbq-postgresql-and-plugins-15.19525error: Cannot build '/nix/store/rjsqz027b1xj9q5dymzvs3wbqn2dv53m-postgresql-init.drv'.526 Reason: 1 dependency failed.527 Output paths:528 /nix/store/mjfcivwp18j0qcajcv5y1w4rgqa438bi-postgresql-init529error: Cannot build '/nix/store/qbfmigmm8fk4v5nhvb8h71hmhmdaky0g-supabase-db-init.drv'.530 Reason: 1 dependency failed.531 Output paths:532 /nix/store/qfjqsqsw03kfjf61y4cq3ffffpd1pywz-supabase-db-init533error: Cannot build '/nix/store/amy1ji0k53n9qihnqys9hvlc60bncr1y-system-path.drv'.534 Reason: 2 dependencies failed.535 Output paths:536 /nix/store/2q4zyfzbw4kd12h0h8y34skah708msd6-system-path537error: Cannot build '/nix/store/q4qvxkwv7rl1jac9sf5aap56gjx0n5mb-system-path.drv'.538 Reason: 1 dependency failed.539 Output paths:540 /nix/store/ai2r0wvs9817lqvy62k93driv4x5j5bq-system-path541error: Cannot build '/nix/store/7ynly7nv4iq2wvhmmg6p100h3wr2dpxd-dbus-1.drv'.542 Reason: 1 dependency failed.543 Output paths:544 /nix/store/89605rggrrq6x9va83f79s492399z47h-dbus-1545error: Cannot build '/nix/store/9in45xg9fcahx70h7alf6jg08sin568q-dbus-1.drv'.546 Reason: 1 dependency failed.547 Output paths:548 /nix/store/cnqrgpjkq8n49z3q3niffxj2sq8cdkb8-dbus-1549error: Cannot build '/nix/store/qsr1582sizlpmavcla4x0gbp3q52g4pd-unit-postgresql.service.drv'.550 Reason: 2 dependencies failed.551 Output paths:552 /nix/store/jdpq4p0ii46fdbn6lk9pvjhr4fn9hlk3-unit-postgresql.service553error: Cannot build '/nix/store/ggfylf6a7iwk3pn3r08m30684z8rrq5l-unit-supabase-db-init.service.drv'.554 Reason: 1 dependency failed.555 Output paths:556 /nix/store/yj5im5r7lvm21a97a04zkn267czbrw3l-unit-supabase-db-init.service557error: Cannot build '/nix/store/jffmpfrihfl3k6lfgdc4ii4a62343h7x-X-Restart-Triggers-dbus.drv'.558 Reason: 1 dependency failed.559 Output paths:560 /nix/store/m1k5hvywmxrzrl65zdy4icssmqjwk1ac-X-Restart-Triggers-dbus561error: Cannot build '/nix/store/v749g53p5djbqg3y7kfvdsw5g535j0js-X-Restart-Triggers-dbus.drv'.562 Reason: 1 dependency failed.563 Output paths:564 /nix/store/bqpmmb848k6lgjk42nmhnfh1lg16q81k-X-Restart-Triggers-dbus565error: Cannot build '/nix/store/0jyfsa7sd5nhfiwbk0i0i0k7bbgigy6z-unit-dbus.service.drv'.566 Reason: 1 dependency failed.567 Output paths:568 /nix/store/m1y0mf2s98whn8ssf75ghzldgsm2i6j9-unit-dbus.service569error: Cannot build '/nix/store/70bg25srcrfnwivfph4bhslzhigdgpxw-unit-dbus.service.drv'.570 Reason: 1 dependency failed.571 Output paths:572 /nix/store/zsgh1qgm3jy8asyqvg4qj0wb78dcrmbr-unit-dbus.service573error: Cannot build '/nix/store/jika4rfg3aj00vq2nfqx2i6nild4nvd5-unit-dbus.service.drv'.574 Reason: 1 dependency failed.575 Output paths:576 /nix/store/hc0bpb6ixv1mffh3g5ks67ha9kjwy2n3-unit-dbus.service577error: Cannot build '/nix/store/n7wg70ga6zm8b0prwd4np0azpi732zji-unit-dbus.service.drv'.578 Reason: 1 dependency failed.579 Output paths:580 /nix/store/x3jdzx5kg815chy5a6mzhahzblz1d3dd-unit-dbus.service581error: Cannot build '/nix/store/dgm1f7y3gvjqjfv7r4gfa7pjffgzr4nj-system-units.drv'.582 Reason: 3 dependencies failed.583 Output paths:584 /nix/store/0m00w4wh2xvzhb9yxz6xjfvg0hzigwis-system-units585error: Cannot build '/nix/store/ydkqsx664pp5ndcfl70c84mvxgixix01-system-units.drv'.586 Reason: 3 dependencies failed.587 Output paths:588 /nix/store/jzv8qrmiimbc1ndwa0a2rv9vrnkyngs2-system-units589error: Cannot build '/nix/store/bmn9rg4vrb07wyj1ls41afzdzcmhdqcm-user-units.drv'.590 Reason: 1 dependency failed.591 Output paths:592 /nix/store/w1bmfz9y06hf43vfs2dfhkbjnqqlb8vc-user-units593error: Cannot build '/nix/store/cpy2j0c5ribiykpjaig0axzryxzh1g69-user-units.drv'.594 Reason: 1 dependency failed.595 Output paths:596 /nix/store/k4q74vb1knwhdc9f757lwy0j04ivgldp-user-units597error: Cannot build '/nix/store/sc9b344gbckg6fqywin6bhhs882d6mxa-etc.drv'.598 Reason: 4 dependencies failed.599 Output paths:600 /nix/store/ckxf8wib3vwm6y41vzjr6qn5s96fai06-etc601error: Cannot build '/nix/store/y3dck3diii9z9x0w771pz541gjd0zwh3-etc.drv'.602 Reason: 4 dependencies failed.603 Output paths:604 /nix/store/0gg4z38348708b6snq8hbw2p0f6212am-etc605error: Cannot build '/nix/store/k4pazrfsvz1hsx7l4d0jsxvan5b3dq49-activate.drv'.606 Reason: 1 dependency failed.607 Output paths:608 /nix/store/kgg6la0id0ridfi2n5d6hjwrslqrr0lc-activate609error: Cannot build '/nix/store/srl146pjpar66ijj6l2zw99pmy6wpkl9-activate.drv'.610 Reason: 1 dependency failed.611 Output paths:612 /nix/store/fl857c057c4yxg6bzz5fxi20v1j54dm8-activate613error: Cannot build '/nix/store/m7z7bg6jaainvrfsikwclppim5yf6kn3-nixos-system-server-test.drv'.614 Reason: 3 dependencies failed.615 Output paths:616 /nix/store/b0ffbnx9s6yib8182ff9056hg0528yi5-nixos-system-server-test617error: Cannot build '/nix/store/9g1i5nj6ki5iylj9b1pa0va72jlmn1wv-nixos-system-server-test.drv'.618 Reason: 4 dependencies failed.619 Output paths:620 /nix/store/4ifl1gw6r3cc2qcwd1h1088dm38n9g59-nixos-system-server-test621error: Cannot build '/nix/store/9ycfv0ahkkahnmw940x08dad2zr7sjgj-closure-info.drv'.622 Reason: 1 dependency failed.623 Output paths:624 /nix/store/gclyxj21006qqwxdivll28pm7sv5c9mp-closure-info625error: Cannot build '/nix/store/jdnzjqsb96phjza6plwl0lk5bm803l44-run-nixos-vm.drv'.626 Reason: 2 dependencies failed.627 Output paths:628 /nix/store/9ksmzn8714bk53318jichv3vmyhrynmb-run-nixos-vm629error: Cannot build '/nix/store/7krir41flncm1mmnhx0r153vwam5gr2r-nixos-vm.drv'.630 Reason: 2 dependencies failed.631 Output paths:632 /nix/store/inbsjr4ffhc9yw63sjlm04lgslc51avv-nixos-vm633error: Cannot build '/nix/store/yngk2c0qc51lqsp65kmrwf9fwx1v4n7d-nixos-test-driver-orioledb.drv'.634 Reason: 2 dependencies failed.635 Output paths:636 /nix/store/mccgzxfa9m28qgvviqza19g8v9psz5m8-nixos-test-driver-orioledb637error: Cannot build '/nix/store/l8123sbvlv02rwm614affqrci9pdigmr-vm-test-run-orioledb.drv'.638 Reason: 1 dependency failed.639 Output paths:640 /nix/store/24ynnwlr5mcm53mzlc0wlqc4w4d85qhz-vm-test-run-orioledb