nixbot

builds

cancelled checks.aarch64-linux.psql_17_cli_portable build #132 · raw · eval 428 ms · 27.1 MiB allocated · ·

1these 31 derivations will be built:2  /nix/store/f4fxzxll7q3m5cy6rib758j63zcky8dk-supabase_vault-0.2.8.drv3  /nix/store/zyzrb73x0fw62dyxqdz0znqnzvgqa7g6-supabase_vault-0.3.1.drv4  /nix/store/0dxji73cc07dbqk8nny6y5mkf5qr6kl8-supabase_vault.drv5  /nix/store/fl27cr5qdrq44nk61x5yjlqxsrc8mg3n-pgsodium-3.0.4.drv6  /nix/store/jl20dg8fxlmlv84f7cda9xa6mq8y46sr-pgsodium-3.1.7.drv7  /nix/store/l6md1p6ahq43yili977j4021ky05la94-pgsodium-3.1.8.drv8  /nix/store/pvz0jf5drhdz4jj5k592kxbdgk4lm52r-pgsodium-3.1.6.drv9  /nix/store/zdz6b4s43i332x3xlvjivc7p4csihzba-pgsodium-3.1.5.drv10  /nix/store/0h7mnh8was4m19z53z0dmakrp0c9271q-pgsodium.drv11  /nix/store/sww4kz29ir2aly4abpn3hb8zfqy4ak06-pg_cron-1.6.4.drv12  /nix/store/9w316phdvwdjv5875fpg98qwdi7hxzv5-pg_cron.drv13  /nix/store/msp1w36fm572jxlq4yj3ilwksxa0qpag-safeupdate-1.4.drv14  /nix/store/fl0xvi8swv20jz0vkfsm12znd6mp9naq-safeupdate.drv15  /nix/store/4dv0hiafadp1s6dx9i8qfwajgh422j5n-pg_graphql-1.6.1.drv16  /nix/store/5sxmls2c3rj1id1jy8cp90d7aga5vs9y-pg_graphql-1.5.9.drv17  /nix/store/6f7pk59bx81p58zx4lxc0kpr0a4pskc3-pg_graphql-1.5.11.drv18  /nix/store/kxm7a9483vsp4n6zn93isjb5z31l42fd-pg_graphql-1.6.2.drv19  /nix/store/k2r44m3w1mwab1ipx8m72764yyhxr38v-pg_graphql.drv20  /nix/store/spanz499my6bkwfl8sjnzkv43143vq24-supautils.drv21  /nix/store/wm59khl5s7k5dd1pmfwsf56ajm7ig68b-postgresql-17.11.drv22  /nix/store/al6g5cvx86v4ljmh3sg6hmlsl3ab3bwf-pg_net-0.20.3.drv23  /nix/store/b1pyvgjyn940h95bbnsp15qmb0qli5gd-pg_net-0.20.0.drv24  /nix/store/cl8ikglrq6jdd2cp01jad7n483mvqj8g-pg_net-0.11.0.drv25  /nix/store/g6nfp5n056kw2jvfzldzxrrrxfpfcka0-pg_net-0.13.0.drv26  /nix/store/xwiwd8fzjgv67zb2ji446a8vxjj3s7bs-pg_net-0.14.0.drv27  /nix/store/yf5z0qi17vprkjz68rqyp804sx929g9n-pg_net-0.19.5.drv28  /nix/store/y02vszvrhs7b6kn8llgwzdmnmhqiymzk-pg_net.drv29  /nix/store/33bgig68s6si0nyqhr7ghqc7p3wavlh4-postgresql-and-plugins-17.11.drv30  /nix/store/f9h8sc1mvq7x7vr3p394773x7zv1szml-postgresql-and-plugins-17.11.drv31  /nix/store/ywx8irsg327xdilahjnr3y98d7lgx8yf-psql_17_cli_portable.drv32  /nix/store/qc1b3912gij7fmmgimpvm3jhkv578gkm-psql_17_cli_portable-portability-check.drv33building '/nix/store/4dv0hiafadp1s6dx9i8qfwajgh422j5n-pg_graphql-1.6.1.drv' on 'ssh-ng://nixbot-remote-build@78.232.36.247'34building '/nix/store/4dv0hiafadp1s6dx9i8qfwajgh422j5n-pg_graphql-1.6.1.drv'35pg_graphql-1.6.1> Running phase: unpackPhase36pg_graphql-1.6.1> unpacking source archive /nix/store/dkddz4rv98rzjsvrcvwg300h6nxbcg54-source37pg_graphql-1.6.1> source root is source38pg_graphql-1.6.1> Executing cargoSetupPostUnpackHook39pg_graphql-1.6.1> Finished cargoSetupPostUnpackHook40pg_graphql-1.6.1> Running phase: patchPhase41pg_graphql-1.6.1> Executing cargoSetupPostPatchHook42pg_graphql-1.6.1> Validating consistency between /build/source/Cargo.lock and /build/cargo-vendor-dir/Cargo.lock43pg_graphql-1.6.1> Finished cargoSetupPostPatchHook44pg_graphql-1.6.1> Running phase: updateAutotoolsGnuConfigScriptsPhase45pg_graphql-1.6.1> Running phase: configurePhase46pg_graphql-1.6.1> Running phase: buildPhase47pg_graphql-1.6.1> Executing cargo-pgrx buildPhase48pg_graphql-1.6.1>    Validating /nix/store/9q4p23a2y63xn8safzzn6lbn07bnkshs-postgresql-17.11/bin/pg_config49pg_graphql-1.6.1>  Initializing data directory at /build/tmp.uttPFneADh/data-1750pg_graphql-1.6.1> waiting for server to start....2026-10-06 14:17:29.899 GMT [72] LOG:  starting PostgreSQL 17.11 on aarch64-unknown-linux-gnu, compiled by gcc (GCC) 15.2.0, 64-bit51pg_graphql-1.6.1> 2026-10-06 14:17:29.902 GMT [72] LOG:  listening on Unix socket "/build/tmp.XQKeymyZKs/.s.PGSQL.5432"52pg_graphql-1.6.1> 2026-10-06 14:17:29.914 GMT [75] LOG:  database system was shut down at 2026-10-06 14:17:29 GMT53pg_graphql-1.6.1> 2026-10-06 14:17:29.920 GMT [72] LOG:  database system is ready to accept connections54pg_graphql-1.6.1>  done55pg_graphql-1.6.1> server started56pg_graphql-1.6.1> createuser: error: connection to server at "localhost" (127.0.0.1), port 5432 failed: Connection refused57pg_graphql-1.6.1> 	Is the server running on that host and accepting TCP/IP connections?58pg_graphql-1.6.1> waiting for server to shut down....2026-10-06 14:17:29.984 GMT [72] LOG:  received fast shutdown request59pg_graphql-1.6.1> 2026-10-06 14:17:29.990 GMT [72] LOG:  aborting any active transactions60pg_graphql-1.6.1> 2026-10-06 14:17:29.992 GMT [72] LOG:  background worker "logical replication launcher" (PID 78) exited with exit code 161pg_graphql-1.6.1> 2026-10-06 14:17:29.994 GMT [73] LOG:  shutting down62pg_graphql-1.6.1> 2026-10-06 14:17:29.997 GMT [73] LOG:  checkpoint starting: shutdown immediate63pg_graphql-1.6.1> 2026-10-06 14:17:30.080 GMT [73] LOG:  checkpoint complete: wrote 3 buffers (0.0%); 0 WAL file(s) added, 0 removed, 0 recycled; write=0.007 s, sync=0.065 s, total=0.087 s; sync files=2, longest=0.064 s, average=0.033 s; distance=0 kB, estimate=0 kB; lsn=0/14EC338, redo lsn=0/14EC33864pg_graphql-1.6.1> 2026-10-06 14:17:30.085 GMT [72] LOG:  database system is shut down65pg_graphql-1.6.1>  done66pg_graphql-1.6.1> server stopped67pg_graphql-1.6.1>        Using PgConfig("pg17") and `pg_config` from /nix/store/9q4p23a2y63xn8safzzn6lbn07bnkshs-postgresql-17.11/bin/pg_config68pg_graphql-1.6.1>     Building extension with features  pg1769pg_graphql-1.6.1>      Running command "/nix/store/8aa27y4zp6s8cv6f6chng7cv416ngp5c-cargo-1.88.0-aarch64-unknown-linux-gnu/bin/cargo" "build" "--lib" "--release" "--features" " pg17" "--no-default-features" "--message-format=json-render-diagnostics" "--frozen" "-j" "2"70pg_graphql-1.6.1>    Compiling proc-macro2 v1.0.10171pg_graphql-1.6.1>    Compiling unicode-ident v1.0.1672pg_graphql-1.6.1>    Compiling libc v0.2.17573pg_graphql-1.6.1>    Compiling stable_deref_trait v1.2.074pg_graphql-1.6.1>    Compiling litemap v0.7.475pg_graphql-1.6.1>    Compiling writeable v0.5.576pg_graphql-1.6.1>    Compiling quote v1.0.4077pg_graphql-1.6.1>    Compiling syn v2.0.9878pg_graphql-1.6.1>    Compiling memchr v2.7.479pg_graphql-1.6.1>    Compiling eyre v0.6.1280pg_graphql-1.6.1>    Compiling serde v1.0.21981pg_graphql-1.6.1>    Compiling thiserror v2.0.1682pg_graphql-1.6.1>    Compiling icu_locid_transform_data v1.5.083pg_graphql-1.6.1>    Compiling icu_properties_data v1.5.084pg_graphql-1.6.1>    Compiling serde_json v1.0.13885pg_graphql-1.6.1>    Compiling shlex v1.3.086pg_graphql-1.6.1>    Compiling smallvec v1.13.287pg_graphql-1.6.1>    Compiling glob v0.3.288pg_graphql-1.6.1>    Compiling icu_normalizer_data v1.5.089pg_graphql-1.6.1>    Compiling utf8_iter v1.0.490pg_graphql-1.6.1>    Compiling utf16_iter v1.0.591pg_graphql-1.6.1>    Compiling write16 v1.0.092pg_graphql-1.6.1>    Compiling clang-sys v1.8.193pg_graphql-1.6.1>    Compiling synstructure v0.13.194pg_graphql-1.6.1>    Compiling anyhow v1.0.9595pg_graphql-1.6.1>    Compiling once_cell v1.21.396pg_graphql-1.6.1>    Compiling winnow v0.7.1397pg_graphql-1.6.1>    Compiling zerofrom-derive v0.1.598pg_graphql-1.6.1>    Compiling yoke-derive v0.7.599pg_graphql-1.6.1>    Compiling zerofrom v0.1.5100pg_graphql-1.6.1>    Compiling zerovec-derive v0.10.3101pg_graphql-1.6.1>    Compiling yoke v0.7.5102pg_graphql-1.6.1>    Compiling displaydoc v0.2.5103pg_graphql-1.6.1>    Compiling serde_derive v1.0.219104pg_graphql-1.6.1>    Compiling zerovec v0.10.4105pg_graphql-1.6.1>    Compiling tinystr v0.7.6106pg_graphql-1.6.1>    Compiling icu_locid v1.5.0107pg_graphql-1.6.1>    Compiling icu_provider_macros v1.5.0108pg_graphql-1.6.1>    Compiling icu_provider v1.5.0109pg_graphql-1.6.1>    Compiling icu_locid_transform v1.5.0110pg_graphql-1.6.1>    Compiling icu_collections v1.5.0111pg_graphql-1.6.1>    Compiling thiserror-impl v2.0.16112pg_graphql-1.6.1>    Compiling icu_properties v1.5.1113pg_graphql-1.6.1>    Compiling indenter v0.3.3114pg_graphql-1.6.1>    Compiling toml_datetime v0.7.0115pg_graphql-1.6.1>    Compiling serde_spanned v1.0.0116pg_graphql-1.6.1>    Compiling toml_parser v1.0.2117pg_graphql-1.6.1>    Compiling icu_normalizer v1.5.0118pg_graphql-1.6.1>    Compiling idna_adapter v1.2.0119pg_graphql-1.6.1>    Compiling cc v1.2.11120pg_graphql-1.6.1>    Compiling aho-corasick v1.1.3121pg_graphql-1.6.1>    Compiling cfg-if v1.0.0122pg_graphql-1.6.1>    Compiling regex-syntax v0.8.5123pg_graphql-1.6.1>    Compiling is_ci v1.2.0124pg_graphql-1.6.1>    Compiling percent-encoding v2.3.1125pg_graphql-1.6.1>    Compiling toml_writer v1.0.2126pg_graphql-1.6.1>    Compiling minimal-lexical v0.2.1127pg_graphql-1.6.1>    Compiling owo-colors v4.2.2128pg_graphql-1.6.1>    Compiling nom v7.1.3129pg_graphql-1.6.1>    Compiling regex-automata v0.4.9130pg_graphql-1.6.1>    Compiling toml v0.9.5131pg_graphql-1.6.1>    Compiling form_urlencoded v1.2.1132pg_graphql-1.6.1>    Compiling supports-color v3.0.2133pg_graphql-1.6.1>    Compiling libloading v0.8.6134pg_graphql-1.6.1>    Compiling idna v1.0.3135pg_graphql-1.6.1>    Compiling either v1.13.0136pg_graphql-1.6.1>    Compiling foldhash v0.1.5137pg_graphql-1.6.1>    Compiling allocator-api2 v0.2.21138pg_graphql-1.6.1>    Compiling syn v1.0.109139pg_graphql-1.6.1>    Compiling unicode-width v0.2.1140pg_graphql-1.6.1>    Compiling getrandom v0.3.1141pg_graphql-1.6.1>    Compiling itoa v1.0.14142pg_graphql-1.6.1>    Compiling anstyle v1.0.10143pg_graphql-1.6.1>    Compiling equivalent v1.0.1144pg_graphql-1.6.1>    Compiling ryu v1.0.19145pg_graphql-1.6.1>    Compiling bindgen v0.71.1146pg_graphql-1.6.1>    Compiling annotate-snippets v0.11.5147pg_graphql-1.6.1>    Compiling hashbrown v0.15.2148pg_graphql-1.6.1>    Compiling itertools v0.13.0149pg_graphql-1.6.1>    Compiling pathsearch v0.2.0150pg_graphql-1.6.1>    Compiling url v2.5.4151pg_graphql-1.6.1>    Compiling regex v1.11.1152pg_graphql-1.6.1>    Compiling cargo_toml v0.22.3153pg_graphql-1.6.1>    Compiling cexpr v0.6.0154pg_graphql-1.6.1>    Compiling rustc-hash v2.1.1155pg_graphql-1.6.1>    Compiling bitflags v2.9.3156pg_graphql-1.6.1>    Compiling same-file v1.0.6157pg_graphql-1.6.1>    Compiling walkdir v2.5.0158pg_graphql-1.6.1>    Compiling pgrx-pg-config v0.16.1159pg_graphql-1.6.1>    Compiling indexmap v2.7.1160pg_graphql-1.6.1>    Compiling unicode-segmentation v1.12.0161pg_graphql-1.6.1>    Compiling fnv v1.0.7162pg_graphql-1.6.1>    Compiling zerocopy v0.8.14163pg_graphql-1.6.1>    Compiling strsim v0.10.0164pg_graphql-1.6.1>    Compiling fixedbitset v0.5.7165pg_graphql-1.6.1>    Compiling ident_case v1.0.1166pg_graphql-1.6.1>    Compiling darling_core v0.14.4167pg_graphql-1.6.1>    Compiling petgraph v0.8.2168pg_graphql-1.6.1>    Compiling convert_case v0.8.0169pg_graphql-1.6.1>    Compiling pgrx-bindgen v0.16.1170pg_graphql-1.6.1>    Compiling cee-scape v0.2.0171pg_graphql-1.6.1>    Compiling zerocopy-derive v0.7.35172pg_graphql-1.6.1>    Compiling byteorder v1.5.0173pg_graphql-1.6.1>    Compiling thiserror v1.0.69174pg_graphql-1.6.1>    Compiling unescape v0.1.0175pg_graphql-1.6.1>    Compiling radium v0.7.0176pg_graphql-1.6.1>    Compiling pgrx-sql-entity-graph v0.16.1177pg_graphql-1.6.1>    Compiling zerocopy v0.7.35178pg_graphql-1.6.1>    Compiling pgrx-pg-sys v0.16.1179pg_graphql-1.6.1>    Compiling darling_macro v0.14.4180pg_graphql-1.6.1>    Compiling thiserror-impl v1.0.69181pg_graphql-1.6.1>    Compiling tap v1.0.1182pg_graphql-1.6.1>    Compiling wyz v0.5.1183pg_graphql-1.6.1>    Compiling rand_core v0.9.0184pg_graphql-1.6.1>    Compiling darling v0.14.4185pg_graphql-1.6.1>    Compiling pgrx-macros v0.16.1186pg_graphql-1.6.1>    Compiling ppv-lite86 v0.2.20187pg_graphql-1.6.1>    Compiling enum-map-derive v0.17.0188pg_graphql-1.6.1>    Compiling bytes v1.11.1189pg_graphql-1.6.1>    Compiling funty v2.0.0190pg_graphql-1.6.1>    Compiling half v1.8.3191pg_graphql-1.6.1>    Compiling serde_cbor v0.11.2192pg_graphql-1.6.1>    Compiling bitvec v1.0.1193pg_graphql-1.6.1>    Compiling combine v4.6.7194pg_graphql-1.6.1>    Compiling enum-map v2.7.3195pg_graphql-1.6.1>    Compiling rand_chacha v0.9.0196pg_graphql-1.6.1>    Compiling cached_proc_macro v0.18.1197pg_graphql-1.6.1>    Compiling uuid v1.18.0198pg_graphql-1.6.1>    Compiling instant v0.1.13199pg_graphql-1.6.1>    Compiling seahash v4.1.0200pg_graphql-1.6.1>    Compiling cached_proc_macro_types v0.1.1201pg_graphql-1.6.1>    Compiling hashbrown v0.14.5202pg_graphql-1.6.1>    Compiling cached v0.46.1203pg_graphql-1.6.1>    Compiling itertools v0.10.5204pg_graphql-1.6.1>    Compiling rand v0.9.3205pg_graphql-1.6.1>    Compiling graphql-parser v0.4.1206pg_graphql-1.6.1>    Compiling pgrx v0.16.1207pg_graphql-1.6.1>    Compiling bimap v0.6.3208pg_graphql-1.6.1>    Compiling lazy_static v1.5.0209pg_graphql-1.6.1>    Compiling base64 v0.13.1210pg_graphql-1.6.1>    Compiling pg_graphql v1.6.1 (/build/source)211pg_graphql-1.6.1>     Finished `release` profile [optimized] target(s) in 3m 10s212pg_graphql-1.6.1>   Installing extension213pg_graphql-1.6.1>      Copying control file to /nix/store/2nprq44pq01msspm197x7h6l8y3ngndx-pg_graphql-1.6.1/nix/store/9q4p23a2y63xn8safzzn6lbn07bnkshs-postgresql-17.11/share/postgresql/extension/pg_graphql.control214pg_graphql-1.6.1>      Copying shared library to /nix/store/2nprq44pq01msspm197x7h6l8y3ngndx-pg_graphql-1.6.1/nix/store/07zklik5dwl2sfqym1gwbrrkfby7lrjn-postgresql-17.11-lib/lib/pg_graphql.so215pg_graphql-1.6.1>   Discovered 5 SQL entities: 0 schemas (0 unique), 1 functions, 0 types, 0 enums, 4 sqls, 0 ords, 0 hashes, 0 aggregates, 0 triggers216pg_graphql-1.6.1>   Rebuilding pgrx_embed, in debug mode, for SQL generation with features  pg17217pg_graphql-1.6.1>    Compiling proc-macro2 v1.0.101218pg_graphql-1.6.1>    Compiling unicode-ident v1.0.16219pg_graphql-1.6.1>    Compiling stable_deref_trait v1.2.0220pg_graphql-1.6.1>    Compiling libc v0.2.175221pg_graphql-1.6.1>    Compiling memchr v2.7.4222pg_graphql-1.6.1>    Compiling quote v1.0.40223pg_graphql-1.6.1>    Compiling syn v2.0.98224pg_graphql-1.6.1>    Compiling cfg-if v1.0.0225pg_graphql-1.6.1>    Compiling writeable v0.5.5226pg_graphql-1.6.1>    Compiling litemap v0.7.4227pg_graphql-1.6.1>    Compiling serde v1.0.219228pg_graphql-1.6.1>    Compiling icu_locid_transform_data v1.5.0229pg_graphql-1.6.1>    Compiling once_cell v1.21.3230pg_graphql-1.6.1>    Compiling thiserror v2.0.16231pg_graphql-1.6.1>    Compiling eyre v0.6.12232pg_graphql-1.6.1>    Compiling icu_properties_data v1.5.0233pg_graphql-1.6.1>    Compiling write16 v1.0.0234pg_graphql-1.6.1>    Compiling equivalent v1.0.1235pg_graphql-1.6.1>    Compiling indenter v0.3.3236pg_graphql-1.6.1>    Compiling shlex v1.3.0237pg_graphql-1.6.1>    Compiling foldhash v0.1.5238pg_graphql-1.6.1>    Compiling icu_normalizer_data v1.5.0239pg_graphql-1.6.1>    Compiling glob v0.3.2240pg_graphql-1.6.1>    Compiling utf16_iter v1.0.5241pg_graphql-1.6.1>    Compiling synstructure v0.13.1242pg_graphql-1.6.1>    Compiling utf8_iter v1.0.4243pg_graphql-1.6.1>    Compiling allocator-api2 v0.2.21244pg_graphql-1.6.1>    Compiling smallvec v1.13.2245pg_graphql-1.6.1>    Compiling hashbrown v0.15.2246pg_graphql-1.6.1>    Compiling clang-sys v1.8.1247pg_graphql-1.6.1>    Compiling zerofrom-derive v0.1.5248pg_graphql-1.6.1>    Compiling yoke-derive v0.7.5249pg_graphql-1.6.1>    Compiling zerovec-derive v0.10.3250pg_graphql-1.6.1>    Compiling zerofrom v0.1.5251pg_graphql-1.6.1>    Compiling yoke v0.7.5252pg_graphql-1.6.1>    Compiling displaydoc v0.2.5253pg_graphql-1.6.1>    Compiling serde_derive v1.0.219254pg_graphql-1.6.1>    Compiling zerovec v0.10.4255pg_graphql-1.6.1>    Compiling tinystr v0.7.6256pg_graphql-1.6.1>    Compiling icu_locid v1.5.0257pg_graphql-1.6.1>    Compiling icu_provider_macros v1.5.0258pg_graphql-1.6.1>    Compiling icu_provider v1.5.0259pg_graphql-1.6.1>    Compiling icu_locid_transform v1.5.0260pg_graphql-1.6.1>    Compiling icu_collections v1.5.0261pg_graphql-1.6.1>    Compiling icu_properties v1.5.1262pg_graphql-1.6.1>    Compiling thiserror-impl v2.0.16263pg_graphql-1.6.1>    Compiling icu_normalizer v1.5.0264pg_graphql-1.6.1>    Compiling winnow v0.7.13265pg_graphql-1.6.1>    Compiling anyhow v1.0.95266pg_graphql-1.6.1>    Compiling serde_json v1.0.138267pg_graphql-1.6.1>    Compiling idna_adapter v1.2.0268pg_graphql-1.6.1>    Compiling serde_spanned v1.0.0269pg_graphql-1.6.1>    Compiling toml_datetime v0.7.0270pg_graphql-1.6.1>    Compiling cc v1.2.11271pg_graphql-1.6.1>    Compiling toml_parser v1.0.2272pg_graphql-1.6.1>    Compiling aho-corasick v1.1.3273pg_graphql-1.6.1>    Compiling ryu v1.0.19274pg_graphql-1.6.1>    Compiling is_ci v1.2.0275pg_graphql-1.6.1>    Compiling minimal-lexical v0.2.1276pg_graphql-1.6.1>    Compiling percent-encoding v2.3.1277pg_graphql-1.6.1>    Compiling itoa v1.0.14278pg_graphql-1.6.1>    Compiling regex-syntax v0.8.5279pg_graphql-1.6.1>    Compiling toml_writer v1.0.2280pg_graphql-1.6.1>    Compiling owo-colors v4.2.2281pg_graphql-1.6.1>    Compiling toml v0.9.5282pg_graphql-1.6.1>    Compiling regex-automata v0.4.9283pg_graphql-1.6.1>    Compiling form_urlencoded v1.2.1284pg_graphql-1.6.1>    Compiling nom v7.1.3285pg_graphql-1.6.1>    Compiling supports-color v3.0.2286pg_graphql-1.6.1>    Compiling idna v1.0.3287pg_graphql-1.6.1>    Compiling libloading v0.8.6288pg_graphql-1.6.1>    Compiling unicode-width v0.2.1289pg_graphql-1.6.1>    Compiling anstyle v1.0.10290pg_graphql-1.6.1>    Compiling syn v1.0.109291pg_graphql-1.6.1>    Compiling getrandom v0.3.1292pg_graphql-1.6.1>    Compiling either v1.13.0293pg_graphql-1.6.1>    Compiling fixedbitset v0.5.7294pg_graphql-1.6.1>    Compiling bindgen v0.71.1295pg_graphql-1.6.1>    Compiling itertools v0.13.0296pg_graphql-1.6.1>    Compiling annotate-snippets v0.11.5297pg_graphql-1.6.1>    Compiling pathsearch v0.2.0298pg_graphql-1.6.1>    Compiling url v2.5.4299pg_graphql-1.6.1>    Compiling regex v1.11.1300pg_graphql-1.6.1>    Compiling cexpr v0.6.0301pg_graphql-1.6.1>    Compiling cargo_toml v0.22.3302pg_graphql-1.6.1>    Compiling rustc-hash v2.1.1303pg_graphql-1.6.1>    Compiling same-file v1.0.6304pg_graphql-1.6.1>    Compiling unicode-segmentation v1.12.0305pg_graphql-1.6.1>    Compiling bitflags v2.9.3306pg_graphql-1.6.1>    Compiling convert_case v0.8.0307pg_graphql-1.6.1>    Compiling walkdir v2.5.0308pg_graphql-1.6.1>    Compiling pgrx-pg-config v0.16.1309pg_graphql-1.6.1>    Compiling indexmap v2.7.1310pg_graphql-1.6.1>    Compiling ident_case v1.0.1311pg_graphql-1.6.1>    Compiling zerocopy v0.8.14312pg_graphql-1.6.1>    Compiling fnv v1.0.7313pg_graphql-1.6.1>    Compiling unescape v0.1.0314pg_graphql-1.6.1>    Compiling strsim v0.10.0315pg_graphql-1.6.1>    Compiling darling_core v0.14.4316pg_graphql-1.6.1>    Compiling petgraph v0.8.2317pg_graphql-1.6.1>    Compiling pgrx-bindgen v0.16.1318pg_graphql-1.6.1>    Compiling cee-scape v0.2.0319pg_graphql-1.6.1>    Compiling zerocopy-derive v0.7.35320pg_graphql-1.6.1>    Compiling byteorder v1.5.0321pg_graphql-1.6.1>    Compiling thiserror v1.0.69322pg_graphql-1.6.1>    Compiling radium v0.7.0323pg_graphql-1.6.1>    Compiling zerocopy v0.7.35324pg_graphql-1.6.1>    Compiling pgrx-pg-sys v0.16.1325pg_graphql-1.6.1>    Compiling pgrx-sql-entity-graph v0.16.1326pg_graphql-1.6.1>    Compiling darling_macro v0.14.4327pg_graphql-1.6.1>    Compiling thiserror-impl v1.0.69328pg_graphql-1.6.1>    Compiling tap v1.0.1329pg_graphql-1.6.1>    Compiling wyz v0.5.1330pg_graphql-1.6.1>    Compiling pgrx-macros v0.16.1331pg_graphql-1.6.1>    Compiling rand_core v0.9.0332pg_graphql-1.6.1>    Compiling darling v0.14.4333pg_graphql-1.6.1>    Compiling ppv-lite86 v0.2.20334pg_graphql-1.6.1>    Compiling enum-map-derive v0.17.0335pg_graphql-1.6.1>    Compiling bytes v1.11.1336pg_graphql-1.6.1>    Compiling funty v2.0.0337pg_graphql-1.6.1>    Compiling half v1.8.3338pg_graphql-1.6.1>    Compiling serde_cbor v0.11.2339pg_graphql-1.6.1>    Compiling bitvec v1.0.1340pg_graphql-1.6.1>    Compiling combine v4.6.7341pg_graphql-1.6.1>    Compiling enum-map v2.7.3342pg_graphql-1.6.1>    Compiling rand_chacha v0.9.0343pg_graphql-1.6.1>    Compiling cached_proc_macro v0.18.1344pg_graphql-1.6.1>    Compiling uuid v1.18.0345pg_graphql-1.6.1>    Compiling instant v0.1.13346pg_graphql-1.6.1>    Compiling seahash v4.1.0347pg_graphql-1.6.1>    Compiling hashbrown v0.14.5348pg_graphql-1.6.1>    Compiling cached_proc_macro_types v0.1.1349pg_graphql-1.6.1>    Compiling cached v0.46.1350pg_graphql-1.6.1>    Compiling itertools v0.10.5351pg_graphql-1.6.1>    Compiling rand v0.9.3352pg_graphql-1.6.1>    Compiling graphql-parser v0.4.1353pg_graphql-1.6.1>    Compiling bimap v0.6.3354pg_graphql-1.6.1>    Compiling lazy_static v1.5.0355pg_graphql-1.6.1>    Compiling base64 v0.13.1356pg_graphql-1.6.1>    Compiling pgrx v0.16.1357pg_graphql-1.6.1>    Compiling pg_graphql v1.6.1 (/build/source)358pg_graphql-1.6.1>     Finished `dev` profile [unoptimized + debuginfo] target(s) in 2m 11s359pg_graphql-1.6.1>      Writing SQL entities to /nix/store/2nprq44pq01msspm197x7h6l8y3ngndx-pg_graphql-1.6.1/nix/store/9q4p23a2y63xn8safzzn6lbn07bnkshs-postgresql-17.11/share/postgresql/extension/pg_graphql--1.6.1.sql360pg_graphql-1.6.1>     Finished installing pg_graphql361pg_graphql-1.6.1> buildPhase completed in 5 minutes 23 seconds362pg_graphql-1.6.1> Running phase: checkPhase363pg_graphql-1.6.1>    Validating /nix/store/9q4p23a2y63xn8safzzn6lbn07bnkshs-postgresql-17.11/bin/pg_config364pg_graphql-1.6.1>  Initializing data directory at /build/tmp.hTSD2uf6Jn/data-17365pg_graphql-1.6.1> waiting for server to start....2026-10-06 14:22:53.642 GMT [5238] LOG:  starting PostgreSQL 17.11 on aarch64-unknown-linux-gnu, compiled by gcc (GCC) 15.2.0, 64-bit366pg_graphql-1.6.1> 2026-10-06 14:22:53.645 GMT [5238] LOG:  listening on Unix socket "/build/tmp.b27ocNTJFk/.s.PGSQL.5432"367pg_graphql-1.6.1> 2026-10-06 14:22:53.669 GMT [5241] LOG:  database system was shut down at 2026-10-06 14:22:53 GMT368pg_graphql-1.6.1> 2026-10-06 14:22:53.676 GMT [5238] LOG:  database system is ready to accept connections369pg_graphql-1.6.1>  done370pg_graphql-1.6.1> server started371pg_graphql-1.6.1> createuser: error: connection to server at "localhost" (127.0.0.1), port 5432 failed: Connection refused372pg_graphql-1.6.1> 	Is the server running on that host and accepting TCP/IP connections?373pg_graphql-1.6.1> waiting for server to shut down....2026-10-06 14:22:53.725 GMT [5238] LOG:  received fast shutdown request374pg_graphql-1.6.1> 2026-10-06 14:22:53.728 GMT [5238] LOG:  aborting any active transactions375pg_graphql-1.6.1> 2026-10-06 14:22:53.732 GMT [5238] LOG:  background worker "logical replication launcher" (PID 5244) exited with exit code 1376pg_graphql-1.6.1> 2026-10-06 14:22:53.732 GMT [5239] LOG:  shutting down377pg_graphql-1.6.1> 2026-10-06 14:22:53.736 GMT [5239] LOG:  checkpoint starting: shutdown immediate378pg_graphql-1.6.1> 2026-10-06 14:22:53.757 GMT [5239] LOG:  checkpoint complete: wrote 3 buffers (0.0%); 0 WAL file(s) added, 0 removed, 0 recycled; write=0.009 s, sync=0.005 s, total=0.025 s; sync files=2, longest=0.004 s, average=0.003 s; distance=0 kB, estimate=0 kB; lsn=0/14EC338, redo lsn=0/14EC338379pg_graphql-1.6.1> 2026-10-06 14:22:53.762 GMT [5238] LOG:  database system is shut down380pg_graphql-1.6.1>  done381pg_graphql-1.6.1> server stopped382pg_graphql-1.6.1>    Validating /build/tmp.4TMwMhgYSZ/17/bin/pg_config383pg_graphql-1.6.1>  Initializing data directory at /build/tmp.4TMwMhgYSZ/data-17384pg_graphql-1.6.1>        Using PgConfig("pg17") and `pg_config` from /build/tmp.4TMwMhgYSZ/17/bin/pg_config385pg_graphql-1.6.1>     Building extension with features pg17386pg_graphql-1.6.1>      Running command "/nix/store/8aa27y4zp6s8cv6f6chng7cv416ngp5c-cargo-1.88.0-aarch64-unknown-linux-gnu/bin/cargo" "build" "--lib" "--release" "--features" "pg17" "--no-default-features" "--message-format=json-render-diagnostics" "--frozen" "-j" "2"387pg_graphql-1.6.1>     Finished `release` profile [optimized] target(s) in 0.14s388pg_graphql-1.6.1>   Installing extension389pg_graphql-1.6.1>      Copying control file to /build/tmp.4TMwMhgYSZ/17/share/postgresql/extension/pg_graphql.control390pg_graphql-1.6.1>      Copying shared library to /build/tmp.4TMwMhgYSZ/17/lib/pg_graphql.so391pg_graphql-1.6.1>   Discovered 5 SQL entities: 0 schemas (0 unique), 1 functions, 0 types, 0 enums, 4 sqls, 0 ords, 0 hashes, 0 aggregates, 0 triggers392pg_graphql-1.6.1>   Rebuilding pgrx_embed, in debug mode, for SQL generation with features pg17393pg_graphql-1.6.1>    Compiling pg_graphql v1.6.1 (/build/source)394pg_graphql-1.6.1>     Finished `dev` profile [unoptimized + debuginfo] target(s) in 15.11s395pg_graphql-1.6.1>      Writing SQL entities to /build/tmp.4TMwMhgYSZ/17/share/postgresql/extension/pg_graphql--1.6.1.sql396pg_graphql-1.6.1>     Finished installing pg_graphql397pg_graphql-1.6.1> ++ mktemp -d398pg_graphql-1.6.1> + TMPDIR=/build/tmp.0POnmGJKLt399pg_graphql-1.6.1> + export PGDATA=/build/tmp.0POnmGJKLt400pg_graphql-1.6.1> + PGDATA=/build/tmp.0POnmGJKLt401pg_graphql-1.6.1> + export PGHOST=/build/tmp.0POnmGJKLt402pg_graphql-1.6.1> + PGHOST=/build/tmp.0POnmGJKLt403pg_graphql-1.6.1> + export PGUSER=postgres404pg_graphql-1.6.1> + PGUSER=postgres405pg_graphql-1.6.1> + export PGDATABASE=postgres406pg_graphql-1.6.1> + PGDATABASE=postgres407pg_graphql-1.6.1> + export PGTZ=UTC408pg_graphql-1.6.1> + PGTZ=UTC409pg_graphql-1.6.1> + export PG_COLOR=auto410pg_graphql-1.6.1> + PG_COLOR=auto411pg_graphql-1.6.1> + trap 'pg_ctl stop -m i' sigint sigterm exit412pg_graphql-1.6.1> + rm -rf /build/tmp.0POnmGJKLt413pg_graphql-1.6.1> + initdb --no-locale --encoding=UTF8 --nosync -U postgres414pg_graphql-1.6.1> The files belonging to this database system will be owned by user "nixbld".415pg_graphql-1.6.1> This user must also own the server process.416pg_graphql-1.6.1> 417pg_graphql-1.6.1> The database cluster will be initialized with locale "C".418pg_graphql-1.6.1> The default text search configuration will be set to "english".419pg_graphql-1.6.1> 420pg_graphql-1.6.1> Data page checksums are disabled.421pg_graphql-1.6.1> 422pg_graphql-1.6.1> creating directory /build/tmp.0POnmGJKLt ... ok423pg_graphql-1.6.1> creating subdirectories ... ok424pg_graphql-1.6.1> selecting dynamic shared memory implementation ... posix425pg_graphql-1.6.1> selecting default "max_connections" ... 100426pg_graphql-1.6.1> selecting default "shared_buffers" ... 128MB427pg_graphql-1.6.1> selecting default time zone ... UTC428pg_graphql-1.6.1> creating configuration files ... ok429pg_graphql-1.6.1> running bootstrap script ... ok430pg_graphql-1.6.1> performing post-bootstrap initialization ... ok431pg_graphql-1.6.1> 432pg_graphql-1.6.1> Sync to disk skipped.433pg_graphql-1.6.1> The data directory might become corrupt if the operating system crashes.434pg_graphql-1.6.1> 435pg_graphql-1.6.1> initdb: warning: enabling "trust" authentication for local connections436pg_graphql-1.6.1> initdb: hint: You can change this by editing pg_hba.conf or using the option -A, or --auth-local and --auth-host, the next time you run initdb.437pg_graphql-1.6.1> 438pg_graphql-1.6.1> Success. You can now start the database server using:439pg_graphql-1.6.1> 440pg_graphql-1.6.1>     /build/tmp.4TMwMhgYSZ/17/bin/pg_ctl -D /build/tmp.0POnmGJKLt -l logfile start441pg_graphql-1.6.1> 442pg_graphql-1.6.1> + pg_ctl start -o '-F -c listen_addresses="" -c log_min_messages=WARNING -k /build/tmp.0POnmGJKLt'443pg_graphql-1.6.1> waiting for server to start....2026-10-06 14:23:11.134 UTC [5512] LOG:  starting PostgreSQL 17.11 on aarch64-unknown-linux-gnu, compiled by gcc (GCC) 15.2.0, 64-bit444pg_graphql-1.6.1> 2026-10-06 14:23:11.135 UTC [5512] LOG:  listening on Unix socket "/build/tmp.0POnmGJKLt/.s.PGSQL.5432"445pg_graphql-1.6.1> 2026-10-06 14:23:11.136 UTC [5515] LOG:  database system was shut down at 2026-10-06 14:23:11 UTC446pg_graphql-1.6.1> 2026-10-06 14:23:11.140 UTC [5512] LOG:  database system is ready to accept connections447pg_graphql-1.6.1>  done448pg_graphql-1.6.1> server started449pg_graphql-1.6.1> + createdb contrib_regression450pg_graphql-1.6.1> + TESTDIR=test451pg_graphql-1.6.1> +++ pg_config --pgxs452pg_graphql-1.6.1> ++ dirname /nix/store/9q4p23a2y63xn8safzzn6lbn07bnkshs-postgresql-17.11/lib/pgxs/src/makefiles/pgxs.mk453pg_graphql-1.6.1> + PGXS=/nix/store/9q4p23a2y63xn8safzzn6lbn07bnkshs-postgresql-17.11/lib/pgxs/src/makefiles454pg_graphql-1.6.1> + REGRESS=/nix/store/9q4p23a2y63xn8safzzn6lbn07bnkshs-postgresql-17.11/lib/pgxs/src/makefiles/../test/regress/pg_regress455pg_graphql-1.6.1> + '[' 0 -ne 0 ']'456pg_graphql-1.6.1> ++ ls test/sql457pg_graphql-1.6.1> ++ sed -e 's/\..*$//'458pg_graphql-1.6.1> ++ sort459pg_graphql-1.6.1> + TESTS=$'aggregate\naggregate_directive\naliases\nallow_camel_names\narray_args_and_return_types\nbigint_is_string\nbuiltin_directives\ncomment_directive\ncomment_directive_description\ncompound_filters\nempty_mutations\nenum_mappings\nextend_type_with_function\nextend_type_with_function_relation\nextend_type_with_generated_column\nfilter_by_node_id\nfragment_on_mutation\nfragment_on_query\nfunction_calls\nfunction_calls_default_args\nfunction_calls_unsupported\nfunction_return_row_is_selectable\nfunction_return_view_has_pkey\ninflection_fields\ninflection_function\ninflection_relationships\ninflection_types\nintrospection\nissue_163\nissue_170\nissue_225\nissue_237_field_merging\nissue_237_field_merging_mismatched\nissue_300\nissue_306\nissue_312\nissue_334_ambiguous_function\nissue_337\nissue_339_function_return_json\nissue_339_function_return_table\nissue_353_too_many_fields\nissue_370_citext_as_string\nissue_373\nissue_377_enum_search_path\nissue_409_fkey_rls_nullability\nissue_444\nissue_463\nissue_511\nissue_533\nissue_542_partial_unique\nissue_551_too_many_fields\nissue_557_1_to_1_nullability\nissue_581_missing_desc_on_schema\nissue_fragment_spread_cycles\njson_is_stringified\nmax_page_size\nmax_rows_directive\nmulti_column_primary_key\nmultiple_mutations\nmultiple_queries\nmutation_delete\nmutation_delete_variable\nmutation_insert\nmutation_update\nnull_argument\nomit_exotic_types\nomit_weird_names\noperation_name\noverride_enum_name\noverride_field_name\noverride_func_field_name\noverride_relationship_field_name\noverride_type_name\npage_info\npermissions_connection_column\npermissions_functions\npermissions_node_column\npermissions_table_level\npermissions_types\nprimary_key_is_required\nprimary_key_queries\nrelationship_one_to_one\nresolve___schema\nresolve___type\nresolve___typename\nresolve_array_type\nresolve_connection_filter\nresolve_connection_named\nresolve_connection_order_by\nresolve_connection_pagination_args\nresolve_connection_to_conn\nresolve_connection_to_node\nresolve_error_connection_edge_no_field\nresolve_error_connection_edge_node_no_field\nresolve_error_connection_no_field\nresolve_error_from_parser\nresolve_error_mutation_no_field\nresolve_error_node_no_field\nresolve_error_query_no_field\nresolve_fragment\nresolve_graphiql_schema\nresolve_one\nroundtrip_types\nrow_level_security\nsqli_connection\nstring_filters\ntest_error_anon_and_named_operations\ntest_error_invalid_offset\ntest_error_multiple_anon_operations\ntest_error_mutation_transpilation\ntest_error_operation_name_not_found\ntest_error_operation_names_not_unique\ntest_error_query_transpilation\ntest_error_subscription\ntest_query__type\ntotal_count\ntype_bigfloat\ntype_modifier_max_length\ntype_opaque\nvariable_default\nviews_integration'460pg_graphql-1.6.1> + psql -v ON_ERROR_STOP=1 -f test/fixtures.sql -d contrib_regression461pg_graphql-1.6.1> psql:test/fixtures.sql:1: NOTICE:  extension "pg_graphql" does not exist, skipping462pg_graphql-1.6.1> DROP EXTENSION463pg_graphql-1.6.1> CREATE EXTENSION464pg_graphql-1.6.1> COMMENT465pg_graphql-1.6.1> CREATE FUNCTION466pg_graphql-1.6.1> + /nix/store/9q4p23a2y63xn8safzzn6lbn07bnkshs-postgresql-17.11/lib/pgxs/src/makefiles/../test/regress/pg_regress --use-existing --dbname=contrib_regression --inputdir=test aggregate aggregate_directive aliases allow_camel_names array_args_and_return_types bigint_is_string builtin_directives comment_directive comment_directive_description compound_filters empty_mutations enum_mappings extend_type_with_function extend_type_with_function_relation extend_type_with_generated_column filter_by_node_id fragment_on_mutation fragment_on_query function_calls function_calls_default_args function_calls_unsupported function_return_row_is_selectable function_return_view_has_pkey inflection_fields inflection_function inflection_relationships inflection_types introspection issue_163 issue_170 issue_225 issue_237_field_merging issue_237_field_merging_mismatched issue_300 issue_306 issue_312 issue_334_ambiguous_function issue_337 issue_339_function_return_json issue_339_function_return_table issue_353_too_many_fields issue_370_citext_as_string issue_373 issue_377_enum_search_path issue_409_fkey_rls_nullability issue_444 issue_463 issue_511 issue_533 issue_542_partial_unique issue_551_too_many_fields issue_557_1_to_1_nullability issue_581_missing_desc_on_schema issue_fragment_spread_cycles json_is_stringified max_page_size max_rows_directive multi_column_primary_key multiple_mutations multiple_queries mutation_delete mutation_delete_variable mutation_insert mutation_update null_argument omit_exotic_types omit_weird_names operation_name override_enum_name override_field_name override_func_field_name override_relationship_field_name override_type_name page_info permissions_connection_column permissions_functions permissions_node_column permissions_table_level permissions_types primary_key_is_required primary_key_queries relationship_one_to_one resolve___schema resolve___type resolve___typename resolve_array_type resolve_connection_filter resolve_connection_named resolve_connection_order_by resolve_connection_pagination_args resolve_connection_to_conn resolve_connection_to_node resolve_error_connection_edge_no_field resolve_error_connection_edge_node_no_field resolve_error_connection_no_field resolve_error_from_parser resolve_error_mutation_no_field resolve_error_node_no_field resolve_error_query_no_field resolve_fragment resolve_graphiql_schema resolve_one roundtrip_types row_level_security sqli_connection string_filters test_error_anon_and_named_operations test_error_invalid_offset test_error_multiple_anon_operations test_error_mutation_transpilation test_error_operation_name_not_found test_error_operation_names_not_unique test_error_query_transpilation test_error_subscription test_query__type total_count type_bigfloat type_modifier_max_length type_opaque variable_default views_integration467pg_graphql-1.6.1> # using postmaster on /build/tmp.0POnmGJKLt, default port468pg_graphql-1.6.1> ok 1         - aggregate                                  86 ms469pg_graphql-1.6.1> ok 2         - aggregate_directive                        74 ms470pg_graphql-1.6.1> ok 3         - aliases                                    54 ms471pg_graphql-1.6.1> ok 4         - allow_camel_names                          59 ms472pg_graphql-1.6.1> ok 5         - array_args_and_return_types              1557 ms473pg_graphql-1.6.1> ok 6         - bigint_is_string                           54 ms474pg_graphql-1.6.1> ok 7         - builtin_directives                         63 ms475pg_graphql-1.6.1> ok 8         - comment_directive                          10 ms476pg_graphql-1.6.1> ok 9         - comment_directive_description              48 ms477pg_graphql-1.6.1> ok 10        - compound_filters                          259 ms478pg_graphql-1.6.1> ok 11        - empty_mutations                            52 ms479pg_graphql-1.6.1> ok 12        - enum_mappings                              56 ms480pg_graphql-1.6.1> ok 13        - extend_type_with_function                  52 ms481pg_graphql-1.6.1> ok 14        - extend_type_with_function_relation        140 ms482pg_graphql-1.6.1> ok 15        - extend_type_with_generated_column          48 ms483pg_graphql-1.6.1> ok 16        - filter_by_node_id                          53 ms484pg_graphql-1.6.1> ok 17        - fragment_on_mutation                       47 ms485pg_graphql-1.6.1> ok 18        - fragment_on_query                          47 ms486pg_graphql-1.6.1> ok 19        - function_calls                           1326 ms487pg_graphql-1.6.1> ok 20        - function_calls_default_args                97 ms488pg_graphql-1.6.1> ok 21        - function_calls_unsupported                291 ms489pg_graphql-1.6.1> ok 22        - function_return_row_is_selectable          82 ms490pg_graphql-1.6.1> ok 23        - function_return_view_has_pkey              73 ms491pg_graphql-1.6.1> ok 24        - inflection_fields                         123 ms492pg_graphql-1.6.1> ok 25        - inflection_function                       125 ms493pg_graphql-1.6.1> ok 26        - inflection_relationships                  186 ms494pg_graphql-1.6.1> ok 27        - inflection_types                          128 ms495pg_graphql-1.6.1> ok 28        - introspection                             250 ms496pg_graphql-1.6.1> ok 29        - issue_163                                  47 ms497pg_graphql-1.6.1> ok 30        - issue_170                                  48 ms498pg_graphql-1.6.1> ok 31        - issue_225                                  51 ms499pg_graphql-1.6.1> ok 32        - issue_237_field_merging                    90 ms500pg_graphql-1.6.1> ok 33        - issue_237_field_merging_mismatched         85 ms501pg_graphql-1.6.1> ok 34        - issue_300                                  55 ms502pg_graphql-1.6.1> ok 35        - issue_306                                  56 ms503pg_graphql-1.6.1> ok 36        - issue_312                                  53 ms504pg_graphql-1.6.1> ok 37        - issue_334_ambiguous_function               52 ms505pg_graphql-1.6.1> ok 38        - issue_337                                  87 ms506pg_graphql-1.6.1> ok 39        - issue_339_function_return_json             50 ms507pg_graphql-1.6.1> ok 40        - issue_339_function_return_table            48 ms508pg_graphql-1.6.1> ok 41        - issue_353_too_many_fields                  59 ms509pg_graphql-1.6.1> ok 42        - issue_370_citext_as_string                 66 ms510pg_graphql-1.6.1> ok 43        - issue_373                                  52 ms511pg_graphql-1.6.1> ok 44        - issue_377_enum_search_path                 74 ms512pg_graphql-1.6.1> ok 45        - issue_409_fkey_rls_nullability            104 ms513pg_graphql-1.6.1> ok 46        - issue_444                                  43 ms514pg_graphql-1.6.1> ok 47        - issue_463                                  50 ms515pg_graphql-1.6.1> ok 48        - issue_511                                  55 ms516pg_graphql-1.6.1> ok 49        - issue_533                                  96 ms517pg_graphql-1.6.1> ok 50        - issue_542_partial_unique                   78 ms518pg_graphql-1.6.1> ok 51        - issue_551_too_many_fields                  67 ms519pg_graphql-1.6.1> ok 52        - issue_557_1_to_1_nullability               54 ms520pg_graphql-1.6.1> ok 53        - issue_581_missing_desc_on_schema           50 ms521pg_graphql-1.6.1> ok 54        - issue_fragment_spread_cycles              209 ms522pg_graphql-1.6.1> ok 55        - json_is_stringified                        52 ms523pg_graphql-1.6.1> ok 56        - max_page_size                              48 ms524pg_graphql-1.6.1> ok 57        - max_rows_directive                        193 ms525pg_graphql-1.6.1> ok 58        - multi_column_primary_key                   59 ms526pg_graphql-1.6.1> ok 59        - multiple_mutations                         49 ms527pg_graphql-1.6.1> ok 60        - multiple_queries                           50 ms528pg_graphql-1.6.1> ok 61        - mutation_delete                            62 ms529pg_graphql-1.6.1> ok 62        - mutation_delete_variable                   50 ms530pg_graphql-1.6.1> ok 63        - mutation_insert                            60 ms531pg_graphql-1.6.1> ok 64        - mutation_update                            64 ms532pg_graphql-1.6.1> ok 65        - null_argument                              47 ms533pg_graphql-1.6.1> ok 66        - omit_exotic_types                          49 ms534pg_graphql-1.6.1> ok 67        - omit_weird_names                           74 ms535pg_graphql-1.6.1> ok 68        - operation_name                             50 ms536pg_graphql-1.6.1> ok 69        - override_enum_name                         44 ms537pg_graphql-1.6.1> ok 70        - override_field_name                        47 ms538pg_graphql-1.6.1> ok 71        - override_func_field_name                   48 ms539pg_graphql-1.6.1> ok 72        - override_relationship_field_name           51 ms540pg_graphql-1.6.1> ok 73        - override_type_name                         47 ms541pg_graphql-1.6.1> ok 74        - page_info                                  68 ms542pg_graphql-1.6.1> ok 75        - permissions_connection_column              85 ms543pg_graphql-1.6.1> ok 76        - permissions_functions                      79 ms544pg_graphql-1.6.1> ok 77        - permissions_node_column                    87 ms545pg_graphql-1.6.1> ok 78        - permissions_table_level                   166 ms546pg_graphql-1.6.1> ok 79        - permissions_types                          97 ms547pg_graphql-1.6.1> ok 80        - primary_key_is_required                    75 ms548pg_graphql-1.6.1> ok 81        - primary_key_queries                       271 ms549pg_graphql-1.6.1> ok 82        - relationship_one_to_one                    54 ms550pg_graphql-1.6.1> ok 83        - resolve___schema                           59 ms551pg_graphql-1.6.1> ok 84        - resolve___type                             47 ms552pg_graphql-1.6.1> ok 85        - resolve___typename                        110 ms553pg_graphql-1.6.1> ok 86        - resolve_array_type                         51 ms554pg_graphql-1.6.1> ok 87        - resolve_connection_filter                 113 ms555pg_graphql-1.6.1> ok 88        - resolve_connection_named                   50 ms556pg_graphql-1.6.1> ok 89        - resolve_connection_order_by                80 ms557pg_graphql-1.6.1> ok 90        - resolve_connection_pagination_args         99 ms558pg_graphql-1.6.1> ok 91        - resolve_connection_to_conn                 55 ms559pg_graphql-1.6.1> ok 92        - resolve_connection_to_node                 52 ms560pg_graphql-1.6.1> ok 93        - resolve_error_connection_edge_no_field       44 ms561pg_graphql-1.6.1> ok 94        - resolve_error_connection_edge_node_no_field       46 ms562pg_graphql-1.6.1> ok 95        - resolve_error_connection_no_field          45 ms563pg_graphql-1.6.1> ok 96        - resolve_error_from_parser                  11 ms564pg_graphql-1.6.1> ok 97        - resolve_error_mutation_no_field            41 ms565pg_graphql-1.6.1> ok 98        - resolve_error_node_no_field                49 ms566pg_graphql-1.6.1> ok 99        - resolve_error_query_no_field               42 ms567pg_graphql-1.6.1> ok 100       - resolve_fragment                           50 ms568pg_graphql-1.6.1> ok 101       - resolve_graphiql_schema                   109 ms569pg_graphql-1.6.1> ok 102       - resolve_one                                88 ms570pg_graphql-1.6.1> ok 103       - roundtrip_types                            62 ms571pg_graphql-1.6.1> ok 104       - row_level_security                         52 ms572pg_graphql-1.6.1> ok 105       - sqli_connection                            59 ms573pg_graphql-1.6.1> ok 106       - string_filters                             65 ms574pg_graphql-1.6.1> ok 107       - test_error_anon_and_named_operations       49 ms575pg_graphql-1.6.1> ok 108       - test_error_invalid_offset                  81 ms576pg_graphql-1.6.1> ok 109       - test_error_multiple_anon_operations        40 ms577pg_graphql-1.6.1> ok 110       - test_error_mutation_transpilation          48 ms578pg_graphql-1.6.1> ok 111       - test_error_operation_name_not_found        45 ms579pg_graphql-1.6.1> ok 112       - test_error_operation_names_not_unique       41 ms580pg_graphql-1.6.1> ok 113       - test_error_query_transpilation             50 ms581pg_graphql-1.6.1> ok 114       - test_error_subscription                    40 ms582pg_graphql-1.6.1> ok 115       - test_query__type                           42 ms583pg_graphql-1.6.1> ok 116       - total_count                                76 ms584pg_graphql-1.6.1> ok 117       - type_bigfloat                              53 ms585pg_graphql-1.6.1> ok 118       - type_modifier_max_length                   51 ms586pg_graphql-1.6.1> ok 119       - type_opaque                                53 ms587pg_graphql-1.6.1> ok 120       - variable_default                           52 ms588pg_graphql-1.6.1> ok 121       - views_integration                         170 ms589pg_graphql-1.6.1> 1..121590pg_graphql-1.6.1> # All 121 tests passed.591pg_graphql-1.6.1> + pg_ctl stop -m i592pg_graphql-1.6.1> waiting for server to shut down...2026-10-06 14:23:23.227 UTC [5512] LOG:  received immediate shutdown request593pg_graphql-1.6.1> .2026-10-06 14:23:23.233 UTC [5512] LOG:  database system is shut down594pg_graphql-1.6.1>  done595pg_graphql-1.6.1> server stopped596pg_graphql-1.6.1> checkPhase completed in 31 seconds597pg_graphql-1.6.1> Running phase: installPhase598pg_graphql-1.6.1> Executing buildPgrxExtension install599pg_graphql-1.6.1> Running phase: fixupPhase600pg_graphql-1.6.1> shrinking RPATHs of ELF executables and libraries in /nix/store/2nprq44pq01msspm197x7h6l8y3ngndx-pg_graphql-1.6.1601pg_graphql-1.6.1> shrinking /nix/store/2nprq44pq01msspm197x7h6l8y3ngndx-pg_graphql-1.6.1/lib/pg_graphql-1.6.1.so602pg_graphql-1.6.1> checking for references to /build/ in /nix/store/2nprq44pq01msspm197x7h6l8y3ngndx-pg_graphql-1.6.1...603pg_graphql-1.6.1> patching script interpreter paths in /nix/store/2nprq44pq01msspm197x7h6l8y3ngndx-pg_graphql-1.6.1604pg_graphql-1.6.1> stripping (with command strip and flags -S -p) in  /nix/store/2nprq44pq01msspm197x7h6l8y3ngndx-pg_graphql-1.6.1/lib605pg_graphql-1.6.1> stripping (with command strip and flags -s -p) in  /nix/store/2nprq44pq01msspm197x7h6l8y3ngndx-pg_graphql-1.6.1/lib606building '/nix/store/g6nfp5n056kw2jvfzldzxrrrxfpfcka0-pg_net-0.13.0.drv' on 'ssh-ng://nixbot-remote-build@78.232.36.247'607building '/nix/store/g6nfp5n056kw2jvfzldzxrrrxfpfcka0-pg_net-0.13.0.drv'608pg_net-0.13.0> Running phase: unpackPhase609pg_net-0.13.0> unpacking source archive /nix/store/bxdzbzjn4yi7ch55dlcgzk6npzx2p4jz-source610pg_net-0.13.0> source root is source611pg_net-0.13.0> Running phase: patchPhase612pg_net-0.13.0> Running phase: updateAutotoolsGnuConfigScriptsPhase613pg_net-0.13.0> Running phase: configurePhase614pg_net-0.13.0> no configure script, doing nothing615pg_net-0.13.0> Running phase: buildPhase616pg_net-0.13.0> gcc -Wall -Wmissing-prototypes -Wpointer-arith -Wdeclaration-after-statement -Werror=vla -Wendif-labels -Wmissing-format-attribute -Wimplicit-fallthrough=3 -Wcast-function-type -Wshadow=compatible-local -Wformat-security -fno-strict-aliasing -fwrapv -fexcess-precision=standard -Wno-format-truncation -Wno-stringop-truncation -g -O2 -std=c11 -Werror -Wno-declaration-after-statement -fPIC -fvisibility=hidden  -DEXTVERSION=\"0.13.0\" -I. -I./ -I/nix/store/9q4p23a2y63xn8safzzn6lbn07bnkshs-postgresql-17.11/include/server -I/nix/store/9q4p23a2y63xn8safzzn6lbn07bnkshs-postgresql-17.11/include/internal -D_GNU_SOURCE  -I/nix/store/p17klc3qq4nl9ihfwqfpi8cnqvcf92xz-libxml2-2.15.1-dev/include/libxml2 -I/nix/store/mglbi4dy4kpx7v1dcgf6iincp5x38hsc-lz4-1.10.0-dev/include -I/nix/store/g41q9md9rdcr3lkydi6f8zd6fza3h1q4-zstd-1.5.7-dev/include -I/nix/store/n2vnr7ycfk6midbzxcwd28qj3bgb50cz-icu4c-75.1-dev/include  -c -o src/worker.o src/worker.c617pg_net-0.13.0> gcc -Wall -Wmissing-prototypes -Wpointer-arith -Wdeclaration-after-statement -Werror=vla -Wendif-labels -Wmissing-format-attribute -Wimplicit-fallthrough=3 -Wcast-function-type -Wshadow=compatible-local -Wformat-security -fno-strict-aliasing -fwrapv -fexcess-precision=standard -Wno-format-truncation -Wno-stringop-truncation -g -O2 -std=c11 -Werror -Wno-declaration-after-statement -fPIC -fvisibility=hidden  -DEXTVERSION=\"0.13.0\" -I. -I./ -I/nix/store/9q4p23a2y63xn8safzzn6lbn07bnkshs-postgresql-17.11/include/server -I/nix/store/9q4p23a2y63xn8safzzn6lbn07bnkshs-postgresql-17.11/include/internal -D_GNU_SOURCE  -I/nix/store/p17klc3qq4nl9ihfwqfpi8cnqvcf92xz-libxml2-2.15.1-dev/include/libxml2 -I/nix/store/mglbi4dy4kpx7v1dcgf6iincp5x38hsc-lz4-1.10.0-dev/include -I/nix/store/g41q9md9rdcr3lkydi6f8zd6fza3h1q4-zstd-1.5.7-dev/include -I/nix/store/n2vnr7ycfk6midbzxcwd28qj3bgb50cz-icu4c-75.1-dev/include  -c -o src/util.o src/util.c618pg_net-0.13.0> gcc -Wall -Wmissing-prototypes -Wpointer-arith -Wdeclaration-after-statement -Werror=vla -Wendif-labels -Wmissing-format-attribute -Wimplicit-fallthrough=3 -Wcast-function-type -Wshadow=compatible-local -Wformat-security -fno-strict-aliasing -fwrapv -fexcess-precision=standard -Wno-format-truncation -Wno-stringop-truncation -g -O2 -std=c11 -Werror -Wno-declaration-after-statement -fPIC -fvisibility=hidden  -DEXTVERSION=\"0.13.0\" -I. -I./ -I/nix/store/9q4p23a2y63xn8safzzn6lbn07bnkshs-postgresql-17.11/include/server -I/nix/store/9q4p23a2y63xn8safzzn6lbn07bnkshs-postgresql-17.11/include/internal -D_GNU_SOURCE  -I/nix/store/p17klc3qq4nl9ihfwqfpi8cnqvcf92xz-libxml2-2.15.1-dev/include/libxml2 -I/nix/store/mglbi4dy4kpx7v1dcgf6iincp5x38hsc-lz4-1.10.0-dev/include -I/nix/store/g41q9md9rdcr3lkydi6f8zd6fza3h1q4-zstd-1.5.7-dev/include -I/nix/store/n2vnr7ycfk6midbzxcwd28qj3bgb50cz-icu4c-75.1-dev/include  -c -o src/core.o src/core.c619pg_net-0.13.0> In file included from src/core.c:23:620pg_net-0.13.0> In function 'init_curl_handle',621pg_net-0.13.0>     inlined from 'consume_request_queue' at src/core.c:273:5:622pg_net-0.13.0> src/util.h:6:11: warning: call to 'Wcurl_easy_setopt_err_long' declared with attribute warning: curl_easy_setopt expects a long argument [-Wattribute-warning]623pg_net-0.13.0>     6 |       if (curl_easy_setopt(hdl, opt, prm) != CURLE_OK) \624pg_net-0.13.0>       |           ^~~~~~~~~~~~~~~~625pg_net-0.13.0> src/core.c:94:7: note: in expansion of macro 'CURL_EZ_SETOPT'626pg_net-0.13.0>    94 |       CURL_EZ_SETOPT(curl_ez_handle, CURLOPT_POST, 1);627pg_net-0.13.0>       |       ^~~~~~~~~~~~~~628pg_net-0.13.0> src/util.h:6:11: warning: call to 'Wcurl_easy_setopt_err_long' declared with attribute warning: curl_easy_setopt expects a long argument [-Wattribute-warning]629pg_net-0.13.0>     6 |       if (curl_easy_setopt(hdl, opt, prm) != CURLE_OK) \630pg_net-0.13.0>       |           ^~~~~~~~~~~~~~~~631pg_net-0.13.0> src/core.c:95:7: note: in expansion of macro 'CURL_EZ_SETOPT'632pg_net-0.13.0>    95 |       CURL_EZ_SETOPT(curl_ez_handle, CURLOPT_POSTFIELDSIZE, 0);633pg_net-0.13.0>       |       ^~~~~~~~~~~~~~634pg_net-0.13.0> src/util.h:6:11: warning: call to 'Wcurl_easy_setopt_err_long' declared with attribute warning: curl_easy_setopt expects a long argument [-Wattribute-warning]635pg_net-0.13.0>     6 |       if (curl_easy_setopt(hdl, opt, prm) != CURLE_OK) \636pg_net-0.13.0>       |           ^~~~~~~~~~~~~~~~637pg_net-0.13.0> src/core.c:108:3: note: in expansion of macro 'CURL_EZ_SETOPT'638pg_net-0.13.0>   108 |   CURL_EZ_SETOPT(curl_ez_handle, CURLOPT_TIMEOUT_MS, timeout_milliseconds);639pg_net-0.13.0>       |   ^~~~~~~~~~~~~~640pg_net-0.13.0> src/util.h:6:11: warning: call to 'Wcurl_easy_setopt_err_long' declared with attribute warning: curl_easy_setopt expects a long argument [-Wattribute-warning]641pg_net-0.13.0>     6 |       if (curl_easy_setopt(hdl, opt, prm) != CURLE_OK) \642pg_net-0.13.0>       |           ^~~~~~~~~~~~~~~~643pg_net-0.13.0> src/core.c:110:3: note: in expansion of macro 'CURL_EZ_SETOPT'644pg_net-0.13.0>   110 |   CURL_EZ_SETOPT(curl_ez_handle, CURLOPT_FOLLOWLOCATION, true);645pg_net-0.13.0>       |   ^~~~~~~~~~~~~~646pg_net-0.13.0> gcc -Wall -Wmissing-prototypes -Wpointer-arith -Wdeclaration-after-statement -Werror=vla -Wendif-labels -Wmissing-format-attribute -Wimplicit-fallthrough=3 -Wcast-function-type -Wshadow=compatible-local -Wformat-security -fno-strict-aliasing -fwrapv -fexcess-precision=standard -Wno-format-truncation -Wno-stringop-truncation -g -O2 -std=c11 -Werror -Wno-declaration-after-statement -fPIC -fvisibility=hidden  -DEXTVERSION=\"0.13.0\" -I. -I./ -I/nix/store/9q4p23a2y63xn8safzzn6lbn07bnkshs-postgresql-17.11/include/server -I/nix/store/9q4p23a2y63xn8safzzn6lbn07bnkshs-postgresql-17.11/include/internal -D_GNU_SOURCE  -I/nix/store/p17klc3qq4nl9ihfwqfpi8cnqvcf92xz-libxml2-2.15.1-dev/include/libxml2 -I/nix/store/mglbi4dy4kpx7v1dcgf6iincp5x38hsc-lz4-1.10.0-dev/include -I/nix/store/g41q9md9rdcr3lkydi6f8zd6fza3h1q4-zstd-1.5.7-dev/include -I/nix/store/n2vnr7ycfk6midbzxcwd28qj3bgb50cz-icu4c-75.1-dev/include  -c -o src/event.o src/event.c647pg_net-0.13.0> In file included from /nix/store/jviasb44hibgh09829gbmbssbz2jjnhz-curl-8.17.0-dev/include/curl/curl.h:3333,648pg_net-0.13.0>                  from /nix/store/jviasb44hibgh09829gbmbssbz2jjnhz-curl-8.17.0-dev/include/curl/multi.h:51,649pg_net-0.13.0>                  from src/event.h:4,650pg_net-0.13.0>                  from src/event.c:6:651pg_net-0.13.0> /nix/store/jviasb44hibgh09829gbmbssbz2jjnhz-curl-8.17.0-dev/include/curl/multi.h:429:23: error: expected identifier or '(' before '__extension__'652pg_net-0.13.0>   429 | CURL_EXTERN CURLMcode curl_multi_setopt(CURLM *multi_handle,653pg_net-0.13.0>       |                       ^~~~~~~~~~~~~~~~~654pg_net-0.13.0> /nix/store/jviasb44hibgh09829gbmbssbz2jjnhz-curl-8.17.0-dev/include/curl/multi.h:429:23: error: expected identifier or '(' before ')' token655pg_net-0.13.0>   429 | CURL_EXTERN CURLMcode curl_multi_setopt(CURLM *multi_handle,656pg_net-0.13.0>       |                       ^~~~~~~~~~~~~~~~~657pg_net-0.13.0> make: *** [<builtin>: src/event.o] Error 1658error: build of '/nix/store/g6nfp5n056kw2jvfzldzxrrrxfpfcka0-pg_net-0.13.0.drv' on 'ssh-ng://nixbot-remote-build@78.232.36.247' failed: Cannot build '/nix/store/g6nfp5n056kw2jvfzldzxrrrxfpfcka0-pg_net-0.13.0.drv'.659       Reason: builder failed with exit code 2.660       Output paths:661         /nix/store/0z6qc5i8vhckm5s9j7br24f5kfxsgds5-pg_net-0.13.0662       Last 25 log lines:663       >       |       ^~~~~~~~~~~~~~664       > src/util.h:6:11: warning: call to 'Wcurl_easy_setopt_err_long' declared with attribute warning: curl_easy_setopt expects a long argument [-Wattribute-warning]665       >     6 |       if (curl_easy_setopt(hdl, opt, prm) != CURLE_OK) \666       >       |           ^~~~~~~~~~~~~~~~667       > src/core.c:108:3: note: in expansion of macro 'CURL_EZ_SETOPT'668       >   108 |   CURL_EZ_SETOPT(curl_ez_handle, CURLOPT_TIMEOUT_MS, timeout_milliseconds);669       >       |   ^~~~~~~~~~~~~~670       > src/util.h:6:11: warning: call to 'Wcurl_easy_setopt_err_long' declared with attribute warning: curl_easy_setopt expects a long argument [-Wattribute-warning]671       >     6 |       if (curl_easy_setopt(hdl, opt, prm) != CURLE_OK) \672       >       |           ^~~~~~~~~~~~~~~~673       > src/core.c:110:3: note: in expansion of macro 'CURL_EZ_SETOPT'674       >   110 |   CURL_EZ_SETOPT(curl_ez_handle, CURLOPT_FOLLOWLOCATION, true);675       >       |   ^~~~~~~~~~~~~~676       > gcc -Wall -Wmissing-prototypes -Wpointer-arith -Wdeclaration-after-statement -Werror=vla -Wendif-labels -Wmissing-format-attribute -Wimplicit-fallthrough=3 -Wcast-function-type -Wshadow=compatible-local -Wformat-security -fno-strict-aliasing -fwrapv -fexcess-precision=standard -Wno-format-truncation -Wno-stringop-truncation -g -O2 -std=c11 -Werror -Wno-declaration-after-statement -fPIC -fvisibility=hidden  -DEXTVERSION=\"0.13.0\" -I. -I./ -I/nix/store/9q4p23a2y63xn8safzzn6lbn07bnkshs-postgresql-17.11/include/server -I/nix/store/9q4p23a2y63xn8safzzn6lbn07bnkshs-postgresql-17.11/include/internal -D_GNU_SOURCE  -I/nix/store/p17klc3qq4nl9ihfwqfpi8cnqvcf92xz-libxml2-2.15.1-dev/include/libxml2 -I/nix/store/mglbi4dy4kpx7v1dcgf6iincp5x38hsc-lz4-1.10.0-dev/include -I/nix/store/g41q9md9rdcr3lkydi6f8zd6fza3h1q4-zstd-1.5.7-dev/include -I/nix/store/n2vnr7ycfk6midbzxcwd28qj3bgb50cz-icu4c-75.1-dev/include  -c -o src/event.o src/event.c677       > In file included from /nix/store/jviasb44hibgh09829gbmbssbz2jjnhz-curl-8.17.0-dev/include/curl/curl.h:3333,678       >                  from /nix/store/jviasb44hibgh09829gbmbssbz2jjnhz-curl-8.17.0-dev/include/curl/multi.h:51,679       >                  from src/event.h:4,680       >                  from src/event.c:6:681       > /nix/store/jviasb44hibgh09829gbmbssbz2jjnhz-curl-8.17.0-dev/include/curl/multi.h:429:23: error: expected identifier or '(' before '__extension__'682       >   429 | CURL_EXTERN CURLMcode curl_multi_setopt(CURLM *multi_handle,683       >       |                       ^~~~~~~~~~~~~~~~~684       > /nix/store/jviasb44hibgh09829gbmbssbz2jjnhz-curl-8.17.0-dev/include/curl/multi.h:429:23: error: expected identifier or '(' before ')' token685       >   429 | CURL_EXTERN CURLMcode curl_multi_setopt(CURLM *multi_handle,686       >       |                       ^~~~~~~~~~~~~~~~~687       > make: *** [<builtin>: src/event.o] Error 1688       For full logs, run:689         nix log /nix/store/g6nfp5n056kw2jvfzldzxrrrxfpfcka0-pg_net-0.13.0.drv690error: Cannot build '/nix/store/g6nfp5n056kw2jvfzldzxrrrxfpfcka0-pg_net-0.13.0.drv'.691       Reason: builder failed with exit code 1.692       Output paths:693         /nix/store/0z6qc5i8vhckm5s9j7br24f5kfxsgds5-pg_net-0.13.0694building '/nix/store/xwiwd8fzjgv67zb2ji446a8vxjj3s7bs-pg_net-0.14.0.drv' on 'ssh-ng://nixbot-remote-build@78.232.36.247'695building '/nix/store/xwiwd8fzjgv67zb2ji446a8vxjj3s7bs-pg_net-0.14.0.drv'696pg_net-0.14.0> Running phase: unpackPhase697pg_net-0.14.0> unpacking source archive /nix/store/cijlkfxy6vfh6pbq2nd4v8pc51nxn75y-source698pg_net-0.14.0> source root is source699pg_net-0.14.0> Running phase: patchPhase700pg_net-0.14.0> Running phase: updateAutotoolsGnuConfigScriptsPhase701pg_net-0.14.0> Running phase: configurePhase702pg_net-0.14.0> no configure script, doing nothing703pg_net-0.14.0> Running phase: buildPhase704pg_net-0.14.0> gcc -Wall -Wmissing-prototypes -Wpointer-arith -Wdeclaration-after-statement -Werror=vla -Wendif-labels -Wmissing-format-attribute -Wimplicit-fallthrough=3 -Wcast-function-type -Wshadow=compatible-local -Wformat-security -fno-strict-aliasing -fwrapv -fexcess-precision=standard -Wno-format-truncation -Wno-stringop-truncation -g -O2 -std=c11 -Werror -Wno-declaration-after-statement -fPIC -fvisibility=hidden  -DEXTVERSION=\"0.14.0\" -I. -I./ -I/nix/store/9q4p23a2y63xn8safzzn6lbn07bnkshs-postgresql-17.11/include/server -I/nix/store/9q4p23a2y63xn8safzzn6lbn07bnkshs-postgresql-17.11/include/internal -D_GNU_SOURCE  -I/nix/store/p17klc3qq4nl9ihfwqfpi8cnqvcf92xz-libxml2-2.15.1-dev/include/libxml2 -I/nix/store/mglbi4dy4kpx7v1dcgf6iincp5x38hsc-lz4-1.10.0-dev/include -I/nix/store/g41q9md9rdcr3lkydi6f8zd6fza3h1q4-zstd-1.5.7-dev/include -I/nix/store/n2vnr7ycfk6midbzxcwd28qj3bgb50cz-icu4c-75.1-dev/include  -c -o src/core.o src/core.c705pg_net-0.14.0> In file included from src/core.c:23:706pg_net-0.14.0> In function 'init_curl_handle',707pg_net-0.14.0>     inlined from 'consume_request_queue' at src/core.c:306:5:708pg_net-0.14.0> src/errors.h:6:11: warning: call to 'Wcurl_easy_setopt_err_long' declared with attribute warning: curl_easy_setopt expects a long argument [-Wattribute-warning]709pg_net-0.14.0>     6 |       if (curl_easy_setopt(hdl, opt, prm) != CURLE_OK) \710pg_net-0.14.0>       |           ^~~~~~~~~~~~~~~~711pg_net-0.14.0> src/core.c:120:7: note: in expansion of macro 'EREPORT_CURL_SETOPT'712pg_net-0.14.0>   120 |       EREPORT_CURL_SETOPT(curl_ez_handle, CURLOPT_POST, 1);713pg_net-0.14.0>       |       ^~~~~~~~~~~~~~~~~~~714pg_net-0.14.0> src/errors.h:6:11: warning: call to 'Wcurl_easy_setopt_err_long' declared with attribute warning: curl_easy_setopt expects a long argument [-Wattribute-warning]715pg_net-0.14.0>     6 |       if (curl_easy_setopt(hdl, opt, prm) != CURLE_OK) \716pg_net-0.14.0>       |           ^~~~~~~~~~~~~~~~717pg_net-0.14.0> src/core.c:121:7: note: in expansion of macro 'EREPORT_CURL_SETOPT'718pg_net-0.14.0>   121 |       EREPORT_CURL_SETOPT(curl_ez_handle, CURLOPT_POSTFIELDSIZE, 0);719pg_net-0.14.0>       |       ^~~~~~~~~~~~~~~~~~~720pg_net-0.14.0> src/errors.h:6:11: warning: call to 'Wcurl_easy_setopt_err_long' declared with attribute warning: curl_easy_setopt expects a long argument [-Wattribute-warning]721pg_net-0.14.0>     6 |       if (curl_easy_setopt(hdl, opt, prm) != CURLE_OK) \722pg_net-0.14.0>       |           ^~~~~~~~~~~~~~~~723pg_net-0.14.0> src/core.c:134:3: note: in expansion of macro 'EREPORT_CURL_SETOPT'724pg_net-0.14.0>   134 |   EREPORT_CURL_SETOPT(curl_ez_handle, CURLOPT_TIMEOUT_MS, cdata->timeout_milliseconds);725pg_net-0.14.0>       |   ^~~~~~~~~~~~~~~~~~~726pg_net-0.14.0> src/errors.h:6:11: warning: call to 'Wcurl_easy_setopt_err_long' declared with attribute warning: curl_easy_setopt expects a long argument [-Wattribute-warning]727pg_net-0.14.0>     6 |       if (curl_easy_setopt(hdl, opt, prm) != CURLE_OK) \728pg_net-0.14.0>       |           ^~~~~~~~~~~~~~~~729pg_net-0.14.0> src/core.c:136:3: note: in expansion of macro 'EREPORT_CURL_SETOPT'730pg_net-0.14.0>   136 |   EREPORT_CURL_SETOPT(curl_ez_handle, CURLOPT_FOLLOWLOCATION, true);731pg_net-0.14.0>       |   ^~~~~~~~~~~~~~~~~~~732pg_net-0.14.0> gcc -Wall -Wmissing-prototypes -Wpointer-arith -Wdeclaration-after-statement -Werror=vla -Wendif-labels -Wmissing-format-attribute -Wimplicit-fallthrough=3 -Wcast-function-type -Wshadow=compatible-local -Wformat-security -fno-strict-aliasing -fwrapv -fexcess-precision=standard -Wno-format-truncation -Wno-stringop-truncation -g -O2 -std=c11 -Werror -Wno-declaration-after-statement -fPIC -fvisibility=hidden  -DEXTVERSION=\"0.14.0\" -I. -I./ -I/nix/store/9q4p23a2y63xn8safzzn6lbn07bnkshs-postgresql-17.11/include/server -I/nix/store/9q4p23a2y63xn8safzzn6lbn07bnkshs-postgresql-17.11/include/internal -D_GNU_SOURCE  -I/nix/store/p17klc3qq4nl9ihfwqfpi8cnqvcf92xz-libxml2-2.15.1-dev/include/libxml2 -I/nix/store/mglbi4dy4kpx7v1dcgf6iincp5x38hsc-lz4-1.10.0-dev/include -I/nix/store/g41q9md9rdcr3lkydi6f8zd6fza3h1q4-zstd-1.5.7-dev/include -I/nix/store/n2vnr7ycfk6midbzxcwd28qj3bgb50cz-icu4c-75.1-dev/include  -c -o src/errors.o src/errors.c733pg_net-0.14.0> gcc -Wall -Wmissing-prototypes -Wpointer-arith -Wdeclaration-after-statement -Werror=vla -Wendif-labels -Wmissing-format-attribute -Wimplicit-fallthrough=3 -Wcast-function-type -Wshadow=compatible-local -Wformat-security -fno-strict-aliasing -fwrapv -fexcess-precision=standard -Wno-format-truncation -Wno-stringop-truncation -g -O2 -std=c11 -Werror -Wno-declaration-after-statement -fPIC -fvisibility=hidden  -DEXTVERSION=\"0.14.0\" -I. -I./ -I/nix/store/9q4p23a2y63xn8safzzn6lbn07bnkshs-postgresql-17.11/include/server -I/nix/store/9q4p23a2y63xn8safzzn6lbn07bnkshs-postgresql-17.11/include/internal -D_GNU_SOURCE  -I/nix/store/p17klc3qq4nl9ihfwqfpi8cnqvcf92xz-libxml2-2.15.1-dev/include/libxml2 -I/nix/store/mglbi4dy4kpx7v1dcgf6iincp5x38hsc-lz4-1.10.0-dev/include -I/nix/store/g41q9md9rdcr3lkydi6f8zd6fza3h1q4-zstd-1.5.7-dev/include -I/nix/store/n2vnr7ycfk6midbzxcwd28qj3bgb50cz-icu4c-75.1-dev/include  -c -o src/event.o src/event.c734pg_net-0.14.0> In file included from /nix/store/jviasb44hibgh09829gbmbssbz2jjnhz-curl-8.17.0-dev/include/curl/curl.h:3333,735pg_net-0.14.0>                  from /nix/store/jviasb44hibgh09829gbmbssbz2jjnhz-curl-8.17.0-dev/include/curl/multi.h:51,736pg_net-0.14.0>                  from src/event.h:4,737pg_net-0.14.0>                  from src/event.c:6:738pg_net-0.14.0> /nix/store/jviasb44hibgh09829gbmbssbz2jjnhz-curl-8.17.0-dev/include/curl/multi.h:429:23: error: expected identifier or '(' before '__extension__'739pg_net-0.14.0>   429 | CURL_EXTERN CURLMcode curl_multi_setopt(CURLM *multi_handle,740pg_net-0.14.0>       |                       ^~~~~~~~~~~~~~~~~741pg_net-0.14.0> /nix/store/jviasb44hibgh09829gbmbssbz2jjnhz-curl-8.17.0-dev/include/curl/multi.h:429:23: error: expected identifier or '(' before ')' token742pg_net-0.14.0>   429 | CURL_EXTERN CURLMcode curl_multi_setopt(CURLM *multi_handle,743pg_net-0.14.0>       |                       ^~~~~~~~~~~~~~~~~744pg_net-0.14.0> make: *** [<builtin>: src/event.o] Error 1745error: build of '/nix/store/xwiwd8fzjgv67zb2ji446a8vxjj3s7bs-pg_net-0.14.0.drv' on 'ssh-ng://nixbot-remote-build@78.232.36.247' failed: Cannot build '/nix/store/xwiwd8fzjgv67zb2ji446a8vxjj3s7bs-pg_net-0.14.0.drv'.746       Reason: builder failed with exit code 2.747       Output paths:748         /nix/store/0bq877r81wz036mv2my23krgmx5r2xkg-pg_net-0.14.0749       Last 25 log lines:750       > src/errors.h:6:11: warning: call to 'Wcurl_easy_setopt_err_long' declared with attribute warning: curl_easy_setopt expects a long argument [-Wattribute-warning]751       >     6 |       if (curl_easy_setopt(hdl, opt, prm) != CURLE_OK) \752       >       |           ^~~~~~~~~~~~~~~~753       > src/core.c:134:3: note: in expansion of macro 'EREPORT_CURL_SETOPT'754       >   134 |   EREPORT_CURL_SETOPT(curl_ez_handle, CURLOPT_TIMEOUT_MS, cdata->timeout_milliseconds);755       >       |   ^~~~~~~~~~~~~~~~~~~756       > src/errors.h:6:11: warning: call to 'Wcurl_easy_setopt_err_long' declared with attribute warning: curl_easy_setopt expects a long argument [-Wattribute-warning]757       >     6 |       if (curl_easy_setopt(hdl, opt, prm) != CURLE_OK) \758       >       |           ^~~~~~~~~~~~~~~~759       > src/core.c:136:3: note: in expansion of macro 'EREPORT_CURL_SETOPT'760       >   136 |   EREPORT_CURL_SETOPT(curl_ez_handle, CURLOPT_FOLLOWLOCATION, true);761       >       |   ^~~~~~~~~~~~~~~~~~~762       > gcc -Wall -Wmissing-prototypes -Wpointer-arith -Wdeclaration-after-statement -Werror=vla -Wendif-labels -Wmissing-format-attribute -Wimplicit-fallthrough=3 -Wcast-function-type -Wshadow=compatible-local -Wformat-security -fno-strict-aliasing -fwrapv -fexcess-precision=standard -Wno-format-truncation -Wno-stringop-truncation -g -O2 -std=c11 -Werror -Wno-declaration-after-statement -fPIC -fvisibility=hidden  -DEXTVERSION=\"0.14.0\" -I. -I./ -I/nix/store/9q4p23a2y63xn8safzzn6lbn07bnkshs-postgresql-17.11/include/server -I/nix/store/9q4p23a2y63xn8safzzn6lbn07bnkshs-postgresql-17.11/include/internal -D_GNU_SOURCE  -I/nix/store/p17klc3qq4nl9ihfwqfpi8cnqvcf92xz-libxml2-2.15.1-dev/include/libxml2 -I/nix/store/mglbi4dy4kpx7v1dcgf6iincp5x38hsc-lz4-1.10.0-dev/include -I/nix/store/g41q9md9rdcr3lkydi6f8zd6fza3h1q4-zstd-1.5.7-dev/include -I/nix/store/n2vnr7ycfk6midbzxcwd28qj3bgb50cz-icu4c-75.1-dev/include  -c -o src/errors.o src/errors.c763       > gcc -Wall -Wmissing-prototypes -Wpointer-arith -Wdeclaration-after-statement -Werror=vla -Wendif-labels -Wmissing-format-attribute -Wimplicit-fallthrough=3 -Wcast-function-type -Wshadow=compatible-local -Wformat-security -fno-strict-aliasing -fwrapv -fexcess-precision=standard -Wno-format-truncation -Wno-stringop-truncation -g -O2 -std=c11 -Werror -Wno-declaration-after-statement -fPIC -fvisibility=hidden  -DEXTVERSION=\"0.14.0\" -I. -I./ -I/nix/store/9q4p23a2y63xn8safzzn6lbn07bnkshs-postgresql-17.11/include/server -I/nix/store/9q4p23a2y63xn8safzzn6lbn07bnkshs-postgresql-17.11/include/internal -D_GNU_SOURCE  -I/nix/store/p17klc3qq4nl9ihfwqfpi8cnqvcf92xz-libxml2-2.15.1-dev/include/libxml2 -I/nix/store/mglbi4dy4kpx7v1dcgf6iincp5x38hsc-lz4-1.10.0-dev/include -I/nix/store/g41q9md9rdcr3lkydi6f8zd6fza3h1q4-zstd-1.5.7-dev/include -I/nix/store/n2vnr7ycfk6midbzxcwd28qj3bgb50cz-icu4c-75.1-dev/include  -c -o src/event.o src/event.c764       > In file included from /nix/store/jviasb44hibgh09829gbmbssbz2jjnhz-curl-8.17.0-dev/include/curl/curl.h:3333,765       >                  from /nix/store/jviasb44hibgh09829gbmbssbz2jjnhz-curl-8.17.0-dev/include/curl/multi.h:51,766       >                  from src/event.h:4,767       >                  from src/event.c:6:768       > /nix/store/jviasb44hibgh09829gbmbssbz2jjnhz-curl-8.17.0-dev/include/curl/multi.h:429:23: error: expected identifier or '(' before '__extension__'769       >   429 | CURL_EXTERN CURLMcode curl_multi_setopt(CURLM *multi_handle,770       >       |                       ^~~~~~~~~~~~~~~~~771       > /nix/store/jviasb44hibgh09829gbmbssbz2jjnhz-curl-8.17.0-dev/include/curl/multi.h:429:23: error: expected identifier or '(' before ')' token772       >   429 | CURL_EXTERN CURLMcode curl_multi_setopt(CURLM *multi_handle,773       >       |                       ^~~~~~~~~~~~~~~~~774       > make: *** [<builtin>: src/event.o] Error 1775       For full logs, run:776         nix log /nix/store/xwiwd8fzjgv67zb2ji446a8vxjj3s7bs-pg_net-0.14.0.drv777error: Cannot build '/nix/store/xwiwd8fzjgv67zb2ji446a8vxjj3s7bs-pg_net-0.14.0.drv'.778       Reason: builder failed with exit code 1.779       Output paths:780         /nix/store/0bq877r81wz036mv2my23krgmx5r2xkg-pg_net-0.14.0