nixbot

builds

cancelled checks.aarch64-linux.ext-vault build #132 · raw · eval 2.7 s · 873.5 MiB allocated · ·

1these 343 derivations will be built:2  /nix/store/09yw6by1xkgwvadzkn03bvaxw955v632-pg_partman.drv3  /nix/store/0cmixqwsz3vb82j49j1mhvyk8crg4dcw-wrappers-0.6.0.drv4  /nix/store/f4fxzxll7q3m5cy6rib758j63zcky8dk-supabase_vault-0.2.8.drv5  /nix/store/zyzrb73x0fw62dyxqdz0znqnzvgqa7g6-supabase_vault-0.3.1.drv6  /nix/store/0dxji73cc07dbqk8nny6y5mkf5qr6kl8-supabase_vault.drv7  /nix/store/fl27cr5qdrq44nk61x5yjlqxsrc8mg3n-pgsodium-3.0.4.drv8  /nix/store/jl20dg8fxlmlv84f7cda9xa6mq8y46sr-pgsodium-3.1.7.drv9  /nix/store/l6md1p6ahq43yili977j4021ky05la94-pgsodium-3.1.8.drv10  /nix/store/pvz0jf5drhdz4jj5k592kxbdgk4lm52r-pgsodium-3.1.6.drv11  /nix/store/zdz6b4s43i332x3xlvjivc7p4csihzba-pgsodium-3.1.5.drv12  /nix/store/0h7mnh8was4m19z53z0dmakrp0c9271q-pgsodium.drv13  /nix/store/0i6b8yy32fc4mgfm75w94gw9ja033kw5-wrappers-0.5.5.drv14  /nix/store/qbrypyj5k7h0pffxxshbyym24h89f2y1-gdal-3.8.5.drv15  /nix/store/l9h30apsjb4s39av0lwsad1vv59rdkv6-cgal-6.0.2.drv16  /nix/store/s3myd88a11h86h3h8cvhgd1im0zk6i65-sfcgal-2.2.0.drv17  /nix/store/h1vl8vpk154yppn5lcqms2680igi0mmj-postgis-3.3.2.drv18  /nix/store/2ylkw9crapb58vd5g0vj602jfyb1p3r6-postgis.drv19  /nix/store/58cinn47vbvwr1wxdkspmvi9cj27b07h-safeupdate-1.4.drv20  /nix/store/6c0mnd757hvxppfyrsf4cb1wgnbd4111-safeupdate.drv21  /nix/store/ciwky5vscrx4c52kr30fm8j4idj8qgsn-pg_stat_monitor-2.1.drv22  /nix/store/7a02zvvkkkriis78wgz6n8nnkwm2gh22-pg_stat_monitor.drv23  /nix/store/9gh7fip2wf0wip8wnv1axd8ghar0x5fb-pgmq-1.5.1.drv24  /nix/store/k4swwy7459wf558rbrraclsr4sjccz0h-pgmq-1.4.4.drv25  /nix/store/8zsadvm8mv18kpy4qy724ps2jlbsik0w-pgmq.drv26  /nix/store/4wk9vb1q3kdnhj8hsq8pwgbp82glwg9w-timescaledb-2.9.1.drv27  /nix/store/9wzj3wh6sczzk849dmjwvmnkshggakxp-timescaledb.drv28  /nix/store/2nmg9sxx50xmndps3714hbvwjyd5rqv0-vector-0.8.2.drv29  /nix/store/94d6rmv5v8zdjsgzl3yrhpg7zq6zdjpx-vector-0.5.1.drv30  /nix/store/alajylsl9b90m65n0ps0mkbkw679x4sn-vector-0.6.2.drv31  /nix/store/jmilv9h5p0v4grgqnhfn22i7zl352ybh-vector-0.7.4.drv32  /nix/store/q3mdjvqpw4xbwcjy5y1ps1igxsjvx133-vector-0.7.0.drv33  /nix/store/v5dnr617av2jgk6kpddxbxxqjqgl5kzg-vector-0.8.0.drv34  /nix/store/z40s48rz55qgpw6g6wiqi68hkfas4h1l-vector-0.6.0.drv35  /nix/store/zygvf0wgqsyi96fangshfkwjiyylhvkz-vector-0.4.0.drv36  /nix/store/9zndhfzc45vrfn297g1hav7m6ba3rlzk-vector.drv37  /nix/store/0nln7k62ggiw9s5y0icr3hyribl5iazb-pg_graphql-1.2.3.drv38  /nix/store/63ifr5p2wzl7vygaj7pq847nwnrnxm3p-pg_graphql-1.5.0.drv39  /nix/store/6hfik9nnrihzb6dj53in06v6a4qmgsj3-pg_graphql-1.5.7.drv40  /nix/store/7pqhalqwaggagybgy24lm93c5b8d4isk-pg_graphql-1.4.2.drv41  /nix/store/ag5rlkqwfkwlgvxg1yhivjqfcaq2w14v-pg_graphql-1.5.1-mergeless.drv42  /nix/store/cgazfazb4ak4csd48khgjsa4vxmmddfb-pg_graphql-1.5.11.drv43  /nix/store/d78fjdz9zrccq7f563jz9fj1a45yrq5x-pg_graphql-1.1.0.drv44  /nix/store/dk0a0irlxsl04249qy2dnc6bm4wkk1lc-pg_graphql-1.6.1.drv45  /nix/store/dnwfmlfwyqnkzy2jyzf6h3q044wk6hbg-pg_graphql-1.5.9.drv46  /nix/store/f694g0m8chfk6z6yh787135bzcqwnli4-pg_graphql-1.5.4.drv47  /nix/store/fsgiwnrg38ssgf05vkmzc21v93a36qmd-pg_graphql-1.2.2.drv48  /nix/store/h9damb814a5fmzyc5wgcildkm32vy1bv-pg_graphql-1.6.2.drv49  /nix/store/iq0gzwfxzxkns0gpdkhjx1cc6s4q1i2q-pg_graphql-1.5.6.drv50  /nix/store/q66z8j5qs96rgahzmlrq4n41d2avywar-pg_graphql-1.0.2.drv51  /nix/store/v0mqjlj6j73wpc66h34djrv08j7q3l8w-pg_graphql-1.4.4.drv52  /nix/store/wnn3f47lz59i84mdzvmc1a7man89cmic-pg_graphql-1.2.0.drv53  /nix/store/yds474rgqgxjdw6zm0ylvpvvd4l0xmkl-pg_graphql-1.4.1.drv54  /nix/store/yhfqz2chz94q9k3rv8hgwcsyri02wlm8-pg_graphql-1.5.1.drv55  /nix/store/a4icbsgspmpi3nfs8vffp42sg9v7a25f-pg_graphql.drv56  /nix/store/a7qnf8v2hw96v6kdba9j02fljccy432g-pg_tle.drv57  /nix/store/c08rdgxba5n6zhyp78l8sd6fhnbc4a4c-pgsodium-3.1.7.drv58  /nix/store/hh2jpg5qdwgdwzi96qcay1a5ffhi0f4i-pgsodium-3.1.6.drv59  /nix/store/jwrjvb9m50v44sla4jpig83jab7zn17x-pgsodium-3.1.8.drv60  /nix/store/m1xdmpffkflwgdin5ljvfh72wxq5lxpx-pgsodium-3.1.5.drv61  /nix/store/wjhhlaiwzvm5m08my4d983icdmcpllzd-pgsodium-3.0.4.drv62  /nix/store/a9laaq557mna86dm87lq3211xy5h2zyl-pgsodium.drv63  /nix/store/ag6xlrckwkx594nhf6j3sq2ngwbryyz8-http.drv64  /nix/store/i0gq8yqxp5h7l782n2ki94b1d62m6zsg-plpgsql_check-2.2.drv65  /nix/store/q117a7mx5d5bzln8xg24fh1vfzq7bsz4-plpgsql_check-2.7.drv66  /nix/store/rj6qw8pwvr91cy6qyp8xibrw4arrpj9j-plpgsql_check-2.8.drv67  /nix/store/c782i897gj20c0r8bmphf8p6r5s5wdli-plpgsql_check.drv68  /nix/store/b139hl0gpc9icb6j6q28gl1chw7i9260-rum-1.3.drv69  /nix/store/csvzp35khfq15v5g275y14094s58v10k-rum.drv70  /nix/store/c2pcswnd4yfp02pas6a7grpm0fmk70wx-supabase_vault-0.3.1.drv71  /nix/store/jb3j93i6ljmvqkv5cnv3lh3d9zn4zcjz-supabase_vault-0.2.8.drv72  /nix/store/gc3nb7r1a8rbf6f8yf4zs2nnb65awkxq-supabase_vault.drv73  /nix/store/7inhp3jz4x6l1m2i6aa1w6bbb91r1hay-pgroonga-3.2.5.drv74  /nix/store/xim497rkcncpxb5vvyli3j4jnziyybgy-pgroonga-3.0.7.drv75  /nix/store/gdd3j67qcdibplv1d440a6gsix87s5xs-pgroonga.drv76  /nix/store/ihx5q75k74a4cqq4k9bwnl5yin262kq2-pgrouting-3.4.1.drv77  /nix/store/hf9dly2ryx969lw950ld454fqfa6c41r-pgrouting.drv78  /nix/store/8kjmsmcqakfh251gpi83kpszgvy3zgj2-pg_jsonschema-0.3.1.drv79  /nix/store/dllk76mn670xnq6146jk4lmj5hpxmp4c-pg_jsonschema-0.3.3.drv80  /nix/store/pqncxlsh0gj7xk3n4mwxqiyyzim9c7g7-pg_jsonschema-0.2.0.drv81  /nix/store/iljk5j7rhldnws1iwi3j8qjxnaalxqjv-pg_jsonschema.drv82  /nix/store/82vdx9lfkbv67j79qzi9yzvqrj043w52-wal2json-2.6.drv83  /nix/store/iz713zhjyn0lym6ls12i9vxca9cxf4hi-wal2json.drv84  /nix/store/zfhvj40marmxclav9a5ppx3dmq3xd3hh-pg_partman-5.3.1.drv85  /nix/store/jcxqgl4g37gj09v4km7dl525ym1kxla2-pg_partman.drv86  /nix/store/mc1n2fml7avin2lrpgrd5cx7wjdb4gcg-pg_hashids-1.3.0-cd0e1b31d52b394a0df64079406a14a4f7387cd6.drv87  /nix/store/jsqjxdn4qp571nvc40r8xx103s9qb7c9-pg_hashids.drv88  /nix/store/7lzcc5d36122752hpjb6lij6sc2ai2a0-plv8-3.1.5.drv89  /nix/store/87brzrl1nsm8z4my02aldnxd8fb0i69x-plv8-3.1.4.drv90  /nix/store/k6nh1vivj2dgh0jk2mpsiy4p5v6sjyzk-plv8.drv91  /nix/store/xjfjfch45p5g0snar9qpm4amblh2jya8-plan_filter-0.1.drv92  /nix/store/lhdnha0m1rqpv0cmivzv3s7znjmgxc14-plan_filter.drv93  /nix/store/0n0iaya9csx9by2pimrx1yglzw8dp4zs-pg_net-0.13.0.drv94  /nix/store/25f3j4f5ialq0qwpdpc7gya55q9i2mai-pg_net-0.11.0.drv95  /nix/store/5xdj291zxpgm4qhx0749x7j0wwlfilf4-pg_net-0.1.drv96  /nix/store/6nzc8mspw5i4qqlvgriv2l1439xlh68v-pg_net-0.10.0.drv97  /nix/store/7iq4z475k625nsn9wc9nf4vxa7x1f1qd-pg_net-0.19.5.drv98  /nix/store/cfrc2vk3cgabx1447j2n7s3zxraq6395-pg_net-0.14.0.drv99  /nix/store/iwq28h7yniccm9ra8q6dc0wma0l6hnqn-pg_net-0.6.drv100  /nix/store/nw3d144zhshkgx1z66g9g2wg5829w36n-pg_net-0.7.1.drv101  /nix/store/nwcnf7x9i2zdx48936w9ixsnxzhbab16-pg_net-0.20.0.drv102  /nix/store/rfdqkjkjdwz7ydrwlfn9cdy68zz9z6rf-pg_net-0.7.drv103  /nix/store/whvqb38akl195470ks3jads9kmq2i9gj-pg_net-0.8.0.drv104  /nix/store/zy29jzcj1bsz7760wbmlg78czaddsrni-pg_net-0.20.3.drv105  /nix/store/q7ak647qv213m4vc4fnr43i09azs1b0p-pg_net.drv106  /nix/store/s7vxni6a17dm43jdicq8ksfjsk2d7c0n-pgaudit.drv107  /nix/store/nwi7hxl3j1cxn7ylrkx8sbbg3sqld8ag-pgtap-1.3.3.drv108  /nix/store/sxzi0qg4ingw35zkbi2pk2vfgxbq5k2a-pgtap.drv109  /nix/store/wza7bzcbymwld5yd1bh5p859l0fgd9af-pg_cron-1.4.2.drv110  /nix/store/xcji3ff216yxrc2yf2yss6mza01w0ccm-pg_cron.drv111  /nix/store/21s45rg3i2jfhdarxmqf3dr79allgdgh-wrappers-0.4.5.drv112  /nix/store/56j6z0f3g50m72cj7ynr22p9fdml79q9-wrappers-0.5.3.drv113  /nix/store/9m4hgq2s9z1cy1508wymdcl2n1w3ky5h-wrappers-0.6.2.drv114  /nix/store/f3b53aqd65czxnbbash43yraza54ds7k-wrappers-0.4.3.drv115  /nix/store/fpcwzjw9wdhbljjpcjlbz4w6236qzl70-wrappers-0.3.0.drv116  /nix/store/hygnfcb7az5nw4c4aranasi27gnhzgan-wrappers-0.6.3.drv117  /nix/store/iimlppn24xgvgjvnm4xp8z9bxl4p4p1d-wrappers-0.4.1.drv118  /nix/store/l3ww3jfvj5l8bp25p66wrjziy8m0vi23-wrappers-0.5.0.drv119  /nix/store/ns9rs9anq0rsl3sh1rhxmqcsll7lkjd0-wrappers-0.5.6.drv120  /nix/store/nvjw377g2m07i1z93mngr72qhpjmafvy-wrappers-0.4.6.drv121  /nix/store/qzn17ml7z84zcmcw96j0z0f6m9j6y7qm-wrappers-0.5.4.drv122  /nix/store/xbhixx8nl4iifcfi17lpavbs9cxcg5ka-wrappers-0.6.1.drv123  /nix/store/y06jjr5k7hk7zs8gzilg4g50b184va6a-wrappers-0.4.2.drv124  /nix/store/y1qh08g7i9w1x2s10rq7ammigljy82kw-wrappers-0.4.4.drv125  /nix/store/z1yzqa9qzq4ri1f58lngsljs0abhgjz5-wrappers-0.5.7.drv126  /nix/store/xcq8s20l2ynk52356w6nqkdw7379h4g4-wrappers.drv127  /nix/store/3m1k34jx4kw90mcghzrp83c2dfhrwab8-pg_repack-1.5.1.drv128  /nix/store/c7dnz58z4jqy26qinfmray2nlvxx3442-pg_repack-1.4.8.drv129  /nix/store/iwgg2la44vzaaa2ja2xyaydck2jab651-pg_repack-1.5.2.drv130  /nix/store/xd0qgx5kfkw00jgxs1v9rm4ksfdjky95-pg_repack.drv131  /nix/store/fakh4z5ssr1vhknp3xv3ch232i3ph2ax-postgresql-and-plugins-15.19.drv132  /nix/store/4z7sbcap8vdzfs1smz81k2crr4sgm640-postgresql-and-plugins-15.19.drv133  /nix/store/q4qvxkwv7rl1jac9sf5aap56gjx0n5mb-system-path.drv134  /nix/store/9in45xg9fcahx70h7alf6jg08sin568q-dbus-1.drv135  /nix/store/jffmpfrihfl3k6lfgdc4ii4a62343h7x-X-Restart-Triggers-dbus.drv136  /nix/store/0jyfsa7sd5nhfiwbk0i0i0k7bbgigy6z-unit-dbus.service.drv137  /nix/store/0nn0jglvy3w5hd868rilks6acxx242hj-pg_net-0.19.5.drv138  /nix/store/0q3jswlrym436vq3yzd7nmxpfpc7zbw7-wrappers-0.5.6.drv139  /nix/store/0wbkhlgz00c1nhm74adar4kk6dbid1dq-pg_graphql-1.5.11.drv140  /nix/store/1k3nzf8206jy6jjwdb50jn8rij79dvvj-plan_filter-0.1.drv141  /nix/store/17zhj6r14i4xx0fmzclykpcnyicwhbga-plan_filter.drv142  /nix/store/18746y4c8pvpm3al2bydwcn29pgwkjij-pg_repack-1.4.8.drv143  /nix/store/1hza0wxglhyl1641a3yki78kp045s8x2-wrappers-0.5.7.drv144  /nix/store/1mkhz1wanb7sx61imr6wqda0cqnvnj8q-wal2json-2.6.drv145  /nix/store/1r4ihdrrxnxp1kc97akzkb6yf0rhj5fy-wal2json-2.6.drv146  /nix/store/spkggw5b21kbiq57p7fq00khhxxg9mpm-http-1.6.1.drv147  /nix/store/1s2y3lhnrwphps8mxwxhj6pli5p72pz8-http.drv148  /nix/store/m94894cysabrjwxvvsg00i2c4vxrwj44-pg_graphql-1.6.1.drv149  /nix/store/nsc639d0i1mzcdskxc5v8874w8f4zf8x-pg_graphql-1.6.2.drv150  /nix/store/w47195gn53xxlfnja6kkgpgj0pbxj66m-pg_graphql-1.5.9.drv151  /nix/store/2j0amjv943p6zmhzl3mx9z6jr1qcpn3i-pg_graphql.drv152  /nix/store/2wp2aqp71l4218m1z0aas6789yx18sv3-pgrouting-3.4.1.drv153  /nix/store/564f4p7z536irjy1x7a6i39nk3n3g2r2-pgrouting.drv154  /nix/store/7m924d2lj1z3y952h3rhjixfq3sygp4r-pg_tle.drv155  /nix/store/z008z9r9dipnvldyfh7pklhxwdav0faw-http-1.6.1.drv156  /nix/store/82hvrn43v2lmbsbj2cnaaps4iy6q9dqn-http.drv157  /nix/store/k4qjk97aggz30jlgv2hdqka8fy8z07pg-supabase_vault-0.3.1.drv158  /nix/store/z8jynkjsnrfphim33c02aci4n6i2s9la-supabase_vault-0.2.8.drv159  /nix/store/8ir53vjiqz9rhip8arbxd2b58d0j67w0-supabase_vault.drv160  /nix/store/vrks8v32hwif7cfllbj4kb4i2v9b48y8-hypopg.drv161  /nix/store/yxyw8y9hskg7m2sajbfkix9g2pibkl2w-index_advisor-0.2.0.drv162  /nix/store/9c27ix09f1z8w6a63dkm9idp2vsrixh1-index_advisor.drv163  /nix/store/9sv9z7i53r40xnrigr8aywi98izk30rb-wal2json.drv164  /nix/store/g3yy08xhp6kakigznjmymrvasv6xhzz4-rum-1.3.drv165  /nix/store/apcx516gwjdivwb00nzvgwwq26mp6kbp-rum.drv166  /nix/store/m5i71pkvgfbs9l7iwwnbj4hyz9dvj13m-pg_jsonschema-0.3.3.drv167  /nix/store/az9kzhbrx32y837x7nl7dfajllv3l3xn-pg_jsonschema.drv168  /nix/store/ynjdlqr0w8h7ici1xdnsr79mwnzmyyri-pgroonga-3.2.5.drv169  /nix/store/c7b5vgzvlwgra3bhwq5fjzl0cg8lxq53-pgroonga.drv170  /nix/store/axpz1dvivwnmwkkcs392nj9cp1zs4x4h-pg_repack-1.4.8.drv171  /nix/store/gpxphj5cc5qbfjvp1kckicqwibgb6870-pg_repack-1.5.0.drv172  /nix/store/nynlpdydjmjk2fk2fsjz9bws5n6pjjyv-pg_repack-1.5.1.drv173  /nix/store/sa036niivyjgc2rqi9xh890msxh349l9-pg_repack-1.5.2.drv174  /nix/store/f4jr9drjzv7wfj2rxqg6fxg4ki5xv8aq-pg_repack.drv175  /nix/store/3cgs2dl0nwcsnwa5j7vkkp9vnqrax686-wrappers-0.6.0.drv176  /nix/store/74dcpcc376carhrdcf8ka4zmkawz1yv6-wrappers-0.5.4.drv177  /nix/store/92vrj7bj8hswwppxa34pv4a5mcishcns-wrappers-0.4.4.drv178  /nix/store/96l1zwmvz2ffcdfraaalfc6lvhah4kbz-wrappers-0.5.5.drv179  /nix/store/adcv6z66z4kpsasjjh1mcxa915lbdppl-wrappers-0.4.5.drv180  /nix/store/b4n3d1kid5pcaqfl3fjnjmc425dgg1p1-wrappers-0.5.0.drv181  /nix/store/jcd2gw4vawwnh0pmxhl4pl3ll6adggx5-wrappers-0.6.2.drv182  /nix/store/vxwdlzq8s4jj92x0jpc4sl9drjywlalq-wrappers-0.6.3.drv183  /nix/store/xwhq66cqc0ms922bxlcgc1jwff6kqv8g-wrappers-0.5.3.drv184  /nix/store/y6kq63cxxc5v5jh87mv9wpbvk0p4ayfg-wrappers-0.6.1.drv185  /nix/store/zdyyj4cgmfdl46zb5ycwmwr6d30w6mbx-wrappers-0.4.6.drv186  /nix/store/fn58ja37h9fw7mszrd75faxdb0999f0i-wrappers.drv187  /nix/store/8yjdx0pjzbx41fx807nrw1js3y16kbz5-vector-0.5.1.drv188  /nix/store/9yiwshvqw6zii2gdbjn3whic00kdi2kk-vector-0.7.4.drv189  /nix/store/gd4y86918lqw8gzxg8nqrz8sy2dqq9fb-vector-0.7.0.drv190  /nix/store/gdgmh15k0z47wvlyk7n79hg9mm7jzisl-vector-0.6.2.drv191  /nix/store/hs3bxh6aa4yj96k9qp50af7qy1jchwk3-vector-0.6.0.drv192  /nix/store/j5mchw8xwd04x2c28fmf7pccna5x7y95-vector-0.8.2.drv193  /nix/store/qa8qkhza8bf74v69dzxgqvy2mjf799yl-vector-0.8.0.drv194  /nix/store/g5mv4minlqr25pj8gqhzcns6w7bwzaph-vector.drv195  /nix/store/lkbp0bzzg49y6z9h7ms156q0jsiq6qh4-safeupdate-1.4.drv196  /nix/store/icwncd52zxyvvybn79pvj2s9day934p8-safeupdate.drv197  /nix/store/j99v4y7ck8sk68hj9m9aw1avc2dkn4nh-pg_stat_monitor.drv198  /nix/store/9kmiqqmclsl8d77yd54al2d2wlwc6dp1-pgsodium-3.0.4.drv199  /nix/store/ckl9zg69wqkncwizrd6lln7h5492wwn6-pgsodium-3.1.6.drv200  /nix/store/lhi0y1xi9i9i1c8kg95nfhdw95j3dz3r-pgsodium-3.1.5.drv201  /nix/store/msmzmvngp6cx4yl0dwgzp3iv7bv796wg-pgsodium-3.1.8.drv202  /nix/store/zwypkv0vf8m8ybs536jq5wglvhfwdx8y-pgsodium-3.1.7.drv203  /nix/store/l68xzbdq736nzdnwvr9q3x29wcngcsj1-pgsodium.drv204  /nix/store/qk4j715gipc827yxrcwv0g9pviaqxkyy-pg_partman.drv205  /nix/store/46l7zbh5kkmyi58x419ar4kly30qvnhi-gdal-3.8.5.drv206  /nix/store/apd0c6nk3x333r1xj0sl2m3cr96pbizv-postgis-3.3.7.drv207  /nix/store/r12320b80inhy5aq434asc4sa8w6bn0g-postgis.drv208  /nix/store/36hfvpcvdxj64718i9mhil3db8835a6q-plpgsql_check-2.7.drv209  /nix/store/9lpr8r6zwzid07ihmr89rnxqcwv0yfja-plpgsql_check-2.8.drv210  /nix/store/rly88629k74w1nj10q0l6mg2jvd3nr1g-plpgsql_check.drv211  /nix/store/83ycsfk9ivb7sah3lq89d8hy5rxj5vpp-pg_net-0.20.3.drv212  /nix/store/a0ldx82cv1chkbdks86c8mjp8ps4lfgn-pg_net-0.20.0.drv213  /nix/store/b0270km6h57kbdxfkhagcpsilp239adm-pg_net-0.11.0.drv214  /nix/store/lbqp8bfrqa2xm82ma6wyq1gijyajh6kh-pg_net-0.13.0.drv215  /nix/store/rdglczxf0sk4hhwsppqw13zl43vf5wr0-pg_net-0.14.0.drv216  /nix/store/w7547z9slhcibw4s6cwkag6w1f49317s-pg_net-0.20.4.drv217  /nix/store/vvs47f973jig6lflvm7cidm6m20glpy5-pg_net.drv218  /nix/store/92dxzgq4qn1jl389a931z1n5n1a8s5ns-pg_hashids-1.3.0-cd0e1b31d52b394a0df64079406a14a4f7387cd6.drv219  /nix/store/x1kpz6n29pqn2xm06lprn5kwpr0pjhhx-pg_hashids.drv220  /nix/store/y1p5dlzmilwxqbf3a4c7hl6gp9p84wsl-pgmq-1.5.1.drv221  /nix/store/y5rgrfmhzrjr0j6zil7ksqdbcglh0s8i-pgmq.drv222  /nix/store/jk18akz00pd0nr1pixnq9550lnvycgar-pg_cron-1.6.4.drv223  /nix/store/ybhpqdys29q375m5pxxn2w3cbzgf3mxg-pg_cron.drv224  /nix/store/mpyn776iqdn7h94vlp5yxn83a0y4lchc-pgtap-1.3.3.drv225  /nix/store/psjbrnijdnpqyc9s718av7nwmyk0fays-pgtap-1.3.1.drv226  /nix/store/zf19xpsa8jj4bmx09awww0z16cm79z4g-pgtap.drv227  /nix/store/2fndab8axk4hz4s30ijaxnpa1bc9z1dc-postgresql-and-plugins-17_22.drv228  /nix/store/3bfr1qggn2db554518zgs8fpzyagvfrb-pg_jsonschema-0.3.3.drv229  /nix/store/2x6xkwfx99zhzhdbmhbrnifqf63l8ica-pg_jsonschema.drv230  /nix/store/48mqx57r48j330b49mc32k7bvy6445c2-wal2json.drv231  /nix/store/83syfrxa296qd37cig3f07glk8hn533v-pg_stat_monitor.drv232  /nix/store/8szfd9ycs8amd9k5vlvg6prcijxwqr3j-hypopg.drv233  /nix/store/sww4kz29ir2aly4abpn3hb8zfqy4ak06-pg_cron-1.6.4.drv234  /nix/store/9w316phdvwdjv5875fpg98qwdi7hxzv5-pg_cron.drv235  /nix/store/f2nm4421r3k58c32661m7na2f1q95dbh-pgtap-1.3.1.drv236  /nix/store/k7h19a5nads14nh23z55wp7vpifpqdcg-pgtap-1.3.3.drv237  /nix/store/b3wykhrc5d96h1ddr0n8jc0vm6lda047-pgtap.drv238  /nix/store/msp1w36fm572jxlq4yj3ilwksxa0qpag-safeupdate-1.4.drv239  /nix/store/fl0xvi8swv20jz0vkfsm12znd6mp9naq-safeupdate.drv240  /nix/store/5ls8sxw33v0sm4agddi4xzky3nvhg3g7-index_advisor-0.2.0.drv241  /nix/store/hnandxbj17d43iq41vk9jgn2mk94s7fg-index_advisor.drv242  /nix/store/4dv0hiafadp1s6dx9i8qfwajgh422j5n-pg_graphql-1.6.1.drv243  /nix/store/5sxmls2c3rj1id1jy8cp90d7aga5vs9y-pg_graphql-1.5.9.drv244  /nix/store/6f7pk59bx81p58zx4lxc0kpr0a4pskc3-pg_graphql-1.5.11.drv245  /nix/store/kxm7a9483vsp4n6zn93isjb5z31l42fd-pg_graphql-1.6.2.drv246  /nix/store/k2r44m3w1mwab1ipx8m72764yyhxr38v-pg_graphql.drv247  /nix/store/381ghgpkv0l9lnv0f1v2jxfg04cspiih-rum-1.3.drv248  /nix/store/k4lajdzpb6zgp35ib3yfg5hk7p7kj1z3-rum.drv249  /nix/store/2i3blwmkdwv0753xgc4pb1rm16gk4jmv-wrappers-0.5.6.drv250  /nix/store/8p8fsl25zwlaqwhknw8myg0lfhi6rhsg-wrappers-0.6.0.drv251  /nix/store/a9l3bgzraqwg33ax5gcmbqwrkrrxxnag-wrappers-0.4.5.drv252  /nix/store/fh5b65jxgdyzwrs2g7y12ffnk1yhxczn-wrappers-0.5.7.drv253  /nix/store/h81r7798azz2nz8s3pxp1drpa02ma2m8-wrappers-0.5.4.drv254  /nix/store/hlpygbdz705888l5vwvvnz96901jdbkn-wrappers-0.5.5.drv255  /nix/store/kcan9i952k07b3pm1fnq4s0f7pfn7yx9-wrappers-0.5.3.drv256  /nix/store/pvzl31ydc0nhwqmrw9agqqbmk4v4ycr8-wrappers-0.6.3.drv257  /nix/store/q0lgs5nhw27p302wa3gp300l19ad95f0-wrappers-0.4.4.drv258  /nix/store/rfn5rhjy53sq47kjz5qfawd9pz9a38l1-wrappers-0.5.0.drv259  /nix/store/sg3hglpfqxg0bdxvkn36jnvpd752brga-wrappers-0.4.6.drv260  /nix/store/sn2m8z01kbz72vbl839b4qdhql2lf67m-wrappers-0.6.1.drv261  /nix/store/w5gnd7pybydask3lizsy3lirm83jxx56-wrappers-0.6.2.drv262  /nix/store/kplnvybrmx8df99qr3hsafbkky7hfg3v-wrappers.drv263  /nix/store/ibl9nbmh9mbqgqqfkrq7vgqzbsxj392q-pgmq-1.5.1.drv264  /nix/store/kv8jjb4gkylvk18qlsxl5lp9k29b1d31-pgmq.drv265  /nix/store/hnhqkd9jnn7w4z0z0jacwjwg9x016gyl-pg_repack-1.5.0.drv266  /nix/store/rhyhx66rvbmsmh7i4xf5dqi3pr058hjr-pg_repack-1.5.1.drv267  /nix/store/x14ai73x9yl5ckncl830rpbqxpjvvbg5-pg_repack-1.5.2.drv268  /nix/store/m6b5d5vphi1v49cpgr7ff07zvzfri21p-pg_repack.drv269  /nix/store/q8n9c44w9m7lggw81a93q8rvr4jgmslx-plan_filter-0.1.drv270  /nix/store/n1y2c26wz7wmff6xrz6ggk6zvsgma4bk-plan_filter.drv271  /nix/store/8byjp94z4bcpvgpc2s8ga2rqg9c3xc55-pgrouting-3.4.1.drv272  /nix/store/qs7fc4p2b8g3zc4cd29vi1wck7acipz9-pgrouting.drv273  /nix/store/rqv928k6h7v2jlfgznn4wi7km7zvm5qk-pg_tle.drv274  /nix/store/2h15dgac1417g71pjrb4aqcz8yabiv21-plpgsql_check-2.7.drv275  /nix/store/3dxfnbp09hx3zc5q8mmvb54v0nb1lrid-plpgsql_check-2.8.drv276  /nix/store/v635079aqf2hhpg4xnhm2226g7khvdav-plpgsql_check.drv277  /nix/store/84hgdiz6hjkzk0cm5bd3vqsbx45n9zkh-vector-0.8.0.drv278  /nix/store/92n1zijp3izg793lrskmws7kyjz1xg5h-vector-0.6.2.drv279  /nix/store/bxnxr2z670m9ri1dc66149krs7h60dnc-vector-0.7.0.drv280  /nix/store/nyx1ahbyki15bmvygqzj2s1nnbmbi8ig-vector-0.7.4.drv281  /nix/store/s72y0nj96pwds84md5hz9x09cidw3azz-vector-0.6.0.drv282  /nix/store/wy228ccg72w2cv5rbhynqgmbxx7dqlws-vector-0.5.1.drv283  /nix/store/za0ss4y8awhkng526g581wdnh0azibcf-vector-0.8.2.drv284  /nix/store/x3iqn55b29mih079vypw11gf008gj74l-vector.drv285  /nix/store/6601flp9bdqz93g493ma3hhb95ia16fh-pgroonga-3.2.5.drv286  /nix/store/xkmdckj5hdcfgqlyjn2qq5vdv6s09h5a-pgroonga.drv287  /nix/store/al6g5cvx86v4ljmh3sg6hmlsl3ab3bwf-pg_net-0.20.3.drv288  /nix/store/b1pyvgjyn940h95bbnsp15qmb0qli5gd-pg_net-0.20.0.drv289  /nix/store/cl8ikglrq6jdd2cp01jad7n483mvqj8g-pg_net-0.11.0.drv290  /nix/store/g6nfp5n056kw2jvfzldzxrrrxfpfcka0-pg_net-0.13.0.drv291  /nix/store/xwiwd8fzjgv67zb2ji446a8vxjj3s7bs-pg_net-0.14.0.drv292  /nix/store/yf5z0qi17vprkjz68rqyp804sx929g9n-pg_net-0.19.5.drv293  /nix/store/y02vszvrhs7b6kn8llgwzdmnmhqiymzk-pg_net.drv294  /nix/store/k684vf2v1w6afbwv98r05j1f5hg9gw2f-pg_hashids-1.3.0-cd0e1b31d52b394a0df64079406a14a4f7387cd6.drv295  /nix/store/yi643dw2hzxidf2jf635pk0da5c4bs96-pg_hashids.drv296  /nix/store/mxhjb2qfqd8l49wakfpw5qiws2v1bcnn-gdal-3.8.5.drv297  /nix/store/mrfs1y0f5l367m93gpss7lp0jg6nz3bf-postgis-3.3.7.drv298  /nix/store/yskfmp4z518h4ff0mli70gsirhsli1ns-postgis.drv299  /nix/store/nj44phx30461wf1ac6n8fg8cc58agpgv-postgresql-and-plugins-17.11.drv300  /nix/store/rn61yq57k8lhdkx7al266vkbandycwv7-postgresql-and-plugins-17.11.drv301  /nix/store/czird9kid1f479i75r0fcy4ivzd3zzs8-system-path.drv302  /nix/store/i0ygxsqq6na1vsqmbklzxrj1xy5ypk6x-dbus-1.drv303  /nix/store/xnzsv2ymk0qx1fdsm8ssls8mlq8852wc-X-Restart-Triggers-dbus.drv304  /nix/store/5q0f5sx5mas5cc56azv1g9pm53yfrmgc-unit-dbus.service.drv305  /nix/store/a03cbyqm7arwjx83nc7jiwxkbbifg33w-user-units.drv306  /nix/store/acfna74pf7f063994dvxzqkrrhi623c4-unit-dbus.service.drv307  /nix/store/rjsqz027b1xj9q5dymzvs3wbqn2dv53m-postgresql-init.drv308  /nix/store/n0j0873l4a8mlkz6x1bffr3skhaarc7q-unit-postgresql.service.drv309  /nix/store/wmsihsmjyk0h8yjj86lpmijxpzqwk8gg-postgresql-migrate.drv310  /nix/store/pml1z1qw471w7nshf5dxp826pysqs3fz-unit-postgresql-migrate.service.drv311  /nix/store/vrslgxqykax3yi5mlrpiq0v1rq1ilnic-system-units.drv312  /nix/store/p6pnncmb31ibp4zxf61fbkkb0fmq4xai-etc.drv313  /nix/store/x6cijf4csfmd0dc8sqmiajj5dwi4h3dg-activate.drv314  /nix/store/cgyqy4j1g2s9zbh87ddwhr7wn9rssarl-nixos-system-server-test.drv315  /nix/store/i3fy4azgna3zl2za0k3pwx70f2sk6hk8-receipt.drv316  /nix/store/w85w5162f9zdpi7g98sjlk186hrrm57p-postgresql-and-plugins-17_22.drv317  /nix/store/amy1ji0k53n9qihnqys9hvlc60bncr1y-system-path.drv318  /nix/store/7ynly7nv4iq2wvhmmg6p100h3wr2dpxd-dbus-1.drv319  /nix/store/v749g53p5djbqg3y7kfvdsw5g535j0js-X-Restart-Triggers-dbus.drv320  /nix/store/n7wg70ga6zm8b0prwd4np0azpi732zji-unit-dbus.service.drv321  /nix/store/bmn9rg4vrb07wyj1ls41afzdzcmhdqcm-user-units.drv322  /nix/store/jika4rfg3aj00vq2nfqx2i6nild4nvd5-unit-dbus.service.drv323  /nix/store/8r4vw45si1w8qby225b0amhay9ybj6c5-postgresql-orioledb-init.drv324  /nix/store/pgysndf7sfj9ifxk4sy1w8qfx2ln1ws6-unit-postgresql.service.drv325  /nix/store/9i9flpkzn6d3cvhin3s644150jhvcazf-supabase-orioledb-db-init.drv326  /nix/store/s4qicdb2kbzvf3lf6m8xidm4lndgs2yl-unit-supabase-db-init.service.drv327  /nix/store/dgm1f7y3gvjqjfv7r4gfa7pjffgzr4nj-system-units.drv328  /nix/store/sc9b344gbckg6fqywin6bhhs882d6mxa-etc.drv329  /nix/store/k4pazrfsvz1hsx7l4d0jsxvan5b3dq49-activate.drv330  /nix/store/m7z7bg6jaainvrfsikwclppim5yf6kn3-nixos-system-server-test.drv331  /nix/store/70bg25srcrfnwivfph4bhslzhigdgpxw-unit-dbus.service.drv332  /nix/store/cpy2j0c5ribiykpjaig0axzryxzh1g69-user-units.drv333  /nix/store/qbfmigmm8fk4v5nhvb8h71hmhmdaky0g-supabase-db-init.drv334  /nix/store/ggfylf6a7iwk3pn3r08m30684z8rrq5l-unit-supabase-db-init.service.drv335  /nix/store/qsr1582sizlpmavcla4x0gbp3q52g4pd-unit-postgresql.service.drv336  /nix/store/ydkqsx664pp5ndcfl70c84mvxgixix01-system-units.drv337  /nix/store/y3dck3diii9z9x0w771pz541gjd0zwh3-etc.drv338  /nix/store/srl146pjpar66ijj6l2zw99pmy6wpkl9-activate.drv339  /nix/store/sjl12wxd1wb23d9hzlzyqrq731lbrgpb-nixos-system-server-test.drv340  /nix/store/qv2lxny9548lwqjzpi75n12qpyc0fm56-closure-info.drv341  /nix/store/8vx14rz8lihgxgq3s0daqnbhbvnsf97x-run-nixos-vm.drv342  /nix/store/63q2a748lli2nxvrk228r5l81997jmzh-nixos-vm.drv343  /nix/store/2g9n715svv4da3bxm210vxkjr9gv7vhr-nixos-test-driver-supabase_vault.drv344  /nix/store/clfsd5z8wjirj5wxmy9rx602k5hi0gg9-vm-test-run-supabase_vault.drv345building '/nix/store/63ifr5p2wzl7vygaj7pq847nwnrnxm3p-pg_graphql-1.5.0.drv' on 'ssh-ng://nixbot-remote-build@78.232.36.247'346building '/nix/store/63ifr5p2wzl7vygaj7pq847nwnrnxm3p-pg_graphql-1.5.0.drv'347pg_graphql-1.5.0> Running phase: unpackPhase348pg_graphql-1.5.0> unpacking source archive /nix/store/yqkq9h5mmr45ibr2ffjcwwfrgc9w3mkc-source349pg_graphql-1.5.0> source root is source350pg_graphql-1.5.0> Executing cargoSetupPostUnpackHook351pg_graphql-1.5.0> Finished cargoSetupPostUnpackHook352pg_graphql-1.5.0> Running phase: patchPhase353pg_graphql-1.5.0> Executing cargoSetupPostPatchHook354pg_graphql-1.5.0> Validating consistency between /build/source/Cargo.lock and /build/cargo-vendor-dir/Cargo.lock355pg_graphql-1.5.0> Finished cargoSetupPostPatchHook356pg_graphql-1.5.0> Running phase: updateAutotoolsGnuConfigScriptsPhase357pg_graphql-1.5.0> Running phase: configurePhase358pg_graphql-1.5.0> Running phase: buildPhase359pg_graphql-1.5.0> Executing cargo-pgrx buildPhase360pg_graphql-1.5.0>    Validating /nix/store/48l45fvi99n90x6p9i4cs1lmzby6cb73-postgresql-15.19/bin/pg_config361pg_graphql-1.5.0>  Initializing data directory at /build/tmp.UMwr05s1LX/data-15362pg_graphql-1.5.0> waiting for server to start....2026-10-06 13:58:31.330 GMT [87] LOG:  starting PostgreSQL 15.19 on aarch64-unknown-linux-gnu, compiled by gcc (GCC) 15.2.0, 64-bit363pg_graphql-1.5.0> 2026-10-06 13:58:31.333 GMT [87] LOG:  listening on Unix socket "/build/tmp.FkTZ6YVZWJ/.s.PGSQL.5432"364pg_graphql-1.5.0> 2026-10-06 13:58:31.342 GMT [90] LOG:  database system was shut down at 2026-10-06 13:58:31 GMT365pg_graphql-1.5.0> 2026-10-06 13:58:31.349 GMT [87] LOG:  database system is ready to accept connections366pg_graphql-1.5.0>  done367pg_graphql-1.5.0> server started368pg_graphql-1.5.0> createuser: error: connection to server at "localhost" (127.0.0.1), port 5432 failed: Connection refused369pg_graphql-1.5.0> 	Is the server running on that host and accepting TCP/IP connections?370pg_graphql-1.5.0> waiting for server to shut down....2026-10-06 13:58:31.414 GMT [87] LOG:  received fast shutdown request371pg_graphql-1.5.0> 2026-10-06 13:58:31.417 GMT [87] LOG:  aborting any active transactions372pg_graphql-1.5.0> 2026-10-06 13:58:31.419 GMT [87] LOG:  background worker "logical replication launcher" (PID 93) exited with exit code 1373pg_graphql-1.5.0> 2026-10-06 13:58:31.420 GMT [88] LOG:  shutting down374pg_graphql-1.5.0> 2026-10-06 13:58:31.424 GMT [88] LOG:  checkpoint starting: shutdown immediate375pg_graphql-1.5.0> 2026-10-06 13:58:31.441 GMT [88] LOG:  checkpoint complete: wrote 3 buffers (0.0%); 0 WAL file(s) added, 0 removed, 0 recycled; write=0.005 s, sync=0.004 s, total=0.022 s; sync files=2, longest=0.003 s, average=0.002 s; distance=0 kB, estimate=0 kB376pg_graphql-1.5.0> 2026-10-06 13:58:31.445 GMT [87] LOG:  database system is shut down377pg_graphql-1.5.0>  done378pg_graphql-1.5.0> server stopped379pg_graphql-1.5.0> warning: `/build/source/.cargo/config` is deprecated in favor of `config.toml`380pg_graphql-1.5.0> note: if you need to support cargo 1.38 or earlier, you can symlink `config` to `config.toml`381pg_graphql-1.5.0>        Using PgConfig("pg15") and `pg_config` from /nix/store/48l45fvi99n90x6p9i4cs1lmzby6cb73-postgresql-15.19/bin/pg_config382pg_graphql-1.5.0>     Building extension with features  pg15383pg_graphql-1.5.0>      Running command "/nix/store/kpxwf6dpminza6mhj8xddnaxx6fgnfy6-rust-default-1.85.1/bin/cargo" "build" "--release" "--features" " pg15" "--no-default-features" "--message-format=json-render-diagnostics" "--frozen" "-j" "2"384pg_graphql-1.5.0> warning: `/build/source/.cargo/config` is deprecated in favor of `config.toml`385pg_graphql-1.5.0> note: if you need to support cargo 1.38 or earlier, you can symlink `config` to `config.toml`386pg_graphql-1.5.0>    Compiling proc-macro2 v1.0.75387pg_graphql-1.5.0>    Compiling unicode-ident v1.0.12388pg_graphql-1.5.0>    Compiling libc v0.2.151389pg_graphql-1.5.0>    Compiling syn v1.0.109390pg_graphql-1.5.0>    Compiling memchr v2.7.1391pg_graphql-1.5.0>    Compiling quote v1.0.35392pg_graphql-1.5.0>    Compiling thiserror v1.0.56393pg_graphql-1.5.0>    Compiling syn v2.0.48394pg_graphql-1.5.0>    Compiling serde v1.0.194395pg_graphql-1.5.0>    Compiling eyre v0.6.11396pg_graphql-1.5.0>    Compiling equivalent v1.0.1397pg_graphql-1.5.0>    Compiling hashbrown v0.14.3398pg_graphql-1.5.0>    Compiling indexmap v2.1.0399pg_graphql-1.5.0>    Compiling serde_derive v1.0.194400pg_graphql-1.5.0>    Compiling thiserror-impl v1.0.56401pg_graphql-1.5.0>    Compiling cfg-if v1.0.0402pg_graphql-1.5.0>    Compiling tinyvec_macros v0.1.1403pg_graphql-1.5.0>    Compiling glob v0.3.1404pg_graphql-1.5.0>    Compiling serde_json v1.0.111405pg_graphql-1.5.0>    Compiling clang-sys v1.7.0406pg_graphql-1.5.0>    Compiling tinyvec v1.6.0407pg_graphql-1.5.0>    Compiling indenter v0.3.3408pg_graphql-1.5.0>    Compiling anyhow v1.0.79409pg_graphql-1.5.0>    Compiling winnow v0.5.32410pg_graphql-1.5.0>    Compiling toml_datetime v0.6.5411pg_graphql-1.5.0>    Compiling serde_spanned v0.6.5412pg_graphql-1.5.0>    Compiling once_cell v1.19.0413pg_graphql-1.5.0>    Compiling ucd-trie v0.1.6414pg_graphql-1.5.0>    Compiling pest v2.7.6415pg_graphql-1.5.0>    Compiling toml_edit v0.21.0416pg_graphql-1.5.0>    Compiling unicode-normalization v0.1.22417pg_graphql-1.5.0>    Compiling percent-encoding v2.3.1418pg_graphql-1.5.0>    Compiling regex-syntax v0.8.2419pg_graphql-1.5.0>    Compiling unicode-bidi v0.3.14420pg_graphql-1.5.0>    Compiling semver v1.0.21421pg_graphql-1.5.0>    Compiling minimal-lexical v0.2.1422pg_graphql-1.5.0>    Compiling option-ext v0.2.0423pg_graphql-1.5.0>    Compiling libloading v0.8.1424pg_graphql-1.5.0>    Compiling dirs-sys v0.4.1425pg_graphql-1.5.0>    Compiling nom v7.1.3426pg_graphql-1.5.0>    Compiling regex-automata v0.4.3427pg_graphql-1.5.0>    Compiling idna v0.5.0428pg_graphql-1.5.0>    Compiling form_urlencoded v1.2.1429pg_graphql-1.5.0>    Compiling toml v0.8.8430pg_graphql-1.5.0>    Compiling semver-parser v0.10.2431pg_graphql-1.5.0>    Compiling ryu v1.0.16432pg_graphql-1.5.0>    Compiling itoa v1.0.10433pg_graphql-1.5.0>    Compiling bindgen v0.68.1434pg_graphql-1.5.0>    Compiling semver v0.11.0435pg_graphql-1.5.0>    Compiling pathsearch v0.2.0436pg_graphql-1.5.0>    Compiling cargo_toml v0.16.3437pg_graphql-1.5.0>    Compiling url v2.5.0438pg_graphql-1.5.0>    Compiling regex v1.10.2439pg_graphql-1.5.0>    Compiling cexpr v0.6.0440pg_graphql-1.5.0>    Compiling dirs v5.0.1441pg_graphql-1.5.0>    Compiling getrandom v0.2.11442pg_graphql-1.5.0>    Compiling lazycell v1.3.0443pg_graphql-1.5.0>    Compiling unicode-segmentation v1.10.1444pg_graphql-1.5.0>    Compiling rustc-hash v1.1.0445pg_graphql-1.5.0>    Compiling shlex v1.3.0446pg_graphql-1.5.0>    Compiling same-file v1.0.6447pg_graphql-1.5.0>    Compiling peeking_take_while v0.1.2448pg_graphql-1.5.0>    Compiling ident_case v1.0.1449pg_graphql-1.5.0>    Compiling autocfg v1.1.0450pg_graphql-1.5.0>    Compiling lazy_static v1.4.0451pg_graphql-1.5.0>    Compiling byteorder v1.5.0452pg_graphql-1.5.0>    Compiling owo-colors v3.5.0453pg_graphql-1.5.0>    Compiling fixedbitset v0.4.2454pg_graphql-1.5.0>    Compiling strsim v0.10.0455pg_graphql-1.5.0>    Compiling fnv v1.0.7456pg_graphql-1.5.0>    Compiling bitflags v2.4.1457pg_graphql-1.5.0>    Compiling darling_core v0.14.4458pg_graphql-1.5.0>    Compiling petgraph v0.6.4459pg_graphql-1.5.0>    Compiling pgrx-pg-config v0.11.2460pg_graphql-1.5.0>    Compiling memoffset v0.9.0461pg_graphql-1.5.0>    Compiling walkdir v2.4.0462pg_graphql-1.5.0>    Compiling convert_case v0.6.0463pg_graphql-1.5.0>    Compiling rustc_version v0.4.0464pg_graphql-1.5.0>    Compiling rustc_version v0.3.3465pg_graphql-1.5.0>    Compiling radium v0.7.0466pg_graphql-1.5.0>    Compiling unescape v0.1.0467pg_graphql-1.5.0>    Compiling pgrx-sql-entity-graph v0.11.2468pg_graphql-1.5.0>    Compiling atomic-traits v0.3.0469pg_graphql-1.5.0>    Compiling pgrx-pg-sys v0.11.2470pg_graphql-1.5.0>    Compiling heapless v0.7.17471pg_graphql-1.5.0>    Compiling darling_macro v0.14.4472pg_graphql-1.5.0>    Compiling either v1.9.0473pg_graphql-1.5.0>    Compiling void v1.0.2474pg_graphql-1.5.0>    Compiling tap v1.0.1475pg_graphql-1.5.0>    Compiling wyz v0.5.1476pg_graphql-1.5.0>    Compiling unreachable v1.0.0477pg_graphql-1.5.0>    Compiling darling v0.14.4478pg_graphql-1.5.0>    Compiling pgrx-macros v0.11.2479pg_graphql-1.5.0>    Compiling hash32 v0.2.1480pg_graphql-1.5.0>    Compiling rand_core v0.6.4481pg_graphql-1.5.0>    Compiling enum-map-derive v0.17.0482pg_graphql-1.5.0>    Compiling ppv-lite86 v0.2.17483pg_graphql-1.5.0>    Compiling funty v2.0.0484pg_graphql-1.5.0>    Compiling sptr v0.3.2485pg_graphql-1.5.0>    Compiling half v1.8.2486pg_graphql-1.5.0>    Compiling stable_deref_trait v1.2.0487pg_graphql-1.5.0>    Compiling ascii v0.9.3488pg_graphql-1.5.0>    Compiling combine v3.8.1489pg_graphql-1.5.0>    Compiling serde_cbor v0.11.2490pg_graphql-1.5.0>    Compiling bitvec v1.0.1491pg_graphql-1.5.0>    Compiling rand_chacha v0.3.1492pg_graphql-1.5.0>    Compiling enum-map v2.7.3493pg_graphql-1.5.0>    Compiling cached_proc_macro v0.18.1494pg_graphql-1.5.0>    Compiling uuid v1.6.1495pg_graphql-1.5.0>    Compiling instant v0.1.12496pg_graphql-1.5.0>    Compiling cached_proc_macro_types v0.1.0497pg_graphql-1.5.0>    Compiling seq-macro v0.3.5498pg_graphql-1.5.0>    Compiling seahash v4.1.0499pg_graphql-1.5.0>    Compiling cached v0.46.1500pg_graphql-1.5.0>    Compiling rand v0.8.5501pg_graphql-1.5.0>    Compiling pgrx v0.11.2502pg_graphql-1.5.0>    Compiling graphql-parser v0.4.0503pg_graphql-1.5.0>    Compiling itertools v0.10.5504pg_graphql-1.5.0>    Compiling bimap v0.6.3505pg_graphql-1.5.0>    Compiling base64 v0.13.1506pg_graphql-1.5.0>    Compiling pg_graphql v1.5.0 (/build/source)507pg_graphql-1.5.0> warning: unexpected `cfg` condition value: `pg11`508pg_graphql-1.5.0>   --> src/lib.rs:17:1509pg_graphql-1.5.0>    |510pg_graphql-1.5.0> 17 | pg_module_magic!();511pg_graphql-1.5.0>    | ^^^^^^^^^^^^^^^^^^512pg_graphql-1.5.0>    |513pg_graphql-1.5.0>    = note: expected values for `feature` are: `default`, `pg14`, `pg15`, `pg16`, and `pg_test`514pg_graphql-1.5.0>    = note: using a cfg inside a macro will use the cfgs from the destination crate and not the ones from the defining crate515pg_graphql-1.5.0>    = help: try referring to `$crate::pg_magic_func` crate for guidance on how handle this unexpected cfg516pg_graphql-1.5.0>    = help: the macro `$crate::pg_magic_func` may come from an old version of the `pgrx` crate, try updating your dependency with `cargo update -p pgrx`517pg_graphql-1.5.0>    = note: see <https://doc.rust-lang.org/nightly/rustc/check-cfg/cargo-specifics.html> for more information about checking conditional configuration518pg_graphql-1.5.0>    = note: `#[warn(unexpected_cfgs)]` on by default519pg_graphql-1.5.0>    = note: this warning originates in the macro `$crate::pg_magic_func` which comes from the expansion of the macro `pg_module_magic` (in Nightly builds, run with -Z macro-backtrace for more info)520pg_graphql-1.5.0> 521pg_graphql-1.5.0> warning: unexpected `cfg` condition value: `pg12`522pg_graphql-1.5.0>   --> src/lib.rs:17:1523pg_graphql-1.5.0>    |524pg_graphql-1.5.0> 17 | pg_module_magic!();525pg_graphql-1.5.0>    | ^^^^^^^^^^^^^^^^^^526pg_graphql-1.5.0>    |527pg_graphql-1.5.0>    = note: expected values for `feature` are: `default`, `pg14`, `pg15`, `pg16`, and `pg_test`528pg_graphql-1.5.0>    = note: using a cfg inside a macro will use the cfgs from the destination crate and not the ones from the defining crate529pg_graphql-1.5.0>    = help: try referring to `$crate::pg_magic_func` crate for guidance on how handle this unexpected cfg530pg_graphql-1.5.0>    = help: the macro `$crate::pg_magic_func` may come from an old version of the `pgrx` crate, try updating your dependency with `cargo update -p pgrx`531pg_graphql-1.5.0>    = note: see <https://doc.rust-lang.org/nightly/rustc/check-cfg/cargo-specifics.html> for more information about checking conditional configuration532pg_graphql-1.5.0>    = note: this warning originates in the macro `$crate::pg_magic_func` which comes from the expansion of the macro `pg_module_magic` (in Nightly builds, run with -Z macro-backtrace for more info)533pg_graphql-1.5.0> 534pg_graphql-1.5.0> warning: unexpected `cfg` condition value: `pg13`535pg_graphql-1.5.0>   --> src/lib.rs:17:1536pg_graphql-1.5.0>    |537pg_graphql-1.5.0> 17 | pg_module_magic!();538pg_graphql-1.5.0>    | ^^^^^^^^^^^^^^^^^^539pg_graphql-1.5.0>    |540pg_graphql-1.5.0>    = note: expected values for `feature` are: `default`, `pg14`, `pg15`, `pg16`, and `pg_test`541pg_graphql-1.5.0>    = note: using a cfg inside a macro will use the cfgs from the destination crate and not the ones from the defining crate542pg_graphql-1.5.0>    = help: try referring to `$crate::pg_magic_func` crate for guidance on how handle this unexpected cfg543pg_graphql-1.5.0>    = help: the macro `$crate::pg_magic_func` may come from an old version of the `pgrx` crate, try updating your dependency with `cargo update -p pgrx`544pg_graphql-1.5.0>    = note: see <https://doc.rust-lang.org/nightly/rustc/check-cfg/cargo-specifics.html> for more information about checking conditional configuration545pg_graphql-1.5.0>    = note: this warning originates in the macro `$crate::pg_magic_func` which comes from the expansion of the macro `pg_module_magic` (in Nightly builds, run with -Z macro-backtrace for more info)546pg_graphql-1.5.0> 547pg_graphql-1.5.0> warning: field `alias` is never read548pg_graphql-1.5.0>   --> src/builder.rs:14:9549pg_graphql-1.5.0>    |550pg_graphql-1.5.0> 13 | pub struct InsertBuilder {551pg_graphql-1.5.0>    |            ------------- field in this struct552pg_graphql-1.5.0> 14 |     pub alias: String,553pg_graphql-1.5.0>    |         ^^^^^554pg_graphql-1.5.0>    |555pg_graphql-1.5.0>    = note: `InsertBuilder` has derived impls for the traits `Debug` and `Clone`, but these are intentionally ignored during dead code analysis556pg_graphql-1.5.0>    = note: `#[warn(dead_code)]` on by default557pg_graphql-1.5.0> 558pg_graphql-1.5.0> warning: field `alias` is never read559pg_graphql-1.5.0>    --> src/builder.rs:337:9560pg_graphql-1.5.0>     |561pg_graphql-1.5.0> 336 | pub struct UpdateBuilder {562pg_graphql-1.5.0>     |            ------------- field in this struct563pg_graphql-1.5.0> 337 |     pub alias: String,564pg_graphql-1.5.0>     |         ^^^^^565pg_graphql-1.5.0>     |566pg_graphql-1.5.0>     = note: `UpdateBuilder` has derived impls for the traits `Debug` and `Clone`, but these are intentionally ignored during dead code analysis567pg_graphql-1.5.0> 568pg_graphql-1.5.0> warning: field `alias` is never read569pg_graphql-1.5.0>    --> src/builder.rs:509:9570pg_graphql-1.5.0>     |571pg_graphql-1.5.0> 508 | pub struct DeleteBuilder {572pg_graphql-1.5.0>     |            ------------- field in this struct573pg_graphql-1.5.0> 509 |     pub alias: String,574pg_graphql-1.5.0>     |         ^^^^^575pg_graphql-1.5.0>     |576pg_graphql-1.5.0>     = note: `DeleteBuilder` has derived impls for the traits `Debug` and `Clone`, but these are intentionally ignored during dead code analysis577pg_graphql-1.5.0> 578pg_graphql-1.5.0> warning: field `alias` is never read579pg_graphql-1.5.0>    --> src/builder.rs:611:9580pg_graphql-1.5.0>     |581pg_graphql-1.5.0> 610 | pub struct FunctionCallBuilder {582pg_graphql-1.5.0>     |            ------------------- field in this struct583pg_graphql-1.5.0> 611 |     pub alias: String,584pg_graphql-1.5.0>     |         ^^^^^585pg_graphql-1.5.0> 586pg_graphql-1.5.0> warning: field `schema` is never read587pg_graphql-1.5.0>     --> src/builder.rs:1978:9588pg_graphql-1.5.0>      |589pg_graphql-1.5.0> 1977 | pub struct __SchemaBuilder {590pg_graphql-1.5.0>      |            --------------- field in this struct591pg_graphql-1.5.0> 1978 |     pub schema: __Schema,592pg_graphql-1.5.0>      |         ^^^^^^593pg_graphql-1.5.0>      |594pg_graphql-1.5.0>      = note: `__SchemaBuilder` has a derived impl for the trait `Clone`, but this is intentionally ignored during dead code analysis595pg_graphql-1.5.0> 596pg_graphql-1.5.0> warning: method `arg_map` is never used597pg_graphql-1.5.0>    --> src/graphql.rs:349:8598pg_graphql-1.5.0>     |599pg_graphql-1.5.0> 325 | pub trait ___Field {600pg_graphql-1.5.0>     |           -------- method in this trait601pg_graphql-1.5.0> ...602pg_graphql-1.5.0> 349 |     fn arg_map(&self) -> HashMap<String, __InputValue> {603pg_graphql-1.5.0>     |        ^^^^^^^604pg_graphql-1.5.0> 605pg_graphql-1.5.0> warning: `pg_graphql` (lib) generated 9 warnings606pg_graphql-1.5.0>     Finished `release` profile [optimized] target(s) in 6m 35s607pg_graphql-1.5.0>   Installing extension608pg_graphql-1.5.0>      Copying control file to /nix/store/ln5az9jkh78pvm4bjw1p8m41bq4jsghb-pg_graphql-1.5.0/nix/store/48l45fvi99n90x6p9i4cs1lmzby6cb73-postgresql-15.19/share/postgresql/extension/pg_graphql.control609pg_graphql-1.5.0>      Copying shared library to /nix/store/ln5az9jkh78pvm4bjw1p8m41bq4jsghb-pg_graphql-1.5.0/nix/store/k4dpm55d68aq0df72hjk046xy1124lhn-postgresql-15.19-lib/lib/pg_graphql.so610pg_graphql-1.5.0>  Discovering SQL entities611pg_graphql-1.5.0>   Discovered 5 SQL entities: 0 schemas (0 unique), 1 functions, 0 types, 0 enums, 4 sqls, 0 ords, 0 hashes, 0 aggregates, 0 triggers612pg_graphql-1.5.0>      Writing SQL entities to /nix/store/ln5az9jkh78pvm4bjw1p8m41bq4jsghb-pg_graphql-1.5.0/nix/store/48l45fvi99n90x6p9i4cs1lmzby6cb73-postgresql-15.19/share/postgresql/extension/pg_graphql--1.5.0.sql613pg_graphql-1.5.0>     Finished installing pg_graphql614pg_graphql-1.5.0> buildPhase completed in 6 minutes 50 seconds615pg_graphql-1.5.0> Running phase: checkPhase616pg_graphql-1.5.0>    Validating /nix/store/48l45fvi99n90x6p9i4cs1lmzby6cb73-postgresql-15.19/bin/pg_config617pg_graphql-1.5.0>  Initializing data directory at /build/tmp.nDmT9VM42b/data-15618pg_graphql-1.5.0> waiting for server to start....2026-10-06 14:05:21.778 GMT [2079] LOG:  starting PostgreSQL 15.19 on aarch64-unknown-linux-gnu, compiled by gcc (GCC) 15.2.0, 64-bit619pg_graphql-1.5.0> 2026-10-06 14:05:21.784 GMT [2079] LOG:  listening on Unix socket "/build/tmp.ieHXGCLZBB/.s.PGSQL.5432"620pg_graphql-1.5.0> 2026-10-06 14:05:21.802 GMT [2082] LOG:  database system was shut down at 2026-10-06 14:05:21 GMT621pg_graphql-1.5.0> 2026-10-06 14:05:21.808 GMT [2079] LOG:  database system is ready to accept connections622pg_graphql-1.5.0>  done623pg_graphql-1.5.0> server started624pg_graphql-1.5.0> createuser: error: connection to server at "localhost" (127.0.0.1), port 5432 failed: Connection refused625pg_graphql-1.5.0> 	Is the server running on that host and accepting TCP/IP connections?626pg_graphql-1.5.0> waiting for server to shut down....2026-10-06 14:05:21.857 GMT [2079] LOG:  received fast shutdown request627pg_graphql-1.5.0> 2026-10-06 14:05:21.859 GMT [2079] LOG:  aborting any active transactions628pg_graphql-1.5.0> 2026-10-06 14:05:21.867 GMT [2079] LOG:  background worker "logical replication launcher" (PID 2085) exited with exit code 1629pg_graphql-1.5.0> 2026-10-06 14:05:21.867 GMT [2080] LOG:  shutting down630pg_graphql-1.5.0> 2026-10-06 14:05:21.883 GMT [2080] LOG:  checkpoint starting: shutdown immediate631pg_graphql-1.5.0> 2026-10-06 14:05:21.929 GMT [2080] LOG:  checkpoint complete: wrote 3 buffers (0.0%); 0 WAL file(s) added, 0 removed, 0 recycled; write=0.023 s, sync=0.003 s, total=0.062 s; sync files=2, longest=0.002 s, average=0.002 s; distance=0 kB, estimate=0 kB632pg_graphql-1.5.0> 2026-10-06 14:05:21.933 GMT [2079] LOG:  database system is shut down633pg_graphql-1.5.0>  done634pg_graphql-1.5.0> server stopped635pg_graphql-1.5.0> warning: `/build/source/.cargo/config` is deprecated in favor of `config.toml`636pg_graphql-1.5.0> note: if you need to support cargo 1.38 or earlier, you can symlink `config` to `config.toml`637pg_graphql-1.5.0>    Validating /build/tmp.DEK3JGi27v/15/bin/pg_config638pg_graphql-1.5.0>  Initializing data directory at /build/tmp.DEK3JGi27v/data-15639pg_graphql-1.5.0> warning: `/build/source/.cargo/config` is deprecated in favor of `config.toml`640pg_graphql-1.5.0> note: if you need to support cargo 1.38 or earlier, you can symlink `config` to `config.toml`641pg_graphql-1.5.0>        Using PgConfig("pg15") and `pg_config` from /build/tmp.DEK3JGi27v/15/bin/pg_config642pg_graphql-1.5.0>     Building extension with features pg15643pg_graphql-1.5.0>      Running command "/nix/store/kpxwf6dpminza6mhj8xddnaxx6fgnfy6-rust-default-1.85.1/bin/cargo" "build" "--release" "--features" "pg15" "--no-default-features" "--message-format=json-render-diagnostics" "--frozen" "-j" "2"644pg_graphql-1.5.0> warning: `/build/source/.cargo/config` is deprecated in favor of `config.toml`645pg_graphql-1.5.0> note: if you need to support cargo 1.38 or earlier, you can symlink `config` to `config.toml`646pg_graphql-1.5.0> warning: unexpected `cfg` condition value: `pg11`647pg_graphql-1.5.0>   --> src/lib.rs:17:1648pg_graphql-1.5.0>    |649pg_graphql-1.5.0> 17 | pg_module_magic!();650pg_graphql-1.5.0>    | ^^^^^^^^^^^^^^^^^^651pg_graphql-1.5.0>    |652pg_graphql-1.5.0>    = note: expected values for `feature` are: `default`, `pg14`, `pg15`, `pg16`, and `pg_test`653pg_graphql-1.5.0>    = note: using a cfg inside a macro will use the cfgs from the destination crate and not the ones from the defining crate654pg_graphql-1.5.0>    = help: try referring to `$crate::pg_magic_func` crate for guidance on how handle this unexpected cfg655pg_graphql-1.5.0>    = help: the macro `$crate::pg_magic_func` may come from an old version of the `pgrx` crate, try updating your dependency with `cargo update -p pgrx`656pg_graphql-1.5.0>    = note: see <https://doc.rust-lang.org/nightly/rustc/check-cfg/cargo-specifics.html> for more information about checking conditional configuration657pg_graphql-1.5.0>    = note: `#[warn(unexpected_cfgs)]` on by default658pg_graphql-1.5.0>    = note: this warning originates in the macro `$crate::pg_magic_func` which comes from the expansion of the macro `pg_module_magic` (in Nightly builds, run with -Z macro-backtrace for more info)659pg_graphql-1.5.0> 660pg_graphql-1.5.0> warning: unexpected `cfg` condition value: `pg12`661pg_graphql-1.5.0>   --> src/lib.rs:17:1662pg_graphql-1.5.0>    |663pg_graphql-1.5.0> 17 | pg_module_magic!();664pg_graphql-1.5.0>    | ^^^^^^^^^^^^^^^^^^665pg_graphql-1.5.0>    |666pg_graphql-1.5.0>    = note: expected values for `feature` are: `default`, `pg14`, `pg15`, `pg16`, and `pg_test`667pg_graphql-1.5.0>    = note: using a cfg inside a macro will use the cfgs from the destination crate and not the ones from the defining crate668pg_graphql-1.5.0>    = help: try referring to `$crate::pg_magic_func` crate for guidance on how handle this unexpected cfg669pg_graphql-1.5.0>    = help: the macro `$crate::pg_magic_func` may come from an old version of the `pgrx` crate, try updating your dependency with `cargo update -p pgrx`670pg_graphql-1.5.0>    = note: see <https://doc.rust-lang.org/nightly/rustc/check-cfg/cargo-specifics.html> for more information about checking conditional configuration671pg_graphql-1.5.0>    = note: this warning originates in the macro `$crate::pg_magic_func` which comes from the expansion of the macro `pg_module_magic` (in Nightly builds, run with -Z macro-backtrace for more info)672pg_graphql-1.5.0> 673pg_graphql-1.5.0> warning: unexpected `cfg` condition value: `pg13`674pg_graphql-1.5.0>   --> src/lib.rs:17:1675pg_graphql-1.5.0>    |676pg_graphql-1.5.0> 17 | pg_module_magic!();677pg_graphql-1.5.0>    | ^^^^^^^^^^^^^^^^^^678pg_graphql-1.5.0>    |679pg_graphql-1.5.0>    = note: expected values for `feature` are: `default`, `pg14`, `pg15`, `pg16`, and `pg_test`680pg_graphql-1.5.0>    = note: using a cfg inside a macro will use the cfgs from the destination crate and not the ones from the defining crate681pg_graphql-1.5.0>    = help: try referring to `$crate::pg_magic_func` crate for guidance on how handle this unexpected cfg682pg_graphql-1.5.0>    = help: the macro `$crate::pg_magic_func` may come from an old version of the `pgrx` crate, try updating your dependency with `cargo update -p pgrx`683pg_graphql-1.5.0>    = note: see <https://doc.rust-lang.org/nightly/rustc/check-cfg/cargo-specifics.html> for more information about checking conditional configuration684pg_graphql-1.5.0>    = note: this warning originates in the macro `$crate::pg_magic_func` which comes from the expansion of the macro `pg_module_magic` (in Nightly builds, run with -Z macro-backtrace for more info)685pg_graphql-1.5.0> 686pg_graphql-1.5.0> warning: field `alias` is never read687pg_graphql-1.5.0>   --> src/builder.rs:14:9688pg_graphql-1.5.0>    |689pg_graphql-1.5.0> 13 | pub struct InsertBuilder {690pg_graphql-1.5.0>    |            ------------- field in this struct691pg_graphql-1.5.0> 14 |     pub alias: String,692pg_graphql-1.5.0>    |         ^^^^^693pg_graphql-1.5.0>    |694pg_graphql-1.5.0>    = note: `InsertBuilder` has derived impls for the traits `Debug` and `Clone`, but these are intentionally ignored during dead code analysis695pg_graphql-1.5.0>    = note: `#[warn(dead_code)]` on by default696pg_graphql-1.5.0> 697pg_graphql-1.5.0> warning: field `alias` is never read698pg_graphql-1.5.0>    --> src/builder.rs:337:9699pg_graphql-1.5.0>     |700pg_graphql-1.5.0> 336 | pub struct UpdateBuilder {701pg_graphql-1.5.0>     |            ------------- field in this struct702pg_graphql-1.5.0> 337 |     pub alias: String,703pg_graphql-1.5.0>     |         ^^^^^704pg_graphql-1.5.0>     |705pg_graphql-1.5.0>     = note: `UpdateBuilder` has derived impls for the traits `Debug` and `Clone`, but these are intentionally ignored during dead code analysis706pg_graphql-1.5.0> 707pg_graphql-1.5.0> warning: field `alias` is never read708pg_graphql-1.5.0>    --> src/builder.rs:509:9709pg_graphql-1.5.0>     |710pg_graphql-1.5.0> 508 | pub struct DeleteBuilder {711pg_graphql-1.5.0>     |            ------------- field in this struct712pg_graphql-1.5.0> 509 |     pub alias: String,713pg_graphql-1.5.0>     |         ^^^^^714pg_graphql-1.5.0>     |715pg_graphql-1.5.0>     = note: `DeleteBuilder` has derived impls for the traits `Debug` and `Clone`, but these are intentionally ignored during dead code analysis716pg_graphql-1.5.0> 717pg_graphql-1.5.0> warning: field `alias` is never read718pg_graphql-1.5.0>    --> src/builder.rs:611:9719pg_graphql-1.5.0>     |720pg_graphql-1.5.0> 610 | pub struct FunctionCallBuilder {721pg_graphql-1.5.0>     |            ------------------- field in this struct722pg_graphql-1.5.0> 611 |     pub alias: String,723pg_graphql-1.5.0>     |         ^^^^^724pg_graphql-1.5.0> 725pg_graphql-1.5.0> warning: field `schema` is never read726pg_graphql-1.5.0>     --> src/builder.rs:1978:9727pg_graphql-1.5.0>      |728pg_graphql-1.5.0> 1977 | pub struct __SchemaBuilder {729pg_graphql-1.5.0>      |            --------------- field in this struct730pg_graphql-1.5.0> 1978 |     pub schema: __Schema,731pg_graphql-1.5.0>      |         ^^^^^^732pg_graphql-1.5.0>      |733pg_graphql-1.5.0>      = note: `__SchemaBuilder` has a derived impl for the trait `Clone`, but this is intentionally ignored during dead code analysis734pg_graphql-1.5.0> 735pg_graphql-1.5.0> warning: method `arg_map` is never used736pg_graphql-1.5.0>    --> src/graphql.rs:349:8737pg_graphql-1.5.0>     |738pg_graphql-1.5.0> 325 | pub trait ___Field {739pg_graphql-1.5.0>     |           -------- method in this trait740pg_graphql-1.5.0> ...741pg_graphql-1.5.0> 349 |     fn arg_map(&self) -> HashMap<String, __InputValue> {742pg_graphql-1.5.0>     |        ^^^^^^^743pg_graphql-1.5.0> 744pg_graphql-1.5.0> warning: `pg_graphql` (lib) generated 9 warnings745pg_graphql-1.5.0>     Finished `release` profile [optimized] target(s) in 0.12s746pg_graphql-1.5.0>   Installing extension747pg_graphql-1.5.0>      Copying control file to /build/tmp.DEK3JGi27v/15/share/postgresql/extension/pg_graphql.control748pg_graphql-1.5.0>      Copying shared library to /build/tmp.DEK3JGi27v/15/lib/pg_graphql.so749pg_graphql-1.5.0>  Discovering SQL entities750pg_graphql-1.5.0>   Discovered 5 SQL entities: 0 schemas (0 unique), 1 functions, 0 types, 0 enums, 4 sqls, 0 ords, 0 hashes, 0 aggregates, 0 triggers751pg_graphql-1.5.0>      Writing SQL entities to /build/tmp.DEK3JGi27v/15/share/postgresql/extension/pg_graphql--1.5.0.sql752pg_graphql-1.5.0>     Finished installing pg_graphql753pg_graphql-1.5.0> ++ mktemp -d754pg_graphql-1.5.0> + TMPDIR=/build/tmp.62IuuIKqSU755pg_graphql-1.5.0> + export PGDATA=/build/tmp.62IuuIKqSU756pg_graphql-1.5.0> + PGDATA=/build/tmp.62IuuIKqSU757pg_graphql-1.5.0> + export PGHOST=/build/tmp.62IuuIKqSU758pg_graphql-1.5.0> + PGHOST=/build/tmp.62IuuIKqSU759pg_graphql-1.5.0> + export PGUSER=postgres760pg_graphql-1.5.0> + PGUSER=postgres761pg_graphql-1.5.0> + export PGDATABASE=postgres762pg_graphql-1.5.0> + PGDATABASE=postgres763pg_graphql-1.5.0> + export PGTZ=UTC764pg_graphql-1.5.0> + PGTZ=UTC765pg_graphql-1.5.0> + export PG_COLOR=auto766pg_graphql-1.5.0> + PG_COLOR=auto767pg_graphql-1.5.0> + trap 'pg_ctl stop -m i' sigint sigterm exit768pg_graphql-1.5.0> + rm -rf /build/tmp.62IuuIKqSU769pg_graphql-1.5.0> + initdb --no-locale --encoding=UTF8 --nosync -U postgres770pg_graphql-1.5.0> The files belonging to this database system will be owned by user "nixbld".771pg_graphql-1.5.0> This user must also own the server process.772pg_graphql-1.5.0> 773pg_graphql-1.5.0> The database cluster will be initialized with locale "C".774pg_graphql-1.5.0> The default text search configuration will be set to "english".775pg_graphql-1.5.0> 776pg_graphql-1.5.0> Data page checksums are disabled.777pg_graphql-1.5.0> 778pg_graphql-1.5.0> creating directory /build/tmp.62IuuIKqSU ... ok779pg_graphql-1.5.0> creating subdirectories ... ok780pg_graphql-1.5.0> selecting dynamic shared memory implementation ... posix781pg_graphql-1.5.0> selecting default max_connections ... 100782pg_graphql-1.5.0> selecting default shared_buffers ... 128MB783pg_graphql-1.5.0> selecting default time zone ... UTC784pg_graphql-1.5.0> creating configuration files ... ok785pg_graphql-1.5.0> running bootstrap script ... ok786pg_graphql-1.5.0> performing post-bootstrap initialization ... ok787pg_graphql-1.5.0> 788pg_graphql-1.5.0> Sync to disk skipped.789pg_graphql-1.5.0> The data directory might become corrupt if the operating system crashes.790pg_graphql-1.5.0> 791pg_graphql-1.5.0> initdb: warning: enabling "trust" authentication for local connections792pg_graphql-1.5.0> initdb: hint: You can change this by editing pg_hba.conf or using the option -A, or --auth-local and --auth-host, the next time you run initdb.793pg_graphql-1.5.0> 794pg_graphql-1.5.0> Success. You can now start the database server using:795pg_graphql-1.5.0> 796pg_graphql-1.5.0>     /build/tmp.DEK3JGi27v/15/bin/pg_ctl -D /build/tmp.62IuuIKqSU -l logfile start797pg_graphql-1.5.0> 798pg_graphql-1.5.0> + pg_ctl start -o '-F -c listen_addresses="" -c log_min_messages=WARNING -k /build/tmp.62IuuIKqSU'799pg_graphql-1.5.0> waiting for server to start....2026-10-06 14:05:37.343 UTC [2170] LOG:  starting PostgreSQL 15.19 on aarch64-unknown-linux-gnu, compiled by gcc (GCC) 15.2.0, 64-bit800pg_graphql-1.5.0> 2026-10-06 14:05:37.344 UTC [2170] LOG:  listening on Unix socket "/build/tmp.62IuuIKqSU/.s.PGSQL.5432"801pg_graphql-1.5.0> 2026-10-06 14:05:37.346 UTC [2173] LOG:  database system was shut down at 2026-10-06 14:05:37 UTC802pg_graphql-1.5.0> 2026-10-06 14:05:37.350 UTC [2170] LOG:  database system is ready to accept connections803pg_graphql-1.5.0>  done804pg_graphql-1.5.0> server started805pg_graphql-1.5.0> + createdb contrib_regression806pg_graphql-1.5.0> + TESTDIR=test807pg_graphql-1.5.0> +++ pg_config --pgxs808pg_graphql-1.5.0> ++ dirname /nix/store/48l45fvi99n90x6p9i4cs1lmzby6cb73-postgresql-15.19/lib/pgxs/src/makefiles/pgxs.mk809pg_graphql-1.5.0> + PGXS=/nix/store/48l45fvi99n90x6p9i4cs1lmzby6cb73-postgresql-15.19/lib/pgxs/src/makefiles810pg_graphql-1.5.0> + REGRESS=/nix/store/48l45fvi99n90x6p9i4cs1lmzby6cb73-postgresql-15.19/lib/pgxs/src/makefiles/../test/regress/pg_regress811pg_graphql-1.5.0> + '[' 0 -ne 0 ']'812pg_graphql-1.5.0> ++ ls test/sql813pg_graphql-1.5.0> ++ sed -e 's/\..*$//'814pg_graphql-1.5.0> ++ sort815pg_graphql-1.5.0> + TESTS=$'aliases\nallow_camel_names\narray_args_and_return_types\nbigint_is_string\nbuiltin_directives\ncomment_directive\ncomment_directive_description\ncompound_filters\nempty_mutations\nenum_mappings\nextend_type_with_function\nextend_type_with_function_relation\nextend_type_with_generated_column\nfilter_by_node_id\nfragment_on_mutation\nfragment_on_query\nfunction_calls\nfunction_calls_unsupported\nfunction_return_row_is_selectable\nfunction_return_view_has_pkey\ninflection_fields\ninflection_function\ninflection_relationships\ninflection_types\nissue_163\nissue_170\nissue_225\nissue_237_field_merging\nissue_237_field_merging_mismatched\nissue_300\nissue_306\nissue_312\nissue_334_ambiguous_function\nissue_337\nissue_339_function_return_json\nissue_339_function_return_table\nissue_353_too_many_fields\nissue_370_citext_as_string\nissue_373\nissue_377_enum_search_path\nissue_444\nissue_463\nissue_fragment_spread_cycles\njson_is_stringified\nmax_page_size\nmax_rows_directive\nmulti_column_primary_key\nmultiple_mutations\nmultiple_queries\nmutation_delete\nmutation_delete_variable\nmutation_insert\nmutation_update\nnull_argument\nomit_exotic_types\nomit_weird_names\noperation_name\noverride_enum_name\noverride_field_name\noverride_func_field_name\noverride_relationship_field_name\noverride_type_name\npage_info\npermissions_connection_column\npermissions_functions\npermissions_node_column\npermissions_table_level\npermissions_types\nprimary_key_is_required\nrelationship_one_to_one\nresolve___schema\nresolve___type\nresolve___typename\nresolve_array_type\nresolve_connection_filter\nresolve_connection_named\nresolve_connection_order_by\nresolve_connection_pagination_args\nresolve_connection_to_conn\nresolve_connection_to_node\nresolve_error_connection_edge_no_field\nresolve_error_connection_edge_node_no_field\nresolve_error_connection_no_field\nresolve_error_from_parser\nresolve_error_mutation_no_field\nresolve_error_node_no_field\nresolve_error_query_no_field\nresolve_fragment\nresolve_graphiql_schema\nresolve_one\nroundtrip_types\nrow_level_security\nsqli_connection\nstring_filters\ntest_error_anon_and_named_operations\ntest_error_invalid_offset\ntest_error_multiple_anon_operations\ntest_error_mutation_transpilation\ntest_error_operation_name_not_found\ntest_error_operation_names_not_unique\ntest_error_parsing\ntest_error_query_transpilation\ntest_error_subscription\ntest_query__type\ntotal_count\ntype_bigfloat\ntype_modifier_max_length\ntype_opaque\nvariable_default\nviews_integration'816pg_graphql-1.5.0> + psql -v ON_ERROR_STOP=1 -f test/fixtures.sql -d contrib_regression817pg_graphql-1.5.0> psql:test/fixtures.sql:1: NOTICE:  extension "pg_graphql" does not exist, skipping818pg_graphql-1.5.0> DROP EXTENSION819pg_graphql-1.5.0> CREATE EXTENSION820pg_graphql-1.5.0> COMMENT821pg_graphql-1.5.0> CREATE FUNCTION822pg_graphql-1.5.0> + /nix/store/48l45fvi99n90x6p9i4cs1lmzby6cb73-postgresql-15.19/lib/pgxs/src/makefiles/../test/regress/pg_regress --use-existing --dbname=contrib_regression --inputdir=test aliases allow_camel_names array_args_and_return_types bigint_is_string builtin_directives comment_directive comment_directive_description compound_filters empty_mutations enum_mappings extend_type_with_function extend_type_with_function_relation extend_type_with_generated_column filter_by_node_id fragment_on_mutation fragment_on_query function_calls function_calls_unsupported function_return_row_is_selectable function_return_view_has_pkey inflection_fields inflection_function inflection_relationships inflection_types issue_163 issue_170 issue_225 issue_237_field_merging issue_237_field_merging_mismatched issue_300 issue_306 issue_312 issue_334_ambiguous_function issue_337 issue_339_function_return_json issue_339_function_return_table issue_353_too_many_fields issue_370_citext_as_string issue_373 issue_377_enum_search_path issue_444 issue_463 issue_fragment_spread_cycles json_is_stringified max_page_size max_rows_directive multi_column_primary_key multiple_mutations multiple_queries mutation_delete mutation_delete_variable mutation_insert mutation_update null_argument omit_exotic_types omit_weird_names operation_name override_enum_name override_field_name override_func_field_name override_relationship_field_name override_type_name page_info permissions_connection_column permissions_functions permissions_node_column permissions_table_level permissions_types primary_key_is_required relationship_one_to_one resolve___schema resolve___type resolve___typename resolve_array_type resolve_connection_filter resolve_connection_named resolve_connection_order_by resolve_connection_pagination_args resolve_connection_to_conn resolve_connection_to_node resolve_error_connection_edge_no_field resolve_error_connection_edge_node_no_field resolve_error_connection_no_field resolve_error_from_parser resolve_error_mutation_no_field resolve_error_node_no_field resolve_error_query_no_field resolve_fragment resolve_graphiql_schema resolve_one roundtrip_types row_level_security sqli_connection string_filters test_error_anon_and_named_operations test_error_invalid_offset test_error_multiple_anon_operations test_error_mutation_transpilation test_error_operation_name_not_found test_error_operation_names_not_unique test_error_parsing test_error_query_transpilation test_error_subscription test_query__type total_count type_bigfloat type_modifier_max_length type_opaque variable_default views_integration823pg_graphql-1.5.0> (using postmaster on /build/tmp.62IuuIKqSU, default port)824pg_graphql-1.5.0> ============== running regression test queries        ==============825pg_graphql-1.5.0> test aliases                      ... ok           56 ms826pg_graphql-1.5.0> test allow_camel_names            ... ok           56 ms827pg_graphql-1.5.0> test array_args_and_return_types  ... ok         1558 ms828pg_graphql-1.5.0> test bigint_is_string             ... ok           54 ms829pg_graphql-1.5.0> test builtin_directives           ... ok           59 ms830pg_graphql-1.5.0> test comment_directive            ... ok            9 ms831pg_graphql-1.5.0> test comment_directive_description ... ok           47 ms832pg_graphql-1.5.0> test compound_filters             ... ok          247 ms833pg_graphql-1.5.0> test empty_mutations              ... ok           48 ms834pg_graphql-1.5.0> test enum_mappings                ... ok           56 ms835pg_graphql-1.5.0> test extend_type_with_function    ... ok           53 ms836pg_graphql-1.5.0> test extend_type_with_function_relation ... ok          140 ms837pg_graphql-1.5.0> test extend_type_with_generated_column ... ok           50 ms838pg_graphql-1.5.0> test filter_by_node_id            ... ok           55 ms839pg_graphql-1.5.0> test fragment_on_mutation         ... ok           47 ms840pg_graphql-1.5.0> test fragment_on_query            ... ok           47 ms841pg_graphql-1.5.0> test function_calls               ... ok         1299 ms842pg_graphql-1.5.0> test function_calls_unsupported   ... ok          288 ms843pg_graphql-1.5.0> test function_return_row_is_selectable ... ok           78 ms844pg_graphql-1.5.0> test function_return_view_has_pkey ... ok           73 ms845pg_graphql-1.5.0> test inflection_fields            ... ok          122 ms846pg_graphql-1.5.0> test inflection_function          ... ok          123 ms847pg_graphql-1.5.0> test inflection_relationships     ... ok          183 ms848pg_graphql-1.5.0> test inflection_types             ... ok          123 ms849pg_graphql-1.5.0> test issue_163                    ... ok           47 ms850pg_graphql-1.5.0> test issue_170                    ... ok           48 ms851pg_graphql-1.5.0> test issue_225                    ... ok           52 ms852pg_graphql-1.5.0> test issue_237_field_merging      ... ok           49 ms853pg_graphql-1.5.0> test issue_237_field_merging_mismatched ... ok           49 ms854pg_graphql-1.5.0> test issue_300                    ... ok           50 ms855pg_graphql-1.5.0> test issue_306                    ... ok           55 ms856pg_graphql-1.5.0> test issue_312                    ... ok           49 ms857pg_graphql-1.5.0> test issue_334_ambiguous_function ... ok           50 ms858pg_graphql-1.5.0> test issue_337                    ... ok           89 ms859pg_graphql-1.5.0> test issue_339_function_return_json ... ok           48 ms860pg_graphql-1.5.0> test issue_339_function_return_table ... ok           48 ms861pg_graphql-1.5.0> test issue_353_too_many_fields    ... ok           63 ms862pg_graphql-1.5.0> test issue_370_citext_as_string   ... ok           66 ms863pg_graphql-1.5.0> test issue_373                    ... ok           52 ms864pg_graphql-1.5.0> test issue_377_enum_search_path   ... ok           76 ms865pg_graphql-1.5.0> test issue_444                    ... ok           44 ms866pg_graphql-1.5.0> test issue_463                    ... ok           49 ms867pg_graphql-1.5.0> test issue_fragment_spread_cycles ... ok          201 ms868pg_graphql-1.5.0> test json_is_stringified          ... ok           53 ms869pg_graphql-1.5.0> test max_page_size                ... ok           49 ms870pg_graphql-1.5.0> test max_rows_directive           ... ok           98 ms871pg_graphql-1.5.0> test multi_column_primary_key     ... ok           60 ms872pg_graphql-1.5.0> test multiple_mutations           ... ok           49 ms873pg_graphql-1.5.0> test multiple_queries             ... ok           50 ms874pg_graphql-1.5.0> test mutation_delete              ... ok           60 ms875pg_graphql-1.5.0> test mutation_delete_variable     ... ok           50 ms876pg_graphql-1.5.0> test mutation_insert              ... ok           62 ms877pg_graphql-1.5.0> test mutation_update              ... ok           64 ms878pg_graphql-1.5.0> test null_argument                ... ok           47 ms879pg_graphql-1.5.0> test omit_exotic_types            ... ok           50 ms880pg_graphql-1.5.0> test omit_weird_names             ... ok           73 ms881pg_graphql-1.5.0> test operation_name               ... ok           50 ms882pg_graphql-1.5.0> test override_enum_name           ... ok           44 ms883pg_graphql-1.5.0> test override_field_name          ... ok           46 ms884pg_graphql-1.5.0> test override_func_field_name     ... ok           48 ms885pg_graphql-1.5.0> test override_relationship_field_name ... ok           51 ms886pg_graphql-1.5.0> test override_type_name           ... ok           49 ms887pg_graphql-1.5.0> test page_info                    ... ok           67 ms888pg_graphql-1.5.0> test permissions_connection_column ... ok           79 ms889pg_graphql-1.5.0> test permissions_functions        ... ok           72 ms890pg_graphql-1.5.0> test permissions_node_column      ... ok           82 ms891pg_graphql-1.5.0> test permissions_table_level      ... ok          159 ms892pg_graphql-1.5.0> test permissions_types            ... ok           95 ms893pg_graphql-1.5.0> test primary_key_is_required      ... ok           76 ms894pg_graphql-1.5.0> test relationship_one_to_one      ... ok           54 ms895pg_graphql-1.5.0> test resolve___schema             ... ok           60 ms896pg_graphql-1.5.0> test resolve___type               ... ok           48 ms897pg_graphql-1.5.0> test resolve___typename           ... ok           53 ms898pg_graphql-1.5.0> test resolve_array_type           ... ok           52 ms899pg_graphql-1.5.0> test resolve_connection_filter    ... ok           95 ms900pg_graphql-1.5.0> test resolve_connection_named     ... ok           47 ms901pg_graphql-1.5.0> test resolve_connection_order_by  ... ok           74 ms902pg_graphql-1.5.0> test resolve_connection_pagination_args ... ok           96 ms903pg_graphql-1.5.0> test resolve_connection_to_conn   ... ok           54 ms904pg_graphql-1.5.0> test resolve_connection_to_node   ... ok           54 ms905pg_graphql-1.5.0> test resolve_error_connection_edge_no_field ... ok           48 ms906pg_graphql-1.5.0> test resolve_error_connection_edge_node_no_field ... ok           47 ms907pg_graphql-1.5.0> test resolve_error_connection_no_field ... ok           46 ms908pg_graphql-1.5.0> test resolve_error_from_parser    ... ok           11 ms909pg_graphql-1.5.0> test resolve_error_mutation_no_field ... ok           43 ms910pg_graphql-1.5.0> test resolve_error_node_no_field  ... ok           49 ms911pg_graphql-1.5.0> test resolve_error_query_no_field ... ok           43 ms912pg_graphql-1.5.0> test resolve_fragment             ... ok           50 ms913pg_graphql-1.5.0> test resolve_graphiql_schema      ... ok          146 ms914pg_graphql-1.5.0> test resolve_one                  ... ok           88 ms915pg_graphql-1.5.0> test roundtrip_types              ... ok           63 ms916pg_graphql-1.5.0> test row_level_security           ... ok           51 ms917pg_graphql-1.5.0> test sqli_connection              ... ok           60 ms918pg_graphql-1.5.0> test string_filters               ... ok           64 ms919pg_graphql-1.5.0> test test_error_anon_and_named_operations ... ok           42 ms920pg_graphql-1.5.0> test test_error_invalid_offset    ... ok           77 ms921pg_graphql-1.5.0> test test_error_multiple_anon_operations ... ok           42 ms922pg_graphql-1.5.0> test test_error_mutation_transpilation ... ok           48 ms923pg_graphql-1.5.0> test test_error_operation_name_not_found ... ok           42 ms924pg_graphql-1.5.0> test test_error_operation_names_not_unique ... ok           43 ms925pg_graphql-1.5.0> test test_error_parsing           ... ok           11 ms926pg_graphql-1.5.0> test test_error_query_transpilation ... ok           50 ms927pg_graphql-1.5.0> test test_error_subscription      ... ok           42 ms928pg_graphql-1.5.0> test test_query__type             ... ok           42 ms929pg_graphql-1.5.0> test total_count                  ... ok           76 ms930pg_graphql-1.5.0> test type_bigfloat                ... ok           52 ms931pg_graphql-1.5.0> test type_modifier_max_length     ... ok           52 ms932pg_graphql-1.5.0> test type_opaque                  ... ok           53 ms933pg_graphql-1.5.0> test variable_default             ... ok           50 ms934pg_graphql-1.5.0> test views_integration            ... ok          169 ms935pg_graphql-1.5.0> 936pg_graphql-1.5.0> =======================937pg_graphql-1.5.0>  All 110 tests passed. 938pg_graphql-1.5.0> =======================939pg_graphql-1.5.0> 940pg_graphql-1.5.0> + pg_ctl stop -m i941pg_graphql-1.5.0> waiting for server to shut down....2026-10-06 14:05:47.811 UTC [2170] LOG:  received immediate shutdown request942pg_graphql-1.5.0> 2026-10-06 14:05:47.818 UTC [2170] LOG:  database system is shut down943pg_graphql-1.5.0>  done944pg_graphql-1.5.0> server stopped945pg_graphql-1.5.0> Running phase: installPhase946pg_graphql-1.5.0> Executing buildPgrxExtension install947pg_graphql-1.5.0> Running phase: fixupPhase948pg_graphql-1.5.0> shrinking RPATHs of ELF executables and libraries in /nix/store/ln5az9jkh78pvm4bjw1p8m41bq4jsghb-pg_graphql-1.5.0949pg_graphql-1.5.0> shrinking /nix/store/ln5az9jkh78pvm4bjw1p8m41bq4jsghb-pg_graphql-1.5.0/lib/pg_graphql-1.5.0.so950pg_graphql-1.5.0> checking for references to /build/ in /nix/store/ln5az9jkh78pvm4bjw1p8m41bq4jsghb-pg_graphql-1.5.0...951pg_graphql-1.5.0> patching script interpreter paths in /nix/store/ln5az9jkh78pvm4bjw1p8m41bq4jsghb-pg_graphql-1.5.0952pg_graphql-1.5.0> stripping (with command strip and flags -S -p) in  /nix/store/ln5az9jkh78pvm4bjw1p8m41bq4jsghb-pg_graphql-1.5.0/lib953pg_graphql-1.5.0> stripping (with command strip and flags -s -p) in  /nix/store/ln5az9jkh78pvm4bjw1p8m41bq4jsghb-pg_graphql-1.5.0/lib954building '/nix/store/94d6rmv5v8zdjsgzl3yrhpg7zq6zdjpx-vector-0.5.1.drv' on 'ssh-ng://nixbot-remote-build@78.232.36.247'955building '/nix/store/94d6rmv5v8zdjsgzl3yrhpg7zq6zdjpx-vector-0.5.1.drv'956vector-0.5.1> Running phase: unpackPhase957vector-0.5.1> unpacking source archive /nix/store/210zrqjc4d9grn8xqr3qlsmgg8h09bks-source958vector-0.5.1> source root is source959vector-0.5.1> Running phase: patchPhase960vector-0.5.1> Running phase: updateAutotoolsGnuConfigScriptsPhase961vector-0.5.1> Running phase: configurePhase962vector-0.5.1> no configure script, doing nothing963vector-0.5.1> Running phase: buildPhase964vector-0.5.1> build flags: SHELL=/nix/store/q1lr86rzsxxbbqdz8m6bcv94saaz8wlv-bash-5.3p3/bin/bash965vector-0.5.1> gcc -Wall -Wmissing-prototypes -Wpointer-arith -Wdeclaration-after-statement -Werror=vla -Wendif-labels -Wmissing-format-attribute -Wimplicit-fallthrough=3 -Wcast-function-type -Wformat-security -fno-strict-aliasing -fwrapv -fexcess-precision=standard -Wno-deprecated-non-prototype -Wno-format-truncation -Wno-stringop-truncation -g -O2 -std=gnu17 -march=native -ftree-vectorize -fassociative-math -fno-signed-zeros -fno-trapping-math -fPIC -I. -I./ -I/nix/store/48l45fvi99n90x6p9i4cs1lmzby6cb73-postgresql-15.19/include/server -I/nix/store/48l45fvi99n90x6p9i4cs1lmzby6cb73-postgresql-15.19/include/internal -D_GNU_SOURCE  -I/nix/store/p17klc3qq4nl9ihfwqfpi8cnqvcf92xz-libxml2-2.15.1-dev/include/libxml2 -I/nix/store/mglbi4dy4kpx7v1dcgf6iincp5x38hsc-lz4-1.10.0-dev/include -I/nix/store/g41q9md9rdcr3lkydi6f8zd6fza3h1q4-zstd-1.5.7-dev/include -I/nix/store/n2vnr7ycfk6midbzxcwd28qj3bgb50cz-icu4c-75.1-dev/include  -c -o src/hnsw.o src/hnsw.c966vector-0.5.1> warning: Skipping impure flag -march=native because NIX_ENFORCE_NO_NATIVE is set967vector-0.5.1> gcc -Wall -Wmissing-prototypes -Wpointer-arith -Wdeclaration-after-statement -Werror=vla -Wendif-labels -Wmissing-format-attribute -Wimplicit-fallthrough=3 -Wcast-function-type -Wformat-security -fno-strict-aliasing -fwrapv -fexcess-precision=standard -Wno-deprecated-non-prototype -Wno-format-truncation -Wno-stringop-truncation -g -O2 -std=gnu17 -march=native -ftree-vectorize -fassociative-math -fno-signed-zeros -fno-trapping-math -fPIC -I. -I./ -I/nix/store/48l45fvi99n90x6p9i4cs1lmzby6cb73-postgresql-15.19/include/server -I/nix/store/48l45fvi99n90x6p9i4cs1lmzby6cb73-postgresql-15.19/include/internal -D_GNU_SOURCE  -I/nix/store/p17klc3qq4nl9ihfwqfpi8cnqvcf92xz-libxml2-2.15.1-dev/include/libxml2 -I/nix/store/mglbi4dy4kpx7v1dcgf6iincp5x38hsc-lz4-1.10.0-dev/include -I/nix/store/g41q9md9rdcr3lkydi6f8zd6fza3h1q4-zstd-1.5.7-dev/include -I/nix/store/n2vnr7ycfk6midbzxcwd28qj3bgb50cz-icu4c-75.1-dev/include  -c -o src/hnswbuild.o src/hnswbuild.c968vector-0.5.1> warning: Skipping impure flag -march=native because NIX_ENFORCE_NO_NATIVE is set969vector-0.5.1> gcc -Wall -Wmissing-prototypes -Wpointer-arith -Wdeclaration-after-statement -Werror=vla -Wendif-labels -Wmissing-format-attribute -Wimplicit-fallthrough=3 -Wcast-function-type -Wformat-security -fno-strict-aliasing -fwrapv -fexcess-precision=standard -Wno-deprecated-non-prototype -Wno-format-truncation -Wno-stringop-truncation -g -O2 -std=gnu17 -march=native -ftree-vectorize -fassociative-math -fno-signed-zeros -fno-trapping-math -fPIC -I. -I./ -I/nix/store/48l45fvi99n90x6p9i4cs1lmzby6cb73-postgresql-15.19/include/server -I/nix/store/48l45fvi99n90x6p9i4cs1lmzby6cb73-postgresql-15.19/include/internal -D_GNU_SOURCE  -I/nix/store/p17klc3qq4nl9ihfwqfpi8cnqvcf92xz-libxml2-2.15.1-dev/include/libxml2 -I/nix/store/mglbi4dy4kpx7v1dcgf6iincp5x38hsc-lz4-1.10.0-dev/include -I/nix/store/g41q9md9rdcr3lkydi6f8zd6fza3h1q4-zstd-1.5.7-dev/include -I/nix/store/n2vnr7ycfk6midbzxcwd28qj3bgb50cz-icu4c-75.1-dev/include  -c -o src/hnswinsert.o src/hnswinsert.c970vector-0.5.1> warning: Skipping impure flag -march=native because NIX_ENFORCE_NO_NATIVE is set971vector-0.5.1> gcc -Wall -Wmissing-prototypes -Wpointer-arith -Wdeclaration-after-statement -Werror=vla -Wendif-labels -Wmissing-format-attribute -Wimplicit-fallthrough=3 -Wcast-function-type -Wformat-security -fno-strict-aliasing -fwrapv -fexcess-precision=standard -Wno-deprecated-non-prototype -Wno-format-truncation -Wno-stringop-truncation -g -O2 -std=gnu17 -march=native -ftree-vectorize -fassociative-math -fno-signed-zeros -fno-trapping-math -fPIC -I. -I./ -I/nix/store/48l45fvi99n90x6p9i4cs1lmzby6cb73-postgresql-15.19/include/server -I/nix/store/48l45fvi99n90x6p9i4cs1lmzby6cb73-postgresql-15.19/include/internal -D_GNU_SOURCE  -I/nix/store/p17klc3qq4nl9ihfwqfpi8cnqvcf92xz-libxml2-2.15.1-dev/include/libxml2 -I/nix/store/mglbi4dy4kpx7v1dcgf6iincp5x38hsc-lz4-1.10.0-dev/include -I/nix/store/g41q9md9rdcr3lkydi6f8zd6fza3h1q4-zstd-1.5.7-dev/include -I/nix/store/n2vnr7ycfk6midbzxcwd28qj3bgb50cz-icu4c-75.1-dev/include  -c -o src/hnswscan.o src/hnswscan.c972vector-0.5.1> warning: Skipping impure flag -march=native because NIX_ENFORCE_NO_NATIVE is set973vector-0.5.1> gcc -Wall -Wmissing-prototypes -Wpointer-arith -Wdeclaration-after-statement -Werror=vla -Wendif-labels -Wmissing-format-attribute -Wimplicit-fallthrough=3 -Wcast-function-type -Wformat-security -fno-strict-aliasing -fwrapv -fexcess-precision=standard -Wno-deprecated-non-prototype -Wno-format-truncation -Wno-stringop-truncation -g -O2 -std=gnu17 -march=native -ftree-vectorize -fassociative-math -fno-signed-zeros -fno-trapping-math -fPIC -I. -I./ -I/nix/store/48l45fvi99n90x6p9i4cs1lmzby6cb73-postgresql-15.19/include/server -I/nix/store/48l45fvi99n90x6p9i4cs1lmzby6cb73-postgresql-15.19/include/internal -D_GNU_SOURCE  -I/nix/store/p17klc3qq4nl9ihfwqfpi8cnqvcf92xz-libxml2-2.15.1-dev/include/libxml2 -I/nix/store/mglbi4dy4kpx7v1dcgf6iincp5x38hsc-lz4-1.10.0-dev/include -I/nix/store/g41q9md9rdcr3lkydi6f8zd6fza3h1q4-zstd-1.5.7-dev/include -I/nix/store/n2vnr7ycfk6midbzxcwd28qj3bgb50cz-icu4c-75.1-dev/include  -c -o src/hnswutils.o src/hnswutils.c974vector-0.5.1> warning: Skipping impure flag -march=native because NIX_ENFORCE_NO_NATIVE is set975vector-0.5.1> gcc -Wall -Wmissing-prototypes -Wpointer-arith -Wdeclaration-after-statement -Werror=vla -Wendif-labels -Wmissing-format-attribute -Wimplicit-fallthrough=3 -Wcast-function-type -Wformat-security -fno-strict-aliasing -fwrapv -fexcess-precision=standard -Wno-deprecated-non-prototype -Wno-format-truncation -Wno-stringop-truncation -g -O2 -std=gnu17 -march=native -ftree-vectorize -fassociative-math -fno-signed-zeros -fno-trapping-math -fPIC -I. -I./ -I/nix/store/48l45fvi99n90x6p9i4cs1lmzby6cb73-postgresql-15.19/include/server -I/nix/store/48l45fvi99n90x6p9i4cs1lmzby6cb73-postgresql-15.19/include/internal -D_GNU_SOURCE  -I/nix/store/p17klc3qq4nl9ihfwqfpi8cnqvcf92xz-libxml2-2.15.1-dev/include/libxml2 -I/nix/store/mglbi4dy4kpx7v1dcgf6iincp5x38hsc-lz4-1.10.0-dev/include -I/nix/store/g41q9md9rdcr3lkydi6f8zd6fza3h1q4-zstd-1.5.7-dev/include -I/nix/store/n2vnr7ycfk6midbzxcwd28qj3bgb50cz-icu4c-75.1-dev/include  -c -o src/hnswvacuum.o src/hnswvacuum.c976vector-0.5.1> warning: Skipping impure flag -march=native because NIX_ENFORCE_NO_NATIVE is set977vector-0.5.1> gcc -Wall -Wmissing-prototypes -Wpointer-arith -Wdeclaration-after-statement -Werror=vla -Wendif-labels -Wmissing-format-attribute -Wimplicit-fallthrough=3 -Wcast-function-type -Wformat-security -fno-strict-aliasing -fwrapv -fexcess-precision=standard -Wno-deprecated-non-prototype -Wno-format-truncation -Wno-stringop-truncation -g -O2 -std=gnu17 -march=native -ftree-vectorize -fassociative-math -fno-signed-zeros -fno-trapping-math -fPIC -I. -I./ -I/nix/store/48l45fvi99n90x6p9i4cs1lmzby6cb73-postgresql-15.19/include/server -I/nix/store/48l45fvi99n90x6p9i4cs1lmzby6cb73-postgresql-15.19/include/internal -D_GNU_SOURCE  -I/nix/store/p17klc3qq4nl9ihfwqfpi8cnqvcf92xz-libxml2-2.15.1-dev/include/libxml2 -I/nix/store/mglbi4dy4kpx7v1dcgf6iincp5x38hsc-lz4-1.10.0-dev/include -I/nix/store/g41q9md9rdcr3lkydi6f8zd6fza3h1q4-zstd-1.5.7-dev/include -I/nix/store/n2vnr7ycfk6midbzxcwd28qj3bgb50cz-icu4c-75.1-dev/include  -c -o src/ivfbuild.o src/ivfbuild.c978vector-0.5.1> warning: Skipping impure flag -march=native because NIX_ENFORCE_NO_NATIVE is set979vector-0.5.1> gcc -Wall -Wmissing-prototypes -Wpointer-arith -Wdeclaration-after-statement -Werror=vla -Wendif-labels -Wmissing-format-attribute -Wimplicit-fallthrough=3 -Wcast-function-type -Wformat-security -fno-strict-aliasing -fwrapv -fexcess-precision=standard -Wno-deprecated-non-prototype -Wno-format-truncation -Wno-stringop-truncation -g -O2 -std=gnu17 -march=native -ftree-vectorize -fassociative-math -fno-signed-zeros -fno-trapping-math -fPIC -I. -I./ -I/nix/store/48l45fvi99n90x6p9i4cs1lmzby6cb73-postgresql-15.19/include/server -I/nix/store/48l45fvi99n90x6p9i4cs1lmzby6cb73-postgresql-15.19/include/internal -D_GNU_SOURCE  -I/nix/store/p17klc3qq4nl9ihfwqfpi8cnqvcf92xz-libxml2-2.15.1-dev/include/libxml2 -I/nix/store/mglbi4dy4kpx7v1dcgf6iincp5x38hsc-lz4-1.10.0-dev/include -I/nix/store/g41q9md9rdcr3lkydi6f8zd6fza3h1q4-zstd-1.5.7-dev/include -I/nix/store/n2vnr7ycfk6midbzxcwd28qj3bgb50cz-icu4c-75.1-dev/include  -c -o src/ivfflat.o src/ivfflat.c980vector-0.5.1> warning: Skipping impure flag -march=native because NIX_ENFORCE_NO_NATIVE is set981vector-0.5.1> gcc -Wall -Wmissing-prototypes -Wpointer-arith -Wdeclaration-after-statement -Werror=vla -Wendif-labels -Wmissing-format-attribute -Wimplicit-fallthrough=3 -Wcast-function-type -Wformat-security -fno-strict-aliasing -fwrapv -fexcess-precision=standard -Wno-deprecated-non-prototype -Wno-format-truncation -Wno-stringop-truncation -g -O2 -std=gnu17 -march=native -ftree-vectorize -fassociative-math -fno-signed-zeros -fno-trapping-math -fPIC -I. -I./ -I/nix/store/48l45fvi99n90x6p9i4cs1lmzby6cb73-postgresql-15.19/include/server -I/nix/store/48l45fvi99n90x6p9i4cs1lmzby6cb73-postgresql-15.19/include/internal -D_GNU_SOURCE  -I/nix/store/p17klc3qq4nl9ihfwqfpi8cnqvcf92xz-libxml2-2.15.1-dev/include/libxml2 -I/nix/store/mglbi4dy4kpx7v1dcgf6iincp5x38hsc-lz4-1.10.0-dev/include -I/nix/store/g41q9md9rdcr3lkydi6f8zd6fza3h1q4-zstd-1.5.7-dev/include -I/nix/store/n2vnr7ycfk6midbzxcwd28qj3bgb50cz-icu4c-75.1-dev/include  -c -o src/ivfinsert.o src/ivfinsert.c982vector-0.5.1> warning: Skipping impure flag -march=native because NIX_ENFORCE_NO_NATIVE is set983vector-0.5.1> gcc -Wall -Wmissing-prototypes -Wpointer-arith -Wdeclaration-after-statement -Werror=vla -Wendif-labels -Wmissing-format-attribute -Wimplicit-fallthrough=3 -Wcast-function-type -Wformat-security -fno-strict-aliasing -fwrapv -fexcess-precision=standard -Wno-deprecated-non-prototype -Wno-format-truncation -Wno-stringop-truncation -g -O2 -std=gnu17 -march=native -ftree-vectorize -fassociative-math -fno-signed-zeros -fno-trapping-math -fPIC -I. -I./ -I/nix/store/48l45fvi99n90x6p9i4cs1lmzby6cb73-postgresql-15.19/include/server -I/nix/store/48l45fvi99n90x6p9i4cs1lmzby6cb73-postgresql-15.19/include/internal -D_GNU_SOURCE  -I/nix/store/p17klc3qq4nl9ihfwqfpi8cnqvcf92xz-libxml2-2.15.1-dev/include/libxml2 -I/nix/store/mglbi4dy4kpx7v1dcgf6iincp5x38hsc-lz4-1.10.0-dev/include -I/nix/store/g41q9md9rdcr3lkydi6f8zd6fza3h1q4-zstd-1.5.7-dev/include -I/nix/store/n2vnr7ycfk6midbzxcwd28qj3bgb50cz-icu4c-75.1-dev/include  -c -o src/ivfkmeans.o src/ivfkmeans.c984vector-0.5.1> warning: Skipping impure flag -march=native because NIX_ENFORCE_NO_NATIVE is set985vector-0.5.1> gcc -Wall -Wmissing-prototypes -Wpointer-arith -Wdeclaration-after-statement -Werror=vla -Wendif-labels -Wmissing-format-attribute -Wimplicit-fallthrough=3 -Wcast-function-type -Wformat-security -fno-strict-aliasing -fwrapv -fexcess-precision=standard -Wno-deprecated-non-prototype -Wno-format-truncation -Wno-stringop-truncation -g -O2 -std=gnu17 -march=native -ftree-vectorize -fassociative-math -fno-signed-zeros -fno-trapping-math -fPIC -I. -I./ -I/nix/store/48l45fvi99n90x6p9i4cs1lmzby6cb73-postgresql-15.19/include/server -I/nix/store/48l45fvi99n90x6p9i4cs1lmzby6cb73-postgresql-15.19/include/internal -D_GNU_SOURCE  -I/nix/store/p17klc3qq4nl9ihfwqfpi8cnqvcf92xz-libxml2-2.15.1-dev/include/libxml2 -I/nix/store/mglbi4dy4kpx7v1dcgf6iincp5x38hsc-lz4-1.10.0-dev/include -I/nix/store/g41q9md9rdcr3lkydi6f8zd6fza3h1q4-zstd-1.5.7-dev/include -I/nix/store/n2vnr7ycfk6midbzxcwd28qj3bgb50cz-icu4c-75.1-dev/include  -c -o src/ivfscan.o src/ivfscan.c986vector-0.5.1> warning: Skipping impure flag -march=native because NIX_ENFORCE_NO_NATIVE is set987vector-0.5.1> gcc -Wall -Wmissing-prototypes -Wpointer-arith -Wdeclaration-after-statement -Werror=vla -Wendif-labels -Wmissing-format-attribute -Wimplicit-fallthrough=3 -Wcast-function-type -Wformat-security -fno-strict-aliasing -fwrapv -fexcess-precision=standard -Wno-deprecated-non-prototype -Wno-format-truncation -Wno-stringop-truncation -g -O2 -std=gnu17 -march=native -ftree-vectorize -fassociative-math -fno-signed-zeros -fno-trapping-math -fPIC -I. -I./ -I/nix/store/48l45fvi99n90x6p9i4cs1lmzby6cb73-postgresql-15.19/include/server -I/nix/store/48l45fvi99n90x6p9i4cs1lmzby6cb73-postgresql-15.19/include/internal -D_GNU_SOURCE  -I/nix/store/p17klc3qq4nl9ihfwqfpi8cnqvcf92xz-libxml2-2.15.1-dev/include/libxml2 -I/nix/store/mglbi4dy4kpx7v1dcgf6iincp5x38hsc-lz4-1.10.0-dev/include -I/nix/store/g41q9md9rdcr3lkydi6f8zd6fza3h1q4-zstd-1.5.7-dev/include -I/nix/store/n2vnr7ycfk6midbzxcwd28qj3bgb50cz-icu4c-75.1-dev/include  -c -o src/ivfutils.o src/ivfutils.c988vector-0.5.1> warning: Skipping impure flag -march=native because NIX_ENFORCE_NO_NATIVE is set989vector-0.5.1> gcc -Wall -Wmissing-prototypes -Wpointer-arith -Wdeclaration-after-statement -Werror=vla -Wendif-labels -Wmissing-format-attribute -Wimplicit-fallthrough=3 -Wcast-function-type -Wformat-security -fno-strict-aliasing -fwrapv -fexcess-precision=standard -Wno-deprecated-non-prototype -Wno-format-truncation -Wno-stringop-truncation -g -O2 -std=gnu17 -march=native -ftree-vectorize -fassociative-math -fno-signed-zeros -fno-trapping-math -fPIC -I. -I./ -I/nix/store/48l45fvi99n90x6p9i4cs1lmzby6cb73-postgresql-15.19/include/server -I/nix/store/48l45fvi99n90x6p9i4cs1lmzby6cb73-postgresql-15.19/include/internal -D_GNU_SOURCE  -I/nix/store/p17klc3qq4nl9ihfwqfpi8cnqvcf92xz-libxml2-2.15.1-dev/include/libxml2 -I/nix/store/mglbi4dy4kpx7v1dcgf6iincp5x38hsc-lz4-1.10.0-dev/include -I/nix/store/g41q9md9rdcr3lkydi6f8zd6fza3h1q4-zstd-1.5.7-dev/include -I/nix/store/n2vnr7ycfk6midbzxcwd28qj3bgb50cz-icu4c-75.1-dev/include  -c -o src/ivfvacuum.o src/ivfvacuum.c990vector-0.5.1> warning: Skipping impure flag -march=native because NIX_ENFORCE_NO_NATIVE is set991vector-0.5.1> gcc -Wall -Wmissing-prototypes -Wpointer-arith -Wdeclaration-after-statement -Werror=vla -Wendif-labels -Wmissing-format-attribute -Wimplicit-fallthrough=3 -Wcast-function-type -Wformat-security -fno-strict-aliasing -fwrapv -fexcess-precision=standard -Wno-deprecated-non-prototype -Wno-format-truncation -Wno-stringop-truncation -g -O2 -std=gnu17 -march=native -ftree-vectorize -fassociative-math -fno-signed-zeros -fno-trapping-math -fPIC -I. -I./ -I/nix/store/48l45fvi99n90x6p9i4cs1lmzby6cb73-postgresql-15.19/include/server -I/nix/store/48l45fvi99n90x6p9i4cs1lmzby6cb73-postgresql-15.19/include/internal -D_GNU_SOURCE  -I/nix/store/p17klc3qq4nl9ihfwqfpi8cnqvcf92xz-libxml2-2.15.1-dev/include/libxml2 -I/nix/store/mglbi4dy4kpx7v1dcgf6iincp5x38hsc-lz4-1.10.0-dev/include -I/nix/store/g41q9md9rdcr3lkydi6f8zd6fza3h1q4-zstd-1.5.7-dev/include -I/nix/store/n2vnr7ycfk6midbzxcwd28qj3bgb50cz-icu4c-75.1-dev/include  -c -o src/vector.o src/vector.c992vector-0.5.1> warning: Skipping impure flag -march=native because NIX_ENFORCE_NO_NATIVE is set993vector-0.5.1> gcc -Wall -Wmissing-prototypes -Wpointer-arith -Wdeclaration-after-statement -Werror=vla -Wendif-labels -Wmissing-format-attribute -Wimplicit-fallthrough=3 -Wcast-function-type -Wformat-security -fno-strict-aliasing -fwrapv -fexcess-precision=standard -Wno-deprecated-non-prototype -Wno-format-truncation -Wno-stringop-truncation -g -O2 -std=gnu17 -march=native -ftree-vectorize -fassociative-math -fno-signed-zeros -fno-trapping-math -fPIC -shared -o vector.so src/hnsw.o src/hnswbuild.o src/hnswinsert.o src/hnswscan.o src/hnswutils.o src/hnswvacuum.o src/ivfbuild.o src/ivfflat.o src/ivfinsert.o src/ivfkmeans.o src/ivfscan.o src/ivfutils.o src/ivfvacuum.o src/vector.o -L/nix/store/k4dpm55d68aq0df72hjk046xy1124lhn-postgresql-15.19-lib/lib    -L/nix/store/wfk1mrpj1r5f7iyihjnh0jjixr900z7y-libxml2-2.15.1/lib -L/nix/store/62b24z1igfh6ws654fhsgnm3fm7j1z3c-lz4-1.10.0-lib/lib -L/nix/store/fqy9nkaahib56gcy0r77qjk7n03cvnfs-zstd-1.5.7/lib -Wl,--as-needed -Wl,-rpath,'/nix/store/k4dpm55d68aq0df72hjk046xy1124lhn-postgresql-15.19-lib/lib',--enable-new-dtags  994vector-0.5.1> warning: Skipping impure flag -march=native because NIX_ENFORCE_NO_NATIVE is set995vector-0.5.1> cp sql/vector.sql sql/vector--0.5.1.sql996vector-0.5.1> Running phase: installPhase997vector-0.5.1> Running phase: fixupPhase998vector-0.5.1> shrinking RPATHs of ELF executables and libraries in /nix/store/gcn0hmjk3gy3qgjwbj9kwj6l99kfihzn-vector-0.5.1999vector-0.5.1> shrinking /nix/store/gcn0hmjk3gy3qgjwbj9kwj6l99kfihzn-vector-0.5.1/lib/vector-0.5.1.so1000vector-0.5.1> checking for references to /build/ in /nix/store/gcn0hmjk3gy3qgjwbj9kwj6l99kfihzn-vector-0.5.1...1001vector-0.5.1> patching script interpreter paths in /nix/store/gcn0hmjk3gy3qgjwbj9kwj6l99kfihzn-vector-0.5.11002vector-0.5.1> stripping (with command strip and flags -S -p) in  /nix/store/gcn0hmjk3gy3qgjwbj9kwj6l99kfihzn-vector-0.5.1/lib1003building '/nix/store/w47195gn53xxlfnja6kkgpgj0pbxj66m-pg_graphql-1.5.9.drv' on 'ssh-ng://nixbot-remote-build@78.232.36.247'1004building '/nix/store/w47195gn53xxlfnja6kkgpgj0pbxj66m-pg_graphql-1.5.9.drv'1005pg_graphql-1.5.9> Running phase: unpackPhase1006pg_graphql-1.5.9> unpacking source archive /nix/store/35k52w6qmay5vi6qhfy8cpfz0bwldvr5-source1007pg_graphql-1.5.9> source root is source1008pg_graphql-1.5.9> Executing cargoSetupPostUnpackHook1009pg_graphql-1.5.9> Finished cargoSetupPostUnpackHook1010pg_graphql-1.5.9> Running phase: patchPhase1011pg_graphql-1.5.9> Executing cargoSetupPostPatchHook1012pg_graphql-1.5.9> Validating consistency between /build/source/Cargo.lock and /build/cargo-vendor-dir/Cargo.lock1013pg_graphql-1.5.9> Finished cargoSetupPostPatchHook1014pg_graphql-1.5.9> Running phase: updateAutotoolsGnuConfigScriptsPhase1015pg_graphql-1.5.9> Running phase: configurePhase1016pg_graphql-1.5.9> Running phase: buildPhase1017pg_graphql-1.5.9> Executing cargo-pgrx buildPhase1018pg_graphql-1.5.9>    Validating /nix/store/wq2kfr0rkb0hdmf1iwi3mi8pxycakzmq-postgresql-17_22/bin/pg_config1019pg_graphql-1.5.9>  Initializing data directory at /build/tmp.wkX9LQdc9v/data-171020pg_graphql-1.5.9> waiting for server to start....2026-10-06 14:16:49.730 GMT [73] LOG:  starting PostgreSQL 17.11 on aarch64-unknown-linux-gnu, compiled by gcc (GCC) 15.2.0, 64-bit1021pg_graphql-1.5.9> 2026-10-06 14:16:49.733 GMT [73] LOG:  listening on Unix socket "/build/tmp.jlvnnp4mQD/.s.PGSQL.5432"1022pg_graphql-1.5.9> 2026-10-06 14:16:49.741 GMT [76] LOG:  database system was shut down at 2026-10-06 14:16:49 GMT1023pg_graphql-1.5.9> 2026-10-06 14:16:49.747 GMT [73] LOG:  database system is ready to accept connections1024pg_graphql-1.5.9>  done1025pg_graphql-1.5.9> server started1026pg_graphql-1.5.9> createuser: error: connection to server at "localhost" (127.0.0.1), port 5432 failed: Connection refused1027pg_graphql-1.5.9> 	Is the server running on that host and accepting TCP/IP connections?1028pg_graphql-1.5.9> waiting for server to shut down....2026-10-06 14:16:49.803 GMT [73] LOG:  received fast shutdown request1029pg_graphql-1.5.9> 2026-10-06 14:16:49.805 GMT [73] LOG:  aborting any active transactions1030pg_graphql-1.5.9> 2026-10-06 14:16:49.808 GMT [73] LOG:  background worker "logical replication launcher" (PID 79) exited with exit code 11031pg_graphql-1.5.9> 2026-10-06 14:16:49.809 GMT [74] LOG:  shutting down1032pg_graphql-1.5.9> 2026-10-06 14:16:49.811 GMT [74] LOG:  checkpoint starting: shutdown immediate1033pg_graphql-1.5.9> 2026-10-06 14:16:49.831 GMT [74] LOG:  checkpoint complete: wrote 3 buffers (0.0%); 0 WAL file(s) added, 0 removed, 0 recycled; write=0.008 s, sync=0.003 s, total=0.023 s; sync files=2, longest=0.002 s, average=0.002 s; distance=0 kB, estimate=0 kB; lsn=0/14EC910, redo lsn=0/14EC9101034pg_graphql-1.5.9> 2026-10-06 14:16:49.836 GMT [73] LOG:  database system is shut down1035pg_graphql-1.5.9>  done1036pg_graphql-1.5.9> server stopped1037pg_graphql-1.5.9>        Using PgConfig("pg17") and `pg_config` from /nix/store/wq2kfr0rkb0hdmf1iwi3mi8pxycakzmq-postgresql-17_22/bin/pg_config1038pg_graphql-1.5.9>     Building extension with features  pg171039pg_graphql-1.5.9>      Running command "/nix/store/hxlcfmjxs6akpyya3k1d4qk1ghbw11ij-rust-default-1.81.0/bin/cargo" "build" "--lib" "--release" "--features" " pg17" "--no-default-features" "--message-format=json-render-diagnostics" "--frozen" "-j" "2"1040pg_graphql-1.5.9>    Compiling proc-macro2 v1.0.791041pg_graphql-1.5.9>    Compiling unicode-ident v1.0.121042pg_graphql-1.5.9>    Compiling thiserror v1.0.581043pg_graphql-1.5.9>    Compiling libc v0.2.1531044pg_graphql-1.5.9>    Compiling memchr v2.7.21045pg_graphql-1.5.9>    Compiling quote v1.0.361046pg_graphql-1.5.9>    Compiling syn v2.0.581047pg_graphql-1.5.9>    Compiling serde v1.0.1971048pg_graphql-1.5.9>    Compiling eyre v0.6.121049pg_graphql-1.5.9>    Compiling equivalent v1.0.11050pg_graphql-1.5.9>    Compiling hashbrown v0.14.31051pg_graphql-1.5.9>    Compiling indexmap v2.2.61052pg_graphql-1.5.9>    Compiling serde_json v1.0.1151053pg_graphql-1.5.9>    Compiling glob v0.3.11054pg_graphql-1.5.9>    Compiling tinyvec_macros v0.1.11055pg_graphql-1.5.9>    Compiling tinyvec v1.6.01056pg_graphql-1.5.9>    Compiling clang-sys v1.7.01057pg_graphql-1.5.9>    Compiling cfg-if v1.0.01058pg_graphql-1.5.9>    Compiling is_ci v1.2.01059pg_graphql-1.5.9>    Compiling once_cell v1.19.01060pg_graphql-1.5.9>    Compiling anyhow v1.0.821061pg_graphql-1.5.9>    Compiling indenter v0.3.31062pg_graphql-1.5.9>    Compiling winnow v0.6.51063pg_graphql-1.5.9>    Compiling thiserror-impl v1.0.581064pg_graphql-1.5.9>    Compiling serde_derive v1.0.1971065pg_graphql-1.5.9>    Compiling unicode-normalization v0.1.231066pg_graphql-1.5.9>    Compiling is-terminal v0.4.131067pg_graphql-1.5.9>    Compiling percent-encoding v2.3.11068pg_graphql-1.5.9>    Compiling cc v1.0.921069pg_graphql-1.5.9>    Compiling regex-syntax v0.8.31070pg_graphql-1.5.9>    Compiling toml_datetime v0.6.51071pg_graphql-1.5.9>    Compiling serde_spanned v0.6.51072pg_graphql-1.5.9>    Compiling ucd-trie v0.1.61073pg_graphql-1.5.9>    Compiling toml_edit v0.22.91074pg_graphql-1.5.9>    Compiling minimal-lexical v0.2.11075pg_graphql-1.5.9>    Compiling owo-colors v4.1.01076pg_graphql-1.5.9>    Compiling unicode-bidi v0.3.151077pg_graphql-1.5.9>    Compiling idna v0.5.01078pg_graphql-1.5.9>    Compiling toml v0.8.121079pg_graphql-1.5.9>    Compiling nom v7.1.31080pg_graphql-1.5.9>    Compiling libloading v0.8.31081pg_graphql-1.5.9>    Compiling pest v2.7.91082pg_graphql-1.5.9>    Compiling regex-automata v0.4.61083pg_graphql-1.5.9>    Compiling form_urlencoded v1.2.11084pg_graphql-1.5.9>    Compiling supports-color v2.1.01085pg_graphql-1.5.9>    Compiling supports-color v3.0.11086pg_graphql-1.5.9>    Compiling yansi-term v0.1.21087pg_graphql-1.5.9>    Compiling syn v1.0.1091088pg_graphql-1.5.9>    Compiling either v1.10.01089pg_graphql-1.5.9>    Compiling unicode-width v0.1.141090pg_graphql-1.5.9>    Compiling bindgen v0.70.11091pg_graphql-1.5.9>    Compiling itoa v1.0.111092pg_graphql-1.5.9>    Compiling ryu v1.0.171093pg_graphql-1.5.9>    Compiling annotate-snippets v0.9.21094pg_graphql-1.5.9>    Compiling itertools v0.12.11095pg_graphql-1.5.9>    Compiling regex v1.10.41096pg_graphql-1.5.9>    Compiling pathsearch v0.2.01097pg_graphql-1.5.9>    Compiling url v2.5.01098pg_graphql-1.5.9>    Compiling semver-parser v0.10.21099pg_graphql-1.5.9>    Compiling cexpr v0.6.01100pg_graphql-1.5.9>    Compiling cargo_toml v0.19.21101pg_graphql-1.5.9>    Compiling rustc-hash v1.1.01102pg_graphql-1.5.9>    Compiling shlex v1.3.01103pg_graphql-1.5.9>    Compiling home v0.5.91104pg_graphql-1.5.9>    Compiling bitflags v2.5.01105pg_graphql-1.5.9>    Compiling same-file v1.0.61106pg_graphql-1.5.9>    Compiling walkdir v2.5.01107pg_graphql-1.5.9>    Compiling pgrx-pg-config v0.12.61108pg_graphql-1.5.9>    Compiling semver v0.11.01109pg_graphql-1.5.9>    Compiling getrandom v0.2.141110pg_graphql-1.5.9>    Compiling ident_case v1.0.11111pg_graphql-1.5.9>    Compiling fixedbitset v0.4.21112pg_graphql-1.5.9>    Compiling unicode-segmentation v1.11.01113pg_graphql-1.5.9>    Compiling fnv v1.0.71114pg_graphql-1.5.9>    Compiling byteorder v1.5.01115pg_graphql-1.5.9>    Compiling strsim v0.10.01116pg_graphql-1.5.9>    Compiling darling_core v0.14.41117pg_graphql-1.5.9>    Compiling convert_case v0.6.01118pg_graphql-1.5.9>    Compiling petgraph v0.6.41119pg_graphql-1.5.9>    Compiling rustc_version v0.3.31120pg_graphql-1.5.9>    Compiling pgrx-bindgen v0.12.61121pg_graphql-1.5.9>    Compiling cee-scape v0.2.01122pg_graphql-1.5.9>    Compiling radium v0.7.01123pg_graphql-1.5.9>    Compiling unescape v0.1.01124pg_graphql-1.5.9>    Compiling pgrx-sql-entity-graph v0.12.61125pg_graphql-1.5.9>    Compiling pgrx-pg-sys v0.12.61126pg_graphql-1.5.9>    Compiling atomic-traits v0.3.01127pg_graphql-1.5.9>    Compiling darling_macro v0.14.41128pg_graphql-1.5.9>    Compiling tap v1.0.11129pg_graphql-1.5.9>    Compiling heapless v0.8.01130pg_graphql-1.5.9>    Compiling void v1.0.21131pg_graphql-1.5.9>    Compiling unreachable v1.0.01132pg_graphql-1.5.9>    Compiling wyz v0.5.11133pg_graphql-1.5.9>    Compiling darling v0.14.41134pg_graphql-1.5.9>    Compiling pgrx-macros v0.12.61135pg_graphql-1.5.9>    Compiling hash32 v0.3.11136pg_graphql-1.5.9>    Compiling rand_core v0.6.41137pg_graphql-1.5.9>    Compiling enum-map-derive v0.17.01138pg_graphql-1.5.9>    Compiling ascii v0.9.31139pg_graphql-1.5.9>    Compiling ppv-lite86 v0.2.171140pg_graphql-1.5.9>    Compiling half v1.8.31141pg_graphql-1.5.9>    Compiling stable_deref_trait v1.2.01142pg_graphql-1.5.9>    Compiling sptr v0.3.21143pg_graphql-1.5.9>    Compiling funty v2.0.01144pg_graphql-1.5.9>    Compiling bitvec v1.0.11145pg_graphql-1.5.9>    Compiling serde_cbor v0.11.21146pg_graphql-1.5.9>    Compiling rand_chacha v0.3.11147pg_graphql-1.5.9>    Compiling combine v3.8.11148pg_graphql-1.5.9>    Compiling enum-map v2.7.31149pg_graphql-1.5.9>    Compiling cached_proc_macro v0.18.11150pg_graphql-1.5.9>    Compiling uuid v1.8.01151pg_graphql-1.5.9>    Compiling instant v0.1.121152pg_graphql-1.5.9>    Compiling cached_proc_macro_types v0.1.11153pg_graphql-1.5.9>    Compiling seahash v4.1.01154pg_graphql-1.5.9>    Compiling cached v0.46.11155pg_graphql-1.5.9>    Compiling graphql-parser v0.4.01156pg_graphql-1.5.9>    Compiling rand v0.8.51157pg_graphql-1.5.9>    Compiling itertools v0.10.51158pg_graphql-1.5.9>    Compiling bimap v0.6.31159pg_graphql-1.5.9>    Compiling lazy_static v1.4.01160pg_graphql-1.5.9>    Compiling base64 v0.13.11161pg_graphql-1.5.9>    Compiling pgrx v0.12.61162building '/nix/store/cl8ikglrq6jdd2cp01jad7n483mvqj8g-pg_net-0.11.0.drv' on 'ssh-ng://nixbot-remote-build@78.232.36.247'1163building '/nix/store/cl8ikglrq6jdd2cp01jad7n483mvqj8g-pg_net-0.11.0.drv'1164pg_net-0.11.0> Running phase: unpackPhase1165pg_net-0.11.0> unpacking source archive /nix/store/11fc13s6n3jp1hv44a6akllgjwhd1ds3-source1166pg_net-0.11.0> source root is source1167pg_net-0.11.0> Running phase: patchPhase1168pg_net-0.11.0> Running phase: updateAutotoolsGnuConfigScriptsPhase1169pg_net-0.11.0> Running phase: configurePhase1170pg_net-0.11.0> no configure script, doing nothing1171pg_net-0.11.0> Running phase: buildPhase1172pg_net-0.11.0> gcc -Wall -Wmissing-prototypes -Wpointer-arith -Wdeclaration-after-statement -Werror=vla -Wendif-labels -Wmissing-format-attribute -Wimplicit-fallthrough=3 -Wcast-function-type -Wshadow=compatible-local -Wformat-security -fno-strict-aliasing -fwrapv -fexcess-precision=standard -Wno-format-truncation -Wno-stringop-truncation -g -O2 -std=c11 -Werror -Wno-declaration-after-statement -fPIC -fvisibility=hidden  -DEXTVERSION=\"0.11.0\" -I. -I./ -I/nix/store/9q4p23a2y63xn8safzzn6lbn07bnkshs-postgresql-17.11/include/server -I/nix/store/9q4p23a2y63xn8safzzn6lbn07bnkshs-postgresql-17.11/include/internal -D_GNU_SOURCE  -I/nix/store/p17klc3qq4nl9ihfwqfpi8cnqvcf92xz-libxml2-2.15.1-dev/include/libxml2 -I/nix/store/mglbi4dy4kpx7v1dcgf6iincp5x38hsc-lz4-1.10.0-dev/include -I/nix/store/g41q9md9rdcr3lkydi6f8zd6fza3h1q4-zstd-1.5.7-dev/include -I/nix/store/n2vnr7ycfk6midbzxcwd28qj3bgb50cz-icu4c-75.1-dev/include  -c -o src/worker.o src/worker.c1173pg_net-0.11.0> gcc -Wall -Wmissing-prototypes -Wpointer-arith -Wdeclaration-after-statement -Werror=vla -Wendif-labels -Wmissing-format-attribute -Wimplicit-fallthrough=3 -Wcast-function-type -Wshadow=compatible-local -Wformat-security -fno-strict-aliasing -fwrapv -fexcess-precision=standard -Wno-format-truncation -Wno-stringop-truncation -g -O2 -std=c11 -Werror -Wno-declaration-after-statement -fPIC -fvisibility=hidden  -DEXTVERSION=\"0.11.0\" -I. -I./ -I/nix/store/9q4p23a2y63xn8safzzn6lbn07bnkshs-postgresql-17.11/include/server -I/nix/store/9q4p23a2y63xn8safzzn6lbn07bnkshs-postgresql-17.11/include/internal -D_GNU_SOURCE  -I/nix/store/p17klc3qq4nl9ihfwqfpi8cnqvcf92xz-libxml2-2.15.1-dev/include/libxml2 -I/nix/store/mglbi4dy4kpx7v1dcgf6iincp5x38hsc-lz4-1.10.0-dev/include -I/nix/store/g41q9md9rdcr3lkydi6f8zd6fza3h1q4-zstd-1.5.7-dev/include -I/nix/store/n2vnr7ycfk6midbzxcwd28qj3bgb50cz-icu4c-75.1-dev/include  -c -o src/util.o src/util.c1174pg_net-0.11.0> gcc -Wall -Wmissing-prototypes -Wpointer-arith -Wdeclaration-after-statement -Werror=vla -Wendif-labels -Wmissing-format-attribute -Wimplicit-fallthrough=3 -Wcast-function-type -Wshadow=compatible-local -Wformat-security -fno-strict-aliasing -fwrapv -fexcess-precision=standard -Wno-format-truncation -Wno-stringop-truncation -g -O2 -std=c11 -Werror -Wno-declaration-after-statement -fPIC -fvisibility=hidden  -DEXTVERSION=\"0.11.0\" -I. -I./ -I/nix/store/9q4p23a2y63xn8safzzn6lbn07bnkshs-postgresql-17.11/include/server -I/nix/store/9q4p23a2y63xn8safzzn6lbn07bnkshs-postgresql-17.11/include/internal -D_GNU_SOURCE  -I/nix/store/p17klc3qq4nl9ihfwqfpi8cnqvcf92xz-libxml2-2.15.1-dev/include/libxml2 -I/nix/store/mglbi4dy4kpx7v1dcgf6iincp5x38hsc-lz4-1.10.0-dev/include -I/nix/store/g41q9md9rdcr3lkydi6f8zd6fza3h1q4-zstd-1.5.7-dev/include -I/nix/store/n2vnr7ycfk6midbzxcwd28qj3bgb50cz-icu4c-75.1-dev/include  -c -o src/core.o src/core.c1175pg_net-0.11.0> In file included from src/core.c:23:1176pg_net-0.11.0> In function 'init_curl_handle',1177pg_net-0.11.0>     inlined from 'consume_request_queue' at src/core.c:341:5:1178pg_net-0.11.0> src/util.h:6:11: warning: call to 'Wcurl_easy_setopt_err_long' declared with attribute warning: curl_easy_setopt expects a long argument [-Wattribute-warning]1179pg_net-0.11.0>     6 |       if (curl_easy_setopt(hdl, opt, prm) != CURLE_OK) \1180pg_net-0.11.0>       |           ^~~~~~~~~~~~~~~~1181pg_net-0.11.0> src/core.c:162:7: note: in expansion of macro 'CURL_EZ_SETOPT'1182pg_net-0.11.0>   162 |       CURL_EZ_SETOPT(curl_ez_handle, CURLOPT_POST, 1);1183pg_net-0.11.0>       |       ^~~~~~~~~~~~~~1184pg_net-0.11.0> src/util.h:6:11: warning: call to 'Wcurl_easy_setopt_err_long' declared with attribute warning: curl_easy_setopt expects a long argument [-Wattribute-warning]1185pg_net-0.11.0>     6 |       if (curl_easy_setopt(hdl, opt, prm) != CURLE_OK) \1186pg_net-0.11.0>       |           ^~~~~~~~~~~~~~~~1187pg_net-0.11.0> src/core.c:163:7: note: in expansion of macro 'CURL_EZ_SETOPT'1188pg_net-0.11.0>   163 |       CURL_EZ_SETOPT(curl_ez_handle, CURLOPT_POSTFIELDSIZE, 0);1189pg_net-0.11.0>       |       ^~~~~~~~~~~~~~1190pg_net-0.11.0> src/util.h:6:11: warning: call to 'Wcurl_easy_setopt_err_long' declared with attribute warning: curl_easy_setopt expects a long argument [-Wattribute-warning]1191pg_net-0.11.0>     6 |       if (curl_easy_setopt(hdl, opt, prm) != CURLE_OK) \1192pg_net-0.11.0>       |           ^~~~~~~~~~~~~~~~1193pg_net-0.11.0> src/core.c:176:3: note: in expansion of macro 'CURL_EZ_SETOPT'1194pg_net-0.11.0>   176 |   CURL_EZ_SETOPT(curl_ez_handle, CURLOPT_TIMEOUT_MS, timeout_milliseconds);1195pg_net-0.11.0>       |   ^~~~~~~~~~~~~~1196pg_net-0.11.0> src/util.h:6:11: warning: call to 'Wcurl_easy_setopt_err_long' declared with attribute warning: curl_easy_setopt expects a long argument [-Wattribute-warning]1197pg_net-0.11.0>     6 |       if (curl_easy_setopt(hdl, opt, prm) != CURLE_OK) \1198pg_net-0.11.0>       |           ^~~~~~~~~~~~~~~~1199pg_net-0.11.0> src/core.c:178:3: note: in expansion of macro 'CURL_EZ_SETOPT'1200pg_net-0.11.0>   178 |   CURL_EZ_SETOPT(curl_ez_handle, CURLOPT_FOLLOWLOCATION, true);1201pg_net-0.11.0>       |   ^~~~~~~~~~~~~~1202pg_net-0.11.0> gcc -Wall -Wmissing-prototypes -Wpointer-arith -Wdeclaration-after-statement -Werror=vla -Wendif-labels -Wmissing-format-attribute -Wimplicit-fallthrough=3 -Wcast-function-type -Wshadow=compatible-local -Wformat-security -fno-strict-aliasing -fwrapv -fexcess-precision=standard -Wno-format-truncation -Wno-stringop-truncation -g -O2 -std=c11 -Werror -Wno-declaration-after-statement -fPIC -fvisibility=hidden -shared -o pg_net.so src/worker.o src/util.o src/core.o -L/nix/store/07zklik5dwl2sfqym1gwbrrkfby7lrjn-postgresql-17.11-lib/lib    -L/nix/store/wfk1mrpj1r5f7iyihjnh0jjixr900z7y-libxml2-2.15.1/lib -L/nix/store/62b24z1igfh6ws654fhsgnm3fm7j1z3c-lz4-1.10.0-lib/lib -L/nix/store/fqy9nkaahib56gcy0r77qjk7n03cvnfs-zstd-1.5.7/lib -Wl,--as-needed -Wl,-rpath,'/nix/store/07zklik5dwl2sfqym1gwbrrkfby7lrjn-postgresql-17.11-lib/lib',--enable-new-dtags -fvisibility=hidden -lcurl 1203pg_net-0.11.0> cp sql/pg_net.sql sql/pg_net--0.11.0.sql1204pg_net-0.11.0> sed "s/@PG_NET_VERSION@/0.11.0/g" pg_net.control.in > pg_net.control1205pg_net-0.11.0> Running phase: installPhase1206pg_net-0.11.0> Running phase: fixupPhase1207pg_net-0.11.0> shrinking RPATHs of ELF executables and libraries in /nix/store/n0bg6xvi3hfin1b8m30p229bs3fm15g5-pg_net-0.11.01208pg_net-0.11.0> shrinking /nix/store/n0bg6xvi3hfin1b8m30p229bs3fm15g5-pg_net-0.11.0/lib/pg_net-0.11.0.so1209pg_net-0.11.0> checking for references to /build/ in /nix/store/n0bg6xvi3hfin1b8m30p229bs3fm15g5-pg_net-0.11.0...1210pg_net-0.11.0> patching script interpreter paths in /nix/store/n0bg6xvi3hfin1b8m30p229bs3fm15g5-pg_net-0.11.01211pg_net-0.11.0> stripping (with command strip and flags -S -p) in  /nix/store/n0bg6xvi3hfin1b8m30p229bs3fm15g5-pg_net-0.11.0/lib1212pg_graphql-1.5.9>    Compiling pg_graphql v1.5.9 (/build/source)1213pg_graphql-1.5.9>     Finished `release` profile [optimized] target(s) in 4m 29s1214pg_graphql-1.5.9>   Installing extension1215pg_graphql-1.5.9>      Copying control file to /nix/store/nc2lckm4ank7mgp5bbfg3kwm6fg5xcb0-pg_graphql-1.5.9/nix/store/wq2kfr0rkb0hdmf1iwi3mi8pxycakzmq-postgresql-17_22/share/postgresql/extension/pg_graphql.control1216pg_graphql-1.5.9>      Copying shared library to /nix/store/nc2lckm4ank7mgp5bbfg3kwm6fg5xcb0-pg_graphql-1.5.9/nix/store/03bgys654wi361a6pkpx6nvzv3ygd5m8-postgresql-17_22-lib/lib/pg_graphql.so1217pg_graphql-1.5.9>   Discovered 5 SQL entities: 0 schemas (0 unique), 1 functions, 0 types, 0 enums, 4 sqls, 0 ords, 0 hashes, 0 aggregates, 0 triggers1218pg_graphql-1.5.9>   Rebuilding pgrx_embed, in debug mode, for SQL generation with features  pg171219pg_graphql-1.5.9>    Compiling proc-macro2 v1.0.791220pg_graphql-1.5.9>    Compiling unicode-ident v1.0.121221pg_graphql-1.5.9>    Compiling libc v0.2.1531222pg_graphql-1.5.9>    Compiling thiserror v1.0.581223pg_graphql-1.5.9>    Compiling quote v1.0.361224pg_graphql-1.5.9>    Compiling syn v2.0.581225pg_graphql-1.5.9>    Compiling equivalent v1.0.11226pg_graphql-1.5.9>    Compiling cfg-if v1.0.01227pg_graphql-1.5.9>    Compiling memchr v2.7.21228pg_graphql-1.5.9>    Compiling serde v1.0.1971229pg_graphql-1.5.9>    Compiling hashbrown v0.14.31230pg_graphql-1.5.9>    Compiling indexmap v2.2.61231pg_graphql-1.5.9>    Compiling eyre v0.6.121232pg_graphql-1.5.9>    Compiling once_cell v1.19.01233pg_graphql-1.5.9>    Compiling tinyvec_macros v0.1.11234pg_graphql-1.5.9>    Compiling glob v0.3.11235pg_graphql-1.5.9>    Compiling indenter v0.3.31236pg_graphql-1.5.9>    Compiling clang-sys v1.7.01237pg_graphql-1.5.9>    Compiling tinyvec v1.6.01238pg_graphql-1.5.9>    Compiling anyhow v1.0.821239pg_graphql-1.5.9>    Compiling serde_json v1.0.1151240pg_graphql-1.5.9>    Compiling winnow v0.6.51241pg_graphql-1.5.9>    Compiling thiserror-impl v1.0.581242pg_graphql-1.5.9>    Compiling serde_derive v1.0.1971243pg_graphql-1.5.9>    Compiling is_ci v1.2.01244pg_graphql-1.5.9>    Compiling unicode-normalization v0.1.231245pg_graphql-1.5.9>    Compiling is-terminal v0.4.131246pg_graphql-1.5.9>    Compiling itoa v1.0.111247pg_graphql-1.5.9>    Compiling percent-encoding v2.3.11248pg_graphql-1.5.9>    Compiling ryu v1.0.171249pg_graphql-1.5.9>    Compiling cc v1.0.921250pg_graphql-1.5.9>    Compiling ucd-trie v0.1.61251pg_graphql-1.5.9>    Compiling owo-colors v4.1.01252pg_graphql-1.5.9>    Compiling regex-syntax v0.8.31253pg_graphql-1.5.9>    Compiling unicode-bidi v0.3.151254pg_graphql-1.5.9>    Compiling minimal-lexical v0.2.11255pg_graphql-1.5.9>    Compiling nom v7.1.31256pg_graphql-1.5.9>    Compiling toml_datetime v0.6.51257pg_graphql-1.5.9>    Compiling serde_spanned v0.6.51258pg_graphql-1.5.9>    Compiling toml_edit v0.22.91259pg_graphql-1.5.9>    Compiling idna v0.5.01260pg_graphql-1.5.9>    Compiling regex-automata v0.4.61261pg_graphql-1.5.9>    Compiling toml v0.8.121262pg_graphql-1.5.9>    Compiling pest v2.7.91263pg_graphql-1.5.9>    Compiling form_urlencoded v1.2.11264pg_graphql-1.5.9>    Compiling supports-color v2.1.01265pg_graphql-1.5.9>    Compiling supports-color v3.0.11266pg_graphql-1.5.9>    Compiling libloading v0.8.31267pg_graphql-1.5.9>    Compiling fixedbitset v0.4.21268pg_graphql-1.5.9>    Compiling syn v1.0.1091269pg_graphql-1.5.9>    Compiling either v1.10.01270pg_graphql-1.5.9>    Compiling bindgen v0.70.11271pg_graphql-1.5.9>    Compiling yansi-term v0.1.21272pg_graphql-1.5.9>    Compiling unicode-width v0.1.141273pg_graphql-1.5.9>    Compiling itertools v0.12.11274pg_graphql-1.5.9>    Compiling annotate-snippets v0.9.21275pg_graphql-1.5.9>    Compiling semver-parser v0.10.21276pg_graphql-1.5.9>    Compiling pathsearch v0.2.01277pg_graphql-1.5.9>    Compiling url v2.5.01278pg_graphql-1.5.9>    Compiling cargo_toml v0.19.21279pg_graphql-1.5.9>    Compiling regex v1.10.41280pg_graphql-1.5.9>    Compiling cexpr v0.6.01281pg_graphql-1.5.9>    Compiling rustc-hash v1.1.01282pg_graphql-1.5.9>    Compiling home v0.5.91283pg_graphql-1.5.9>    Compiling same-file v1.0.61284pg_graphql-1.5.9>    Compiling bitflags v2.5.01285pg_graphql-1.5.9>    Compiling shlex v1.3.01286pg_graphql-1.5.9>    Compiling unicode-segmentation v1.11.01287pg_graphql-1.5.9>    Compiling convert_case v0.6.01288pg_graphql-1.5.9>    Compiling walkdir v2.5.01289pg_graphql-1.5.9>    Compiling pgrx-pg-config v0.12.61290pg_graphql-1.5.9>    Compiling semver v0.11.01291pg_graphql-1.5.9>    Compiling getrandom v0.2.141292pg_graphql-1.5.9>    Compiling unescape v0.1.01293pg_graphql-1.5.9>    Compiling fnv v1.0.71294pg_graphql-1.5.9>    Compiling strsim v0.10.01295pg_graphql-1.5.9>    Compiling ident_case v1.0.11296pg_graphql-1.5.9>    Compiling byteorder v1.5.01297pg_graphql-1.5.9>    Compiling darling_core v0.14.41298pg_graphql-1.5.9>    Compiling pgrx-bindgen v0.12.61299pg_graphql-1.5.9>    Compiling rustc_version v0.3.31300pg_graphql-1.5.9>    Compiling petgraph v0.6.41301pg_graphql-1.5.9>    Compiling cee-scape v0.2.01302pg_graphql-1.5.9>    Compiling radium v0.7.01303pg_graphql-1.5.9>    Compiling pgrx-sql-entity-graph v0.12.61304pg_graphql-1.5.9>    Compiling atomic-traits v0.3.01305pg_graphql-1.5.9>    Compiling pgrx-pg-sys v0.12.61306pg_graphql-1.5.9>    Compiling darling_macro v0.14.41307pg_graphql-1.5.9>    Compiling heapless v0.8.01308pg_graphql-1.5.9>    Compiling tap v1.0.11309pg_graphql-1.5.9>    Compiling void v1.0.21310pg_graphql-1.5.9>    Compiling unreachable v1.0.01311pg_graphql-1.5.9>    Compiling wyz v0.5.11312pg_graphql-1.5.9>    Compiling pgrx-macros v0.12.61313pg_graphql-1.5.9>    Compiling darling v0.14.41314pg_graphql-1.5.9>    Compiling hash32 v0.3.11315pg_graphql-1.5.9>    Compiling rand_core v0.6.41316pg_graphql-1.5.9>    Compiling enum-map-derive v0.17.01317building '/nix/store/0n0iaya9csx9by2pimrx1yglzw8dp4zs-pg_net-0.13.0.drv' on 'ssh-ng://nixbot-remote-build@78.232.36.247'1318building '/nix/store/0n0iaya9csx9by2pimrx1yglzw8dp4zs-pg_net-0.13.0.drv'1319pg_net-0.13.0> Running phase: unpackPhase1320pg_net-0.13.0> unpacking source archive /nix/store/bxdzbzjn4yi7ch55dlcgzk6npzx2p4jz-source1321pg_net-0.13.0> source root is source1322pg_net-0.13.0> Running phase: patchPhase1323pg_net-0.13.0> Running phase: updateAutotoolsGnuConfigScriptsPhase1324pg_net-0.13.0> Running phase: configurePhase1325pg_net-0.13.0> no configure script, doing nothing1326pg_net-0.13.0> Running phase: buildPhase1327pg_net-0.13.0> gcc -Wall -Wmissing-prototypes -Wpointer-arith -Wdeclaration-after-statement -Werror=vla -Wendif-labels -Wmissing-format-attribute -Wimplicit-fallthrough=3 -Wcast-function-type -Wformat-security -fno-strict-aliasing -fwrapv -fexcess-precision=standard -Wno-deprecated-non-prototype -Wno-format-truncation -Wno-stringop-truncation -g -O2 -std=gnu17 -std=c11 -Werror -Wno-declaration-after-statement -fPIC  -DEXTVERSION=\"0.13.0\" -I. -I./ -I/nix/store/48l45fvi99n90x6p9i4cs1lmzby6cb73-postgresql-15.19/include/server -I/nix/store/48l45fvi99n90x6p9i4cs1lmzby6cb73-postgresql-15.19/include/internal -D_GNU_SOURCE  -I/nix/store/p17klc3qq4nl9ihfwqfpi8cnqvcf92xz-libxml2-2.15.1-dev/include/libxml2 -I/nix/store/mglbi4dy4kpx7v1dcgf6iincp5x38hsc-lz4-1.10.0-dev/include -I/nix/store/g41q9md9rdcr3lkydi6f8zd6fza3h1q4-zstd-1.5.7-dev/include -I/nix/store/n2vnr7ycfk6midbzxcwd28qj3bgb50cz-icu4c-75.1-dev/include  -c -o src/worker.o src/worker.c1328pg_graphql-1.5.9>    Compiling half v1.8.31329pg_net-0.13.0> gcc -Wall -Wmissing-prototypes -Wpointer-arith -Wdeclaration-after-statement -Werror=vla -Wendif-labels -Wmissing-format-attribute -Wimplicit-fallthrough=3 -Wcast-function-type -Wformat-security -fno-strict-aliasing -fwrapv -fexcess-precision=standard -Wno-deprecated-non-prototype -Wno-format-truncation -Wno-stringop-truncation -g -O2 -std=gnu17 -std=c11 -Werror -Wno-declaration-after-statement -fPIC  -DEXTVERSION=\"0.13.0\" -I. -I./ -I/nix/store/48l45fvi99n90x6p9i4cs1lmzby6cb73-postgresql-15.19/include/server -I/nix/store/48l45fvi99n90x6p9i4cs1lmzby6cb73-postgresql-15.19/include/internal -D_GNU_SOURCE  -I/nix/store/p17klc3qq4nl9ihfwqfpi8cnqvcf92xz-libxml2-2.15.1-dev/include/libxml2 -I/nix/store/mglbi4dy4kpx7v1dcgf6iincp5x38hsc-lz4-1.10.0-dev/include -I/nix/store/g41q9md9rdcr3lkydi6f8zd6fza3h1q4-zstd-1.5.7-dev/include -I/nix/store/n2vnr7ycfk6midbzxcwd28qj3bgb50cz-icu4c-75.1-dev/include  -c -o src/util.o src/util.c1330pg_net-0.13.0> gcc -Wall -Wmissing-prototypes -Wpointer-arith -Wdeclaration-after-statement -Werror=vla -Wendif-labels -Wmissing-format-attribute -Wimplicit-fallthrough=3 -Wcast-function-type -Wformat-security -fno-strict-aliasing -fwrapv -fexcess-precision=standard -Wno-deprecated-non-prototype -Wno-format-truncation -Wno-stringop-truncation -g -O2 -std=gnu17 -std=c11 -Werror -Wno-declaration-after-statement -fPIC  -DEXTVERSION=\"0.13.0\" -I. -I./ -I/nix/store/48l45fvi99n90x6p9i4cs1lmzby6cb73-postgresql-15.19/include/server -I/nix/store/48l45fvi99n90x6p9i4cs1lmzby6cb73-postgresql-15.19/include/internal -D_GNU_SOURCE  -I/nix/store/p17klc3qq4nl9ihfwqfpi8cnqvcf92xz-libxml2-2.15.1-dev/include/libxml2 -I/nix/store/mglbi4dy4kpx7v1dcgf6iincp5x38hsc-lz4-1.10.0-dev/include -I/nix/store/g41q9md9rdcr3lkydi6f8zd6fza3h1q4-zstd-1.5.7-dev/include -I/nix/store/n2vnr7ycfk6midbzxcwd28qj3bgb50cz-icu4c-75.1-dev/include  -c -o src/core.o src/core.c1331pg_graphql-1.5.9>    Compiling sptr v0.3.21332pg_graphql-1.5.9>    Compiling ascii v0.9.31333pg_net-0.13.0> In file included from src/core.c:23:1334pg_net-0.13.0> In function 'init_curl_handle',1335pg_net-0.13.0>     inlined from 'consume_request_queue' at src/core.c:273:5:1336pg_net-0.13.0> src/util.h:6:11: warning: call to 'Wcurl_easy_setopt_err_long' declared with attribute warning: curl_easy_setopt expects a long argument [-Wattribute-warning]1337pg_net-0.13.0>     6 |       if (curl_easy_setopt(hdl, opt, prm) != CURLE_OK) \1338pg_net-0.13.0>       |           ^~~~~~~~~~~~~~~~1339pg_net-0.13.0> src/core.c:94:7: note: in expansion of macro 'CURL_EZ_SETOPT'1340pg_net-0.13.0>    94 |       CURL_EZ_SETOPT(curl_ez_handle, CURLOPT_POST, 1);1341pg_net-0.13.0>       |       ^~~~~~~~~~~~~~1342pg_net-0.13.0> src/util.h:6:11: warning: call to 'Wcurl_easy_setopt_err_long' declared with attribute warning: curl_easy_setopt expects a long argument [-Wattribute-warning]1343pg_net-0.13.0>     6 |       if (curl_easy_setopt(hdl, opt, prm) != CURLE_OK) \1344pg_net-0.13.0>       |           ^~~~~~~~~~~~~~~~1345pg_net-0.13.0> src/core.c:95:7: note: in expansion of macro 'CURL_EZ_SETOPT'1346pg_net-0.13.0>    95 |       CURL_EZ_SETOPT(curl_ez_handle, CURLOPT_POSTFIELDSIZE, 0);1347pg_net-0.13.0>       |       ^~~~~~~~~~~~~~1348pg_net-0.13.0> src/util.h:6:11: warning: call to 'Wcurl_easy_setopt_err_long' declared with attribute warning: curl_easy_setopt expects a long argument [-Wattribute-warning]1349pg_net-0.13.0>     6 |       if (curl_easy_setopt(hdl, opt, prm) != CURLE_OK) \1350pg_net-0.13.0>       |           ^~~~~~~~~~~~~~~~1351pg_net-0.13.0> src/core.c:108:3: note: in expansion of macro 'CURL_EZ_SETOPT'1352pg_net-0.13.0>   108 |   CURL_EZ_SETOPT(curl_ez_handle, CURLOPT_TIMEOUT_MS, timeout_milliseconds);1353pg_net-0.13.0>       |   ^~~~~~~~~~~~~~1354pg_net-0.13.0> src/util.h:6:11: warning: call to 'Wcurl_easy_setopt_err_long' declared with attribute warning: curl_easy_setopt expects a long argument [-Wattribute-warning]1355pg_net-0.13.0>     6 |       if (curl_easy_setopt(hdl, opt, prm) != CURLE_OK) \1356pg_net-0.13.0>       |           ^~~~~~~~~~~~~~~~1357pg_net-0.13.0> src/core.c:110:3: note: in expansion of macro 'CURL_EZ_SETOPT'1358pg_net-0.13.0>   110 |   CURL_EZ_SETOPT(curl_ez_handle, CURLOPT_FOLLOWLOCATION, true);1359pg_net-0.13.0>       |   ^~~~~~~~~~~~~~1360pg_net-0.13.0> gcc -Wall -Wmissing-prototypes -Wpointer-arith -Wdeclaration-after-statement -Werror=vla -Wendif-labels -Wmissing-format-attribute -Wimplicit-fallthrough=3 -Wcast-function-type -Wformat-security -fno-strict-aliasing -fwrapv -fexcess-precision=standard -Wno-deprecated-non-prototype -Wno-format-truncation -Wno-stringop-truncation -g -O2 -std=gnu17 -std=c11 -Werror -Wno-declaration-after-statement -fPIC  -DEXTVERSION=\"0.13.0\" -I. -I./ -I/nix/store/48l45fvi99n90x6p9i4cs1lmzby6cb73-postgresql-15.19/include/server -I/nix/store/48l45fvi99n90x6p9i4cs1lmzby6cb73-postgresql-15.19/include/internal -D_GNU_SOURCE  -I/nix/store/p17klc3qq4nl9ihfwqfpi8cnqvcf92xz-libxml2-2.15.1-dev/include/libxml2 -I/nix/store/mglbi4dy4kpx7v1dcgf6iincp5x38hsc-lz4-1.10.0-dev/include -I/nix/store/g41q9md9rdcr3lkydi6f8zd6fza3h1q4-zstd-1.5.7-dev/include -I/nix/store/n2vnr7ycfk6midbzxcwd28qj3bgb50cz-icu4c-75.1-dev/include  -c -o src/event.o src/event.c1361pg_net-0.13.0> In file included from /nix/store/jviasb44hibgh09829gbmbssbz2jjnhz-curl-8.17.0-dev/include/curl/curl.h:3333,1362pg_net-0.13.0>                  from /nix/store/jviasb44hibgh09829gbmbssbz2jjnhz-curl-8.17.0-dev/include/curl/multi.h:51,1363pg_net-0.13.0>                  from src/event.h:4,1364pg_net-0.13.0>                  from src/event.c:6:1365pg_net-0.13.0> /nix/store/jviasb44hibgh09829gbmbssbz2jjnhz-curl-8.17.0-dev/include/curl/multi.h:429:23: error: expected identifier or '(' before '__extension__'1366pg_net-0.13.0>   429 | CURL_EXTERN CURLMcode curl_multi_setopt(CURLM *multi_handle,1367pg_net-0.13.0>       |                       ^~~~~~~~~~~~~~~~~1368pg_net-0.13.0> /nix/store/jviasb44hibgh09829gbmbssbz2jjnhz-curl-8.17.0-dev/include/curl/multi.h:429:23: error: expected identifier or '(' before ')' token1369pg_net-0.13.0>   429 | CURL_EXTERN CURLMcode curl_multi_setopt(CURLM *multi_handle,1370pg_net-0.13.0>       |                       ^~~~~~~~~~~~~~~~~1371pg_net-0.13.0> make: *** [<builtin>: src/event.o] Error 11372error: build of '/nix/store/0n0iaya9csx9by2pimrx1yglzw8dp4zs-pg_net-0.13.0.drv' on 'ssh-ng://nixbot-remote-build@78.232.36.247' failed: Cannot build '/nix/store/0n0iaya9csx9by2pimrx1yglzw8dp4zs-pg_net-0.13.0.drv'.1373       Reason: builder failed with exit code 2.1374       Output paths:1375         /nix/store/14dkr1mhbrh869r2k75r03ngw6q7c4ma-pg_net-0.13.01376       Last 25 log lines:1377       >       |       ^~~~~~~~~~~~~~1378       > src/util.h:6:11: warning: call to 'Wcurl_easy_setopt_err_long' declared with attribute warning: curl_easy_setopt expects a long argument [-Wattribute-warning]1379       >     6 |       if (curl_easy_setopt(hdl, opt, prm) != CURLE_OK) \1380       >       |           ^~~~~~~~~~~~~~~~1381       > src/core.c:108:3: note: in expansion of macro 'CURL_EZ_SETOPT'1382       >   108 |   CURL_EZ_SETOPT(curl_ez_handle, CURLOPT_TIMEOUT_MS, timeout_milliseconds);1383       >       |   ^~~~~~~~~~~~~~1384       > src/util.h:6:11: warning: call to 'Wcurl_easy_setopt_err_long' declared with attribute warning: curl_easy_setopt expects a long argument [-Wattribute-warning]1385       >     6 |       if (curl_easy_setopt(hdl, opt, prm) != CURLE_OK) \1386       >       |           ^~~~~~~~~~~~~~~~1387       > src/core.c:110:3: note: in expansion of macro 'CURL_EZ_SETOPT'1388       >   110 |   CURL_EZ_SETOPT(curl_ez_handle, CURLOPT_FOLLOWLOCATION, true);1389       >       |   ^~~~~~~~~~~~~~1390       > gcc -Wall -Wmissing-prototypes -Wpointer-arith -Wdeclaration-after-statement -Werror=vla -Wendif-labels -Wmissing-format-attribute -Wimplicit-fallthrough=3 -Wcast-function-type -Wformat-security -fno-strict-aliasing -fwrapv -fexcess-precision=standard -Wno-deprecated-non-prototype -Wno-format-truncation -Wno-stringop-truncation -g -O2 -std=gnu17 -std=c11 -Werror -Wno-declaration-after-statement -fPIC  -DEXTVERSION=\"0.13.0\" -I. -I./ -I/nix/store/48l45fvi99n90x6p9i4cs1lmzby6cb73-postgresql-15.19/include/server -I/nix/store/48l45fvi99n90x6p9i4cs1lmzby6cb73-postgresql-15.19/include/internal -D_GNU_SOURCE  -I/nix/store/p17klc3qq4nl9ihfwqfpi8cnqvcf92xz-libxml2-2.15.1-dev/include/libxml2 -I/nix/store/mglbi4dy4kpx7v1dcgf6iincp5x38hsc-lz4-1.10.0-dev/include -I/nix/store/g41q9md9rdcr3lkydi6f8zd6fza3h1q4-zstd-1.5.7-dev/include -I/nix/store/n2vnr7ycfk6midbzxcwd28qj3bgb50cz-icu4c-75.1-dev/include  -c -o src/event.o src/event.c1391       > In file included from /nix/store/jviasb44hibgh09829gbmbssbz2jjnhz-curl-8.17.0-dev/include/curl/curl.h:3333,1392       >                  from /nix/store/jviasb44hibgh09829gbmbssbz2jjnhz-curl-8.17.0-dev/include/curl/multi.h:51,1393       >                  from src/event.h:4,1394       >                  from src/event.c:6:1395       > /nix/store/jviasb44hibgh09829gbmbssbz2jjnhz-curl-8.17.0-dev/include/curl/multi.h:429:23: error: expected identifier or '(' before '__extension__'1396       >   429 | CURL_EXTERN CURLMcode curl_multi_setopt(CURLM *multi_handle,1397       >       |                       ^~~~~~~~~~~~~~~~~1398       > /nix/store/jviasb44hibgh09829gbmbssbz2jjnhz-curl-8.17.0-dev/include/curl/multi.h:429:23: error: expected identifier or '(' before ')' token1399       >   429 | CURL_EXTERN CURLMcode curl_multi_setopt(CURLM *multi_handle,1400       >       |                       ^~~~~~~~~~~~~~~~~1401       > make: *** [<builtin>: src/event.o] Error 11402       For full logs, run:1403         nix log /nix/store/0n0iaya9csx9by2pimrx1yglzw8dp4zs-pg_net-0.13.0.drv1404error: Cannot build '/nix/store/0n0iaya9csx9by2pimrx1yglzw8dp4zs-pg_net-0.13.0.drv'.1405       Reason: builder failed with exit code 1.1406       Output paths:1407         /nix/store/14dkr1mhbrh869r2k75r03ngw6q7c4ma-pg_net-0.13.01408pg_graphql-1.5.9>    Compiling ppv-lite86 v0.2.171409pg_graphql-1.5.9>    Compiling funty v2.0.01410pg_graphql-1.5.9>    Compiling stable_deref_trait v1.2.01411pg_graphql-1.5.9>    Compiling bitvec v1.0.11412pg_graphql-1.5.9>    Compiling rand_chacha v0.3.11413pg_graphql-1.5.9>    Compiling combine v3.8.11414pg_graphql-1.5.9>    Compiling serde_cbor v0.11.21415pg_graphql-1.5.9>    Compiling enum-map v2.7.31416pg_graphql-1.5.9>    Compiling cached_proc_macro v0.18.11417pg_graphql-1.5.9>    Compiling uuid v1.8.01418pg_graphql-1.5.9>    Compiling instant v0.1.121419pg_graphql-1.5.9>    Compiling cached_proc_macro_types v0.1.11420pg_graphql-1.5.9>    Compiling seahash v4.1.01421pg_graphql-1.5.9>    Compiling cached v0.46.11422pg_graphql-1.5.9>    Compiling graphql-parser v0.4.01423pg_graphql-1.5.9>    Compiling rand v0.8.51424pg_graphql-1.5.9>    Compiling itertools v0.10.51425pg_graphql-1.5.9>    Compiling bimap v0.6.31426pg_graphql-1.5.9>    Compiling base64 v0.13.11427pg_graphql-1.5.9>    Compiling lazy_static v1.4.01428pg_graphql-1.5.9>    Compiling pgrx v0.12.61429pg_graphql-1.5.9>    Compiling pg_graphql v1.5.9 (/build/source)1430pg_graphql-1.5.9>     Finished `dev` profile [unoptimized + debuginfo] target(s) in 3m 16s1431pg_graphql-1.5.9>      Writing SQL entities to /nix/store/nc2lckm4ank7mgp5bbfg3kwm6fg5xcb0-pg_graphql-1.5.9/nix/store/wq2kfr0rkb0hdmf1iwi3mi8pxycakzmq-postgresql-17_22/share/postgresql/extension/pg_graphql--1.5.9.sql1432pg_graphql-1.5.9>     Finished installing pg_graphql1433pg_graphql-1.5.9> buildPhase completed in 7 minutes 48 seconds1434pg_graphql-1.5.9> Running phase: checkPhase1435pg_graphql-1.5.9>    Validating /nix/store/wq2kfr0rkb0hdmf1iwi3mi8pxycakzmq-postgresql-17_22/bin/pg_config1436pg_graphql-1.5.9>  Initializing data directory at /build/tmp.92HTbbi77c/data-171437pg_graphql-1.5.9> waiting for server to start....2026-10-06 14:24:37.660 GMT [4088] LOG:  starting PostgreSQL 17.11 on aarch64-unknown-linux-gnu, compiled by gcc (GCC) 15.2.0, 64-bit1438pg_graphql-1.5.9> 2026-10-06 14:24:37.662 GMT [4088] LOG:  listening on Unix socket "/build/tmp.0zwbwhLFI6/.s.PGSQL.5432"1439pg_graphql-1.5.9> 2026-10-06 14:24:37.669 GMT [4091] LOG:  database system was shut down at 2026-10-06 14:24:37 GMT1440pg_graphql-1.5.9> 2026-10-06 14:24:37.675 GMT [4088] LOG:  database system is ready to accept connections1441pg_graphql-1.5.9>  done1442pg_graphql-1.5.9> server started1443pg_graphql-1.5.9> createuser: error: connection to server at "localhost" (127.0.0.1), port 5432 failed: Connection refused1444pg_graphql-1.5.9> 	Is the server running on that host and accepting TCP/IP connections?1445pg_graphql-1.5.9> waiting for server to shut down....2026-10-06 14:24:37.738 GMT [4088] LOG:  received fast shutdown request1446pg_graphql-1.5.9> 2026-10-06 14:24:37.744 GMT [4088] LOG:  aborting any active transactions1447pg_graphql-1.5.9> 2026-10-06 14:24:37.746 GMT [4088] LOG:  background worker "logical replication launcher" (PID 4094) exited with exit code 11448pg_graphql-1.5.9> 2026-10-06 14:24:37.746 GMT [4089] LOG:  shutting down1449pg_graphql-1.5.9> 2026-10-06 14:24:37.751 GMT [4089] LOG:  checkpoint starting: shutdown immediate1450pg_graphql-1.5.9> 2026-10-06 14:24:37.773 GMT [4089] LOG:  checkpoint complete: wrote 3 buffers (0.0%); 0 WAL file(s) added, 0 removed, 0 recycled; write=0.007 s, sync=0.003 s, total=0.028 s; sync files=2, longest=0.002 s, average=0.002 s; distance=0 kB, estimate=0 kB; lsn=0/14EC910, redo lsn=0/14EC9101451pg_graphql-1.5.9> 2026-10-06 14:24:37.777 GMT [4088] LOG:  database system is shut down1452pg_graphql-1.5.9>  done1453pg_graphql-1.5.9> server stopped1454pg_graphql-1.5.9>    Validating /build/tmp.1dyCBVWWId/17/bin/pg_config1455pg_graphql-1.5.9>  Initializing data directory at /build/tmp.1dyCBVWWId/data-171456pg_graphql-1.5.9>        Using PgConfig("pg17") and `pg_config` from /build/tmp.1dyCBVWWId/17/bin/pg_config1457pg_graphql-1.5.9>     Building extension with features pg171458pg_graphql-1.5.9>      Running command "/nix/store/hxlcfmjxs6akpyya3k1d4qk1ghbw11ij-rust-default-1.81.0/bin/cargo" "build" "--lib" "--release" "--features" "pg17" "--no-default-features" "--message-format=json-render-diagnostics" "--frozen" "-j" "2"1459pg_graphql-1.5.9>     Finished `release` profile [optimized] target(s) in 0.13s1460pg_graphql-1.5.9>   Installing extension1461pg_graphql-1.5.9>      Copying control file to /build/tmp.1dyCBVWWId/17/share/postgresql/extension/pg_graphql.control1462pg_graphql-1.5.9>      Copying shared library to /build/tmp.1dyCBVWWId/17/lib/pg_graphql.so1463pg_graphql-1.5.9>   Discovered 5 SQL entities: 0 schemas (0 unique), 1 functions, 0 types, 0 enums, 4 sqls, 0 ords, 0 hashes, 0 aggregates, 0 triggers1464pg_graphql-1.5.9>   Rebuilding pgrx_embed, in debug mode, for SQL generation with features pg171465pg_graphql-1.5.9>    Compiling pg_graphql v1.5.9 (/build/source)1466pg_graphql-1.5.9>     Finished `dev` profile [unoptimized + debuginfo] target(s) in 22.42s1467pg_graphql-1.5.9>      Writing SQL entities to /build/tmp.1dyCBVWWId/17/share/postgresql/extension/pg_graphql--1.5.9.sql1468pg_graphql-1.5.9>     Finished installing pg_graphql1469pg_graphql-1.5.9> ++ mktemp -d1470pg_graphql-1.5.9> + TMPDIR=/build/tmp.y4FEH8mcI01471pg_graphql-1.5.9> + export PGDATA=/build/tmp.y4FEH8mcI01472pg_graphql-1.5.9> + PGDATA=/build/tmp.y4FEH8mcI01473pg_graphql-1.5.9> + export PGHOST=/build/tmp.y4FEH8mcI01474pg_graphql-1.5.9> + PGHOST=/build/tmp.y4FEH8mcI01475pg_graphql-1.5.9> + export PGUSER=postgres1476pg_graphql-1.5.9> + PGUSER=postgres1477pg_graphql-1.5.9> + export PGDATABASE=postgres1478pg_graphql-1.5.9> + PGDATABASE=postgres1479pg_graphql-1.5.9> + export PGTZ=UTC1480pg_graphql-1.5.9> + PGTZ=UTC1481pg_graphql-1.5.9> + export PG_COLOR=auto1482pg_graphql-1.5.9> + PG_COLOR=auto1483pg_graphql-1.5.9> + trap 'pg_ctl stop -m i' sigint sigterm exit1484pg_graphql-1.5.9> + rm -rf /build/tmp.y4FEH8mcI01485pg_graphql-1.5.9> + initdb --no-locale --encoding=UTF8 --nosync -U postgres1486pg_graphql-1.5.9> The files belonging to this database system will be owned by user "nixbld".1487pg_graphql-1.5.9> This user must also own the server process.1488pg_graphql-1.5.9> 1489pg_graphql-1.5.9> The database cluster will be initialized with locale "C".1490pg_graphql-1.5.9> The default text search configuration will be set to "english".1491pg_graphql-1.5.9> 1492pg_graphql-1.5.9> Data page checksums are disabled.1493pg_graphql-1.5.9> 1494pg_graphql-1.5.9> creating directory /build/tmp.y4FEH8mcI0 ... ok1495pg_graphql-1.5.9> creating subdirectories ... ok1496pg_graphql-1.5.9> selecting dynamic shared memory implementation ... posix1497pg_graphql-1.5.9> selecting default "max_connections" ... 1001498pg_graphql-1.5.9> selecting default "shared_buffers" ... 128MB1499pg_graphql-1.5.9> selecting default time zone ... UTC1500pg_graphql-1.5.9> creating configuration files ... ok1501pg_graphql-1.5.9> running bootstrap script ... ok1502pg_graphql-1.5.9> performing post-bootstrap initialization ... ok1503pg_graphql-1.5.9> 1504pg_graphql-1.5.9> Sync to disk skipped.1505pg_graphql-1.5.9> The data directory might become corrupt if the operating system crashes.1506pg_graphql-1.5.9> 1507pg_graphql-1.5.9> initdb: warning: enabling "trust" authentication for local connections1508pg_graphql-1.5.9> initdb: hint: You can change this by editing pg_hba.conf or using the option -A, or --auth-local and --auth-host, the next time you run initdb.1509pg_graphql-1.5.9> 1510pg_graphql-1.5.9> Success. You can now start the database server using:1511pg_graphql-1.5.9> 1512pg_graphql-1.5.9>     /build/tmp.1dyCBVWWId/17/bin/pg_ctl -D /build/tmp.y4FEH8mcI0 -l logfile start1513pg_graphql-1.5.9> 1514pg_graphql-1.5.9> + pg_ctl start -o '-F -c listen_addresses="" -c log_min_messages=WARNING -k /build/tmp.y4FEH8mcI0'1515pg_graphql-1.5.9> waiting for server to start....2026-10-06 14:25:02.941 UTC [4360] LOG:  starting PostgreSQL 17.11 on aarch64-unknown-linux-gnu, compiled by gcc (GCC) 15.2.0, 64-bit1516pg_graphql-1.5.9> 2026-10-06 14:25:02.941 UTC [4360] LOG:  listening on Unix socket "/build/tmp.y4FEH8mcI0/.s.PGSQL.5432"1517pg_graphql-1.5.9> 2026-10-06 14:25:02.943 UTC [4363] LOG:  database system was shut down at 2026-10-06 14:25:02 UTC1518pg_graphql-1.5.9> 2026-10-06 14:25:02.947 UTC [4360] LOG:  database system is ready to accept connections1519pg_graphql-1.5.9>  done1520pg_graphql-1.5.9> server started1521pg_graphql-1.5.9> + createdb contrib_regression1522pg_graphql-1.5.9> + TESTDIR=test1523pg_graphql-1.5.9> +++ pg_config --pgxs1524pg_graphql-1.5.9> ++ dirname /nix/store/wq2kfr0rkb0hdmf1iwi3mi8pxycakzmq-postgresql-17_22/lib/pgxs/src/makefiles/pgxs.mk1525pg_graphql-1.5.9> + PGXS=/nix/store/wq2kfr0rkb0hdmf1iwi3mi8pxycakzmq-postgresql-17_22/lib/pgxs/src/makefiles1526pg_graphql-1.5.9> + REGRESS=/nix/store/wq2kfr0rkb0hdmf1iwi3mi8pxycakzmq-postgresql-17_22/lib/pgxs/src/makefiles/../test/regress/pg_regress1527pg_graphql-1.5.9> + '[' 0 -ne 0 ']'1528pg_graphql-1.5.9> ++ ls test/sql1529pg_graphql-1.5.9> ++ sed -e 's/\..*$//'1530pg_graphql-1.5.9> ++ sort1531pg_graphql-1.5.9> + TESTS=$'aliases\nallow_camel_names\narray_args_and_return_types\nbigint_is_string\nbuiltin_directives\ncomment_directive\ncomment_directive_description\ncompound_filters\nempty_mutations\nenum_mappings\nextend_type_with_function\nextend_type_with_function_relation\nextend_type_with_generated_column\nfilter_by_node_id\nfragment_on_mutation\nfragment_on_query\nfunction_calls\nfunction_calls_default_args\nfunction_calls_unsupported\nfunction_return_row_is_selectable\nfunction_return_view_has_pkey\ninflection_fields\ninflection_function\ninflection_relationships\ninflection_types\nissue_163\nissue_170\nissue_225\nissue_237_field_merging\nissue_237_field_merging_mismatched\nissue_300\nissue_306\nissue_312\nissue_334_ambiguous_function\nissue_337\nissue_339_function_return_json\nissue_339_function_return_table\nissue_353_too_many_fields\nissue_370_citext_as_string\nissue_373\nissue_377_enum_search_path\nissue_409_fkey_rls_nullability\nissue_444\nissue_463\nissue_511\nissue_533\nissue_542_partial_unique\nissue_551_too_many_fields\nissue_557_1_to_1_nullability\nissue_fragment_spread_cycles\njson_is_stringified\nmax_page_size\nmax_rows_directive\nmulti_column_primary_key\nmultiple_mutations\nmultiple_queries\nmutation_delete\nmutation_delete_variable\nmutation_insert\nmutation_update\nnull_argument\nomit_exotic_types\nomit_weird_names\noperation_name\noverride_enum_name\noverride_field_name\noverride_func_field_name\noverride_relationship_field_name\noverride_type_name\npage_info\npermissions_connection_column\npermissions_functions\npermissions_node_column\npermissions_table_level\npermissions_types\nprimary_key_is_required\nrelationship_one_to_one\nresolve___schema\nresolve___type\nresolve___typename\nresolve_array_type\nresolve_connection_filter\nresolve_connection_named\nresolve_connection_order_by\nresolve_connection_pagination_args\nresolve_connection_to_conn\nresolve_connection_to_node\nresolve_error_connection_edge_no_field\nresolve_error_connection_edge_node_no_field\nresolve_error_connection_no_field\nresolve_error_from_parser\nresolve_error_mutation_no_field\nresolve_error_node_no_field\nresolve_error_query_no_field\nresolve_fragment\nresolve_graphiql_schema\nresolve_one\nroundtrip_types\nrow_level_security\nsqli_connection\nstring_filters\ntest_error_anon_and_named_operations\ntest_error_invalid_offset\ntest_error_multiple_anon_operations\ntest_error_mutation_transpilation\ntest_error_operation_name_not_found\ntest_error_operation_names_not_unique\ntest_error_parsing\ntest_error_query_transpilation\ntest_error_subscription\ntest_query__type\ntotal_count\ntype_bigfloat\ntype_modifier_max_length\ntype_opaque\nvariable_default\nviews_integration'1532pg_graphql-1.5.9> + psql -v ON_ERROR_STOP=1 -f test/fixtures.sql -d contrib_regression1533pg_graphql-1.5.9> psql:test/fixtures.sql:1: NOTICE:  extension "pg_graphql" does not exist, skipping1534pg_graphql-1.5.9> DROP EXTENSION1535pg_graphql-1.5.9> CREATE EXTENSION1536pg_graphql-1.5.9> COMMENT1537pg_graphql-1.5.9> CREATE FUNCTION1538pg_graphql-1.5.9> + /nix/store/wq2kfr0rkb0hdmf1iwi3mi8pxycakzmq-postgresql-17_22/lib/pgxs/src/makefiles/../test/regress/pg_regress --use-existing --dbname=contrib_regression --inputdir=test aliases allow_camel_names array_args_and_return_types bigint_is_string builtin_directives comment_directive comment_directive_description compound_filters empty_mutations enum_mappings extend_type_with_function extend_type_with_function_relation extend_type_with_generated_column filter_by_node_id fragment_on_mutation fragment_on_query function_calls function_calls_default_args function_calls_unsupported function_return_row_is_selectable function_return_view_has_pkey inflection_fields inflection_function inflection_relationships inflection_types issue_163 issue_170 issue_225 issue_237_field_merging issue_237_field_merging_mismatched issue_300 issue_306 issue_312 issue_334_ambiguous_function issue_337 issue_339_function_return_json issue_339_function_return_table issue_353_too_many_fields issue_370_citext_as_string issue_373 issue_377_enum_search_path issue_409_fkey_rls_nullability issue_444 issue_463 issue_511 issue_533 issue_542_partial_unique issue_551_too_many_fields issue_557_1_to_1_nullability issue_fragment_spread_cycles json_is_stringified max_page_size max_rows_directive multi_column_primary_key multiple_mutations multiple_queries mutation_delete mutation_delete_variable mutation_insert mutation_update null_argument omit_exotic_types omit_weird_names operation_name override_enum_name override_field_name override_func_field_name override_relationship_field_name override_type_name page_info permissions_connection_column permissions_functions permissions_node_column permissions_table_level permissions_types primary_key_is_required relationship_one_to_one resolve___schema resolve___type resolve___typename resolve_array_type resolve_connection_filter resolve_connection_named resolve_connection_order_by resolve_connection_pagination_args resolve_connection_to_conn resolve_connection_to_node resolve_error_connection_edge_no_field resolve_error_connection_edge_node_no_field resolve_error_connection_no_field resolve_error_from_parser resolve_error_mutation_no_field resolve_error_node_no_field resolve_error_query_no_field resolve_fragment resolve_graphiql_schema resolve_one roundtrip_types row_level_security sqli_connection string_filters test_error_anon_and_named_operations test_error_invalid_offset test_error_multiple_anon_operations test_error_mutation_transpilation test_error_operation_name_not_found test_error_operation_names_not_unique test_error_parsing test_error_query_transpilation test_error_subscription test_query__type total_count type_bigfloat type_modifier_max_length type_opaque variable_default views_integration1539pg_graphql-1.5.9> # using postmaster on /build/tmp.y4FEH8mcI0, default port1540pg_graphql-1.5.9> ok 1         - aliases                                    54 ms1541pg_graphql-1.5.9> ok 2         - allow_camel_names                          54 ms1542pg_graphql-1.5.9> ok 3         - array_args_and_return_types              1541 ms1543pg_graphql-1.5.9> ok 4         - bigint_is_string                           51 ms1544pg_graphql-1.5.9> ok 5         - builtin_directives                         58 ms1545pg_graphql-1.5.9> ok 6         - comment_directive                          10 ms1546pg_graphql-1.5.9> ok 7         - comment_directive_description              46 ms1547pg_graphql-1.5.9> ok 8         - compound_filters                          244 ms1548pg_graphql-1.5.9> ok 9         - empty_mutations                            48 ms1549pg_graphql-1.5.9> ok 10        - enum_mappings                              54 ms1550pg_graphql-1.5.9> ok 11        - extend_type_with_function                  50 ms1551pg_graphql-1.5.9> ok 12        - extend_type_with_function_relation        139 ms1552pg_graphql-1.5.9> ok 13        - extend_type_with_generated_column          48 ms1553pg_graphql-1.5.9> ok 14        - filter_by_node_id                          53 ms1554pg_graphql-1.5.9> ok 15        - fragment_on_mutation                       46 ms1555pg_graphql-1.5.9> ok 16        - fragment_on_query                          47 ms1556pg_graphql-1.5.9> ok 17        - function_calls                           1319 ms1557pg_graphql-1.5.9> ok 18        - function_calls_default_args                97 ms1558pg_graphql-1.5.9> ok 19        - function_calls_unsupported                291 ms1559pg_graphql-1.5.9> ok 20        - function_return_row_is_selectable          82 ms1560pg_graphql-1.5.9> ok 21        - function_return_view_has_pkey              73 ms1561pg_graphql-1.5.9> ok 22        - inflection_fields                         123 ms1562pg_graphql-1.5.9> ok 23        - inflection_function                       123 ms1563pg_graphql-1.5.9> ok 24        - inflection_relationships                  189 ms1564pg_graphql-1.5.9> ok 25        - inflection_types                          123 ms1565pg_graphql-1.5.9> ok 26        - issue_163                                  46 ms1566pg_graphql-1.5.9> ok 27        - issue_170                                  46 ms1567pg_graphql-1.5.9> ok 28        - issue_225                                  50 ms1568pg_graphql-1.5.9> ok 29        - issue_237_field_merging                    89 ms1569pg_graphql-1.5.9> ok 30        - issue_237_field_merging_mismatched         82 ms1570pg_graphql-1.5.9> ok 31        - issue_300                                  51 ms1571pg_graphql-1.5.9> ok 32        - issue_306                                  53 ms1572pg_graphql-1.5.9> ok 33        - issue_312                                  49 ms1573pg_graphql-1.5.9> ok 34        - issue_334_ambiguous_function               49 ms1574pg_graphql-1.5.9> ok 35        - issue_337                                  83 ms1575pg_graphql-1.5.9> ok 36        - issue_339_function_return_json             51 ms1576pg_graphql-1.5.9> ok 37        - issue_339_function_return_table            46 ms1577pg_graphql-1.5.9> ok 38        - issue_353_too_many_fields                  57 ms1578pg_graphql-1.5.9> ok 39        - issue_370_citext_as_string                 64 ms1579pg_graphql-1.5.9> ok 40        - issue_373                                  50 ms1580pg_graphql-1.5.9> ok 41        - issue_377_enum_search_path                 75 ms1581pg_graphql-1.5.9> ok 42        - issue_409_fkey_rls_nullability            107 ms1582pg_graphql-1.5.9> ok 43        - issue_444                                  43 ms1583pg_graphql-1.5.9> ok 44        - issue_463                                  49 ms1584pg_graphql-1.5.9> ok 45        - issue_511                                  55 ms1585pg_graphql-1.5.9> ok 46        - issue_533                                  97 ms1586pg_graphql-1.5.9> ok 47        - issue_542_partial_unique                   77 ms1587pg_graphql-1.5.9> ok 48        - issue_551_too_many_fields                  67 ms1588pg_graphql-1.5.9> ok 49        - issue_557_1_to_1_nullability               54 ms1589pg_graphql-1.5.9> ok 50        - issue_fragment_spread_cycles              204 ms1590pg_graphql-1.5.9> ok 51        - json_is_stringified                        52 ms1591pg_graphql-1.5.9> ok 52        - max_page_size                              49 ms1592pg_graphql-1.5.9> ok 53        - max_rows_directive                        101 ms1593pg_graphql-1.5.9> ok 54        - multi_column_primary_key                   59 ms1594pg_graphql-1.5.9> ok 55        - multiple_mutations                         54 ms1595pg_graphql-1.5.9> ok 56        - multiple_queries                           48 ms1596pg_graphql-1.5.9> ok 57        - mutation_delete                            59 ms1597pg_graphql-1.5.9> ok 58        - mutation_delete_variable                   52 ms1598pg_graphql-1.5.9> ok 59        - mutation_insert                            61 ms1599pg_graphql-1.5.9> ok 60        - mutation_update                            67 ms1600pg_graphql-1.5.9> ok 61        - null_argument                              47 ms1601pg_graphql-1.5.9> ok 62        - omit_exotic_types                          50 ms1602pg_graphql-1.5.9> ok 63        - omit_weird_names                           74 ms1603pg_graphql-1.5.9> ok 64        - operation_name                             55 ms1604pg_graphql-1.5.9> ok 65        - override_enum_name                         43 ms1605pg_graphql-1.5.9> ok 66        - override_field_name                        46 ms1606pg_graphql-1.5.9> ok 67        - override_func_field_name                   49 ms1607pg_graphql-1.5.9> ok 68        - override_relationship_field_name           54 ms1608pg_graphql-1.5.9> ok 69        - override_type_name                         49 ms1609pg_graphql-1.5.9> ok 70        - page_info                                  80 ms1610pg_graphql-1.5.9> ok 71        - permissions_connection_column              80 ms1611pg_graphql-1.5.9> ok 72        - permissions_functions                      77 ms1612pg_graphql-1.5.9> ok 73        - permissions_node_column                    84 ms1613pg_graphql-1.5.9> ok 74        - permissions_table_level                   178 ms1614pg_graphql-1.5.9> ok 75        - permissions_types                          97 ms1615pg_graphql-1.5.9> ok 76        - primary_key_is_required                    74 ms1616pg_graphql-1.5.9> ok 77        - relationship_one_to_one                    53 ms1617pg_graphql-1.5.9> ok 78        - resolve___schema                           58 ms1618pg_graphql-1.5.9> ok 79        - resolve___type                             51 ms1619pg_graphql-1.5.9> ok 80        - resolve___typename                         51 ms1620pg_graphql-1.5.9> ok 81        - resolve_array_type                         53 ms1621pg_graphql-1.5.9> ok 82        - resolve_connection_filter                 110 ms1622pg_graphql-1.5.9> ok 83        - resolve_connection_named                   47 ms1623pg_graphql-1.5.9> ok 84        - resolve_connection_order_by                80 ms1624pg_graphql-1.5.9> ok 85        - resolve_connection_pagination_args         98 ms1625pg_graphql-1.5.9> ok 86        - resolve_connection_to_conn                 54 ms1626pg_graphql-1.5.9> ok 87        - resolve_connection_to_node                 51 ms1627pg_graphql-1.5.9> ok 88        - resolve_error_connection_edge_no_field       46 ms1628pg_graphql-1.5.9> ok 89        - resolve_error_connection_edge_node_no_field       46 ms1629pg_graphql-1.5.9> ok 90        - resolve_error_connection_no_field          46 ms1630pg_graphql-1.5.9> ok 91        - resolve_error_from_parser                  11 ms1631pg_graphql-1.5.9> ok 92        - resolve_error_mutation_no_field            42 ms1632pg_graphql-1.5.9> ok 93        - resolve_error_node_no_field                48 ms1633pg_graphql-1.5.9> ok 94        - resolve_error_query_no_field               41 ms1634pg_graphql-1.5.9> ok 95        - resolve_fragment                           49 ms1635pg_graphql-1.5.9> ok 96        - resolve_graphiql_schema                   110 ms1636pg_graphql-1.5.9> ok 97        - resolve_one                                93 ms1637pg_graphql-1.5.9> ok 98        - roundtrip_types                            63 ms1638pg_graphql-1.5.9> ok 99        - row_level_security                         52 ms1639pg_graphql-1.5.9> ok 100       - sqli_connection                            58 ms1640pg_graphql-1.5.9> ok 101       - string_filters                             58 ms1641pg_graphql-1.5.9> ok 102       - test_error_anon_and_named_operations       41 ms1642pg_graphql-1.5.9> ok 103       - test_error_invalid_offset                  77 ms1643pg_graphql-1.5.9> ok 104       - test_error_multiple_anon_operations        41 ms1644pg_graphql-1.5.9> ok 105       - test_error_mutation_transpilation          47 ms1645pg_graphql-1.5.9> ok 106       - test_error_operation_name_not_found        41 ms1646pg_graphql-1.5.9> ok 107       - test_error_operation_names_not_unique       42 ms1647pg_graphql-1.5.9> ok 108       - test_error_parsing                         10 ms1648pg_graphql-1.5.9> ok 109       - test_error_query_transpilation             49 ms1649pg_graphql-1.5.9> ok 110       - test_error_subscription                    43 ms1650pg_graphql-1.5.9> ok 111       - test_query__type                           41 ms1651pg_graphql-1.5.9> ok 112       - total_count                                75 ms1652pg_graphql-1.5.9> ok 113       - type_bigfloat                              50 ms1653pg_graphql-1.5.9> ok 114       - type_modifier_max_length                   50 ms1654pg_graphql-1.5.9> ok 115       - type_opaque                                52 ms1655pg_graphql-1.5.9> ok 116       - variable_default                           50 ms1656pg_graphql-1.5.9> ok 117       - views_integration                         169 ms1657pg_graphql-1.5.9> 1..1171658pg_graphql-1.5.9> # All 117 tests passed.1659pg_graphql-1.5.9> + pg_ctl stop -m i1660pg_graphql-1.5.9> waiting for server to shut down....2026-10-06 14:25:14.057 UTC [4360] LOG:  received immediate shutdown request1661pg_graphql-1.5.9> 2026-10-06 14:25:14.064 UTC [4360] LOG:  database system is shut down1662pg_graphql-1.5.9>  done1663pg_graphql-1.5.9> server stopped1664pg_graphql-1.5.9> checkPhase completed in 38 seconds1665pg_graphql-1.5.9> Running phase: installPhase1666pg_graphql-1.5.9> Executing buildPgrxExtension install1667pg_graphql-1.5.9> Running phase: fixupPhase1668pg_graphql-1.5.9> shrinking RPATHs of ELF executables and libraries in /nix/store/nc2lckm4ank7mgp5bbfg3kwm6fg5xcb0-pg_graphql-1.5.91669pg_graphql-1.5.9> shrinking /nix/store/nc2lckm4ank7mgp5bbfg3kwm6fg5xcb0-pg_graphql-1.5.9/lib/pg_graphql-1.5.9.so1670pg_graphql-1.5.9> checking for references to /build/ in /nix/store/nc2lckm4ank7mgp5bbfg3kwm6fg5xcb0-pg_graphql-1.5.9...1671pg_graphql-1.5.9> patching script interpreter paths in /nix/store/nc2lckm4ank7mgp5bbfg3kwm6fg5xcb0-pg_graphql-1.5.91672pg_graphql-1.5.9> stripping (with command strip and flags -S -p) in  /nix/store/nc2lckm4ank7mgp5bbfg3kwm6fg5xcb0-pg_graphql-1.5.9/lib1673pg_graphql-1.5.9> stripping (with command strip and flags -s -p) in  /nix/store/nc2lckm4ank7mgp5bbfg3kwm6fg5xcb0-pg_graphql-1.5.9/lib1674building '/nix/store/2j0amjv943p6zmhzl3mx9z6jr1qcpn3i-pg_graphql.drv' on 'ssh-ng://nixbot-remote-build@78.232.36.247'1675building '/nix/store/2j0amjv943p6zmhzl3mx9z6jr1qcpn3i-pg_graphql.drv'1676pg_graphql> created 12 symlinks in user environment1677pg_graphql> Processing /nix/store/2694ixqglqy8mqjllxc9dj8xhg66y20m-pg_graphql/share/postgresql/extension/pg_graphql--1.5.11.sql1678pg_graphql> Processing /nix/store/2694ixqglqy8mqjllxc9dj8xhg66y20m-pg_graphql/share/postgresql/extension/pg_graphql--1.6.1.sql1679pg_graphql> Processing /nix/store/2694ixqglqy8mqjllxc9dj8xhg66y20m-pg_graphql/share/postgresql/extension/pg_graphql--1.6.2.sql1680pg_graphql> +++++ wc -l1681pg_graphql> +++++ ls -A /nix/store/2694ixqglqy8mqjllxc9dj8xhg66y20m-pg_graphql/lib/pg_graphql-1.5.11.so /nix/store/2694ixqglqy8mqjllxc9dj8xhg66y20m-pg_graphql/lib/pg_graphql-1.5.9.so /nix/store/2694ixqglqy8mqjllxc9dj8xhg66y20m-pg_graphql/lib/pg_graphql-1.6.1.so /nix/store/2694ixqglqy8mqjllxc9dj8xhg66y20m-pg_graphql/lib/pg_graphql-1.6.2.so /nix/store/2694ixqglqy8mqjllxc9dj8xhg66y20m-pg_graphql/lib/pg_graphql.so1682pg_graphql> ++++ test 5 = 5