nixbot

builds

cancelled checks.aarch64-linux.ext-timescaledb build #132 · raw · eval 12.6 s · 1.1 GiB allocated · ·

1these 167 derivations will be built:2  /nix/store/0cmixqwsz3vb82j49j1mhvyk8crg4dcw-wrappers-0.6.0.drv3  /nix/store/0i6b8yy32fc4mgfm75w94gw9ja033kw5-wrappers-0.5.5.drv4  /nix/store/qbrypyj5k7h0pffxxshbyym24h89f2y1-gdal-3.8.5.drv5  /nix/store/yyk2lzf5k1j27fr6bri5bh6940j6vf4d-boost-1.87.0.drv6  /nix/store/l9h30apsjb4s39av0lwsad1vv59rdkv6-cgal-6.0.2.drv7  /nix/store/s3myd88a11h86h3h8cvhgd1im0zk6i65-sfcgal-2.2.0.drv8  /nix/store/h1vl8vpk154yppn5lcqms2680igi0mmj-postgis-3.3.2.drv9  /nix/store/2ylkw9crapb58vd5g0vj602jfyb1p3r6-postgis.drv10  /nix/store/58cinn47vbvwr1wxdkspmvi9cj27b07h-safeupdate-1.4.drv11  /nix/store/6c0mnd757hvxppfyrsf4cb1wgnbd4111-safeupdate.drv12  /nix/store/ciwky5vscrx4c52kr30fm8j4idj8qgsn-pg_stat_monitor-2.1.drv13  /nix/store/vgq6xf6a37lr2w4mz7vinmvvxmr3fzvl-pg_stat_monitor-1.0.drv14  /nix/store/7a02zvvkkkriis78wgz6n8nnkwm2gh22-pg_stat_monitor.drv15  /nix/store/9gh7fip2wf0wip8wnv1axd8ghar0x5fb-pgmq-1.5.1.drv16  /nix/store/k4swwy7459wf558rbrraclsr4sjccz0h-pgmq-1.4.4.drv17  /nix/store/8zsadvm8mv18kpy4qy724ps2jlbsik0w-pgmq.drv18  /nix/store/l0qbb7iprbalriv9jdj7m2kk6nn5yv03-hypopg-1.4.1.drv19  /nix/store/xi5nsaqrnhf1zidjn285i1xcnnjbcklp-hypopg-1.3.1.drv20  /nix/store/9cyc6qlas6qyrfaaj96s88b727lqc5pl-hypopg.drv21  /nix/store/264aqk54nlidjqql6f9b3rqsy930j4hb-timescaledb-2.16.1.drv22  /nix/store/4wk9vb1q3kdnhj8hsq8pwgbp82glwg9w-timescaledb-2.9.1.drv23  /nix/store/9wzj3wh6sczzk849dmjwvmnkshggakxp-timescaledb.drv24  /nix/store/2nmg9sxx50xmndps3714hbvwjyd5rqv0-vector-0.8.2.drv25  /nix/store/94d6rmv5v8zdjsgzl3yrhpg7zq6zdjpx-vector-0.5.1.drv26  /nix/store/alajylsl9b90m65n0ps0mkbkw679x4sn-vector-0.6.2.drv27  /nix/store/jmilv9h5p0v4grgqnhfn22i7zl352ybh-vector-0.7.4.drv28  /nix/store/q3mdjvqpw4xbwcjy5y1ps1igxsjvx133-vector-0.7.0.drv29  /nix/store/v5dnr617av2jgk6kpddxbxxqjqgl5kzg-vector-0.8.0.drv30  /nix/store/z40s48rz55qgpw6g6wiqi68hkfas4h1l-vector-0.6.0.drv31  /nix/store/zygvf0wgqsyi96fangshfkwjiyylhvkz-vector-0.4.0.drv32  /nix/store/9zndhfzc45vrfn297g1hav7m6ba3rlzk-vector.drv33  /nix/store/0nln7k62ggiw9s5y0icr3hyribl5iazb-pg_graphql-1.2.3.drv34  /nix/store/63ifr5p2wzl7vygaj7pq847nwnrnxm3p-pg_graphql-1.5.0.drv35  /nix/store/6hfik9nnrihzb6dj53in06v6a4qmgsj3-pg_graphql-1.5.7.drv36  /nix/store/7pqhalqwaggagybgy24lm93c5b8d4isk-pg_graphql-1.4.2.drv37  /nix/store/ag5rlkqwfkwlgvxg1yhivjqfcaq2w14v-pg_graphql-1.5.1-mergeless.drv38  /nix/store/cgazfazb4ak4csd48khgjsa4vxmmddfb-pg_graphql-1.5.11.drv39  /nix/store/d78fjdz9zrccq7f563jz9fj1a45yrq5x-pg_graphql-1.1.0.drv40  /nix/store/dk0a0irlxsl04249qy2dnc6bm4wkk1lc-pg_graphql-1.6.1.drv41  /nix/store/dnwfmlfwyqnkzy2jyzf6h3q044wk6hbg-pg_graphql-1.5.9.drv42  /nix/store/f694g0m8chfk6z6yh787135bzcqwnli4-pg_graphql-1.5.4.drv43  /nix/store/fsgiwnrg38ssgf05vkmzc21v93a36qmd-pg_graphql-1.2.2.drv44  /nix/store/h9damb814a5fmzyc5wgcildkm32vy1bv-pg_graphql-1.6.2.drv45  /nix/store/iq0gzwfxzxkns0gpdkhjx1cc6s4q1i2q-pg_graphql-1.5.6.drv46  /nix/store/q66z8j5qs96rgahzmlrq4n41d2avywar-pg_graphql-1.0.2.drv47  /nix/store/v0mqjlj6j73wpc66h34djrv08j7q3l8w-pg_graphql-1.4.4.drv48  /nix/store/wnn3f47lz59i84mdzvmc1a7man89cmic-pg_graphql-1.2.0.drv49  /nix/store/yds474rgqgxjdw6zm0ylvpvvd4l0xmkl-pg_graphql-1.4.1.drv50  /nix/store/yhfqz2chz94q9k3rv8hgwcsyri02wlm8-pg_graphql-1.5.1.drv51  /nix/store/a4icbsgspmpi3nfs8vffp42sg9v7a25f-pg_graphql.drv52  /nix/store/1cm8n27jvam7chbq3vy8ij6bwjsbvmrl-pg_tle-1.3.0.drv53  /nix/store/ci5762r5g5l6xmj6r5i82xc1vqs7nqbb-pg_tle-1.0.1.drv54  /nix/store/qlfj7ly161ibdnrdg4vv9pbv2kjnkg4j-pg_tle-1.4.0.drv55  /nix/store/qp1sgb30psz9jlkm2wq8qc36zsvgggbr-pg_tle-1.0.4.drv56  /nix/store/a7qnf8v2hw96v6kdba9j02fljccy432g-pg_tle.drv57  /nix/store/c08rdgxba5n6zhyp78l8sd6fhnbc4a4c-pgsodium-3.1.7.drv58  /nix/store/hh2jpg5qdwgdwzi96qcay1a5ffhi0f4i-pgsodium-3.1.6.drv59  /nix/store/jwrjvb9m50v44sla4jpig83jab7zn17x-pgsodium-3.1.8.drv60  /nix/store/m1xdmpffkflwgdin5ljvfh72wxq5lxpx-pgsodium-3.1.5.drv61  /nix/store/wjhhlaiwzvm5m08my4d983icdmcpllzd-pgsodium-3.0.4.drv62  /nix/store/a9laaq557mna86dm87lq3211xy5h2zyl-pgsodium.drv63  /nix/store/c0mal78arwj7609sigcdgwhc7yl0mswh-http-1.5.0.drv64  /nix/store/xhdqsaqrmwpv3wcj6n7wz77ib1l83ps5-http-1.6.1.drv65  /nix/store/ag6xlrckwkx594nhf6j3sq2ngwbryyz8-http.drv66  /nix/store/i0gq8yqxp5h7l782n2ki94b1d62m6zsg-plpgsql_check-2.2.drv67  /nix/store/q117a7mx5d5bzln8xg24fh1vfzq7bsz4-plpgsql_check-2.7.drv68  /nix/store/rj6qw8pwvr91cy6qyp8xibrw4arrpj9j-plpgsql_check-2.8.drv69  /nix/store/c782i897gj20c0r8bmphf8p6r5s5wdli-plpgsql_check.drv70  /nix/store/b139hl0gpc9icb6j6q28gl1chw7i9260-rum-1.3.drv71  /nix/store/csvzp35khfq15v5g275y14094s58v10k-rum.drv72  /nix/store/c2pcswnd4yfp02pas6a7grpm0fmk70wx-supabase_vault-0.3.1.drv73  /nix/store/jb3j93i6ljmvqkv5cnv3lh3d9zn4zcjz-supabase_vault-0.2.8.drv74  /nix/store/gc3nb7r1a8rbf6f8yf4zs2nnb65awkxq-supabase_vault.drv75  /nix/store/7inhp3jz4x6l1m2i6aa1w6bbb91r1hay-pgroonga-3.2.5.drv76  /nix/store/xim497rkcncpxb5vvyli3j4jnziyybgy-pgroonga-3.0.7.drv77  /nix/store/gdd3j67qcdibplv1d440a6gsix87s5xs-pgroonga.drv78  /nix/store/ihx5q75k74a4cqq4k9bwnl5yin262kq2-pgrouting-3.4.1.drv79  /nix/store/hf9dly2ryx969lw950ld454fqfa6c41r-pgrouting.drv80  /nix/store/8kjmsmcqakfh251gpi83kpszgvy3zgj2-pg_jsonschema-0.3.1.drv81  /nix/store/dllk76mn670xnq6146jk4lmj5hpxmp4c-pg_jsonschema-0.3.3.drv82  /nix/store/pqncxlsh0gj7xk3n4mwxqiyyzim9c7g7-pg_jsonschema-0.2.0.drv83  /nix/store/iljk5j7rhldnws1iwi3j8qjxnaalxqjv-pg_jsonschema.drv84  /nix/store/82vdx9lfkbv67j79qzi9yzvqrj043w52-wal2json-2.6.drv85  /nix/store/iz713zhjyn0lym6ls12i9vxca9cxf4hi-wal2json.drv86  /nix/store/zfhvj40marmxclav9a5ppx3dmq3xd3hh-pg_partman-5.3.1.drv87  /nix/store/jcxqgl4g37gj09v4km7dl525ym1kxla2-pg_partman.drv88  /nix/store/g606d07g7yajsm6w6wihlknrynd7x504-pg_hashids-1.2.1.drv89  /nix/store/mc1n2fml7avin2lrpgrd5cx7wjdb4gcg-pg_hashids-1.3.0-cd0e1b31d52b394a0df64079406a14a4f7387cd6.drv90  /nix/store/jsqjxdn4qp571nvc40r8xx103s9qb7c9-pg_hashids.drv91  /nix/store/7lzcc5d36122752hpjb6lij6sc2ai2a0-plv8-3.1.5.drv92  /nix/store/87brzrl1nsm8z4my02aldnxd8fb0i69x-plv8-3.1.4.drv93  /nix/store/pqxy5n7hgs6f89grvghm04wg7l5g2vb8-plv8-3.1.10.drv94  /nix/store/k6nh1vivj2dgh0jk2mpsiy4p5v6sjyzk-plv8.drv95  /nix/store/xjfjfch45p5g0snar9qpm4amblh2jya8-plan_filter-0.1.drv96  /nix/store/lhdnha0m1rqpv0cmivzv3s7znjmgxc14-plan_filter.drv97  /nix/store/0n0iaya9csx9by2pimrx1yglzw8dp4zs-pg_net-0.13.0.drv98  /nix/store/25f3j4f5ialq0qwpdpc7gya55q9i2mai-pg_net-0.11.0.drv99  /nix/store/5xdj291zxpgm4qhx0749x7j0wwlfilf4-pg_net-0.1.drv100  /nix/store/6nzc8mspw5i4qqlvgriv2l1439xlh68v-pg_net-0.10.0.drv101  /nix/store/7iq4z475k625nsn9wc9nf4vxa7x1f1qd-pg_net-0.19.5.drv102  /nix/store/cfrc2vk3cgabx1447j2n7s3zxraq6395-pg_net-0.14.0.drv103  /nix/store/cwpx76dbd4wgmzvp89rp59qf113rhaxl-pg_net-0.20.4.drv104  /nix/store/iwq28h7yniccm9ra8q6dc0wma0l6hnqn-pg_net-0.6.drv105  /nix/store/nw3d144zhshkgx1z66g9g2wg5829w36n-pg_net-0.7.1.drv106  /nix/store/nwcnf7x9i2zdx48936w9ixsnxzhbab16-pg_net-0.20.0.drv107  /nix/store/rfdqkjkjdwz7ydrwlfn9cdy68zz9z6rf-pg_net-0.7.drv108  /nix/store/whvqb38akl195470ks3jads9kmq2i9gj-pg_net-0.8.0.drv109  /nix/store/ynxf31b3a513l6c880hkv4438bia0099-pg_net-0.2.drv110  /nix/store/zy29jzcj1bsz7760wbmlg78czaddsrni-pg_net-0.20.3.drv111  /nix/store/q7ak647qv213m4vc4fnr43i09azs1b0p-pg_net.drv112  /nix/store/9fw7qs7zw5qc9zn0q8ybaqmnfpg217w9-pgaudit-1.7.1.drv113  /nix/store/c861z24ai062pj48hpzr9bf2bq4i2cam-pgaudit-1.7.0.drv114  /nix/store/xszbjbci66vg1fk20pf8pa65sa5wx2ij-pgaudit-1.6.1.drv115  /nix/store/s7vxni6a17dm43jdicq8ksfjsk2d7c0n-pgaudit.drv116  /nix/store/9xr9lq8x0raxbg58cnchsywib3829v5c-index_advisor-0.2.0.drv117  /nix/store/srr6ndndk2xlrfkbanzfh4sjzgiq4cri-index_advisor.drv118  /nix/store/96qr18dba1kqd47jxxfk4bz9pjaiimd4-pgtap-1.3.1.drv119  /nix/store/nwi7hxl3j1cxn7ylrkx8sbbg3sqld8ag-pgtap-1.3.3.drv120  /nix/store/pr06jhz62vx9z1byy577fkxnbw11ip6b-pgtap-1.2.0.drv121  /nix/store/sxzi0qg4ingw35zkbi2pk2vfgxbq5k2a-pgtap.drv122  /nix/store/0m4x7mpmjnlgx41fvywyr8dnqbjvfspf-pg_cron-1.6.4.drv123  /nix/store/6npbgykyzfgvw452pyzgprjdndv6hj10-pg_cron-1.5.2.drv124  /nix/store/nia1zr4lmgkzdr6nhjab594khg51vkh6-pg_cron-1.3.1.drv125  /nix/store/wza7bzcbymwld5yd1bh5p859l0fgd9af-pg_cron-1.4.2.drv126  /nix/store/xcji3ff216yxrc2yf2yss6mza01w0ccm-pg_cron.drv127  /nix/store/21s45rg3i2jfhdarxmqf3dr79allgdgh-wrappers-0.4.5.drv128  /nix/store/56j6z0f3g50m72cj7ynr22p9fdml79q9-wrappers-0.5.3.drv129  /nix/store/9m4hgq2s9z1cy1508wymdcl2n1w3ky5h-wrappers-0.6.2.drv130  /nix/store/f3b53aqd65czxnbbash43yraza54ds7k-wrappers-0.4.3.drv131  /nix/store/fpcwzjw9wdhbljjpcjlbz4w6236qzl70-wrappers-0.3.0.drv132  /nix/store/hygnfcb7az5nw4c4aranasi27gnhzgan-wrappers-0.6.3.drv133  /nix/store/iimlppn24xgvgjvnm4xp8z9bxl4p4p1d-wrappers-0.4.1.drv134  /nix/store/l3ww3jfvj5l8bp25p66wrjziy8m0vi23-wrappers-0.5.0.drv135  /nix/store/ns9rs9anq0rsl3sh1rhxmqcsll7lkjd0-wrappers-0.5.6.drv136  /nix/store/nvjw377g2m07i1z93mngr72qhpjmafvy-wrappers-0.4.6.drv137  /nix/store/qzn17ml7z84zcmcw96j0z0f6m9j6y7qm-wrappers-0.5.4.drv138  /nix/store/xbhixx8nl4iifcfi17lpavbs9cxcg5ka-wrappers-0.6.1.drv139  /nix/store/y06jjr5k7hk7zs8gzilg4g50b184va6a-wrappers-0.4.2.drv140  /nix/store/y1qh08g7i9w1x2s10rq7ammigljy82kw-wrappers-0.4.4.drv141  /nix/store/z1yzqa9qzq4ri1f58lngsljs0abhgjz5-wrappers-0.5.7.drv142  /nix/store/xcq8s20l2ynk52356w6nqkdw7379h4g4-wrappers.drv143  /nix/store/3m1k34jx4kw90mcghzrp83c2dfhrwab8-pg_repack-1.5.1.drv144  /nix/store/c7dnz58z4jqy26qinfmray2nlvxx3442-pg_repack-1.4.8.drv145  /nix/store/im2j5r4zbnc7byf43yffwhaj1i9vki8r-pg_repack-1.5.0.drv146  /nix/store/iwgg2la44vzaaa2ja2xyaydck2jab651-pg_repack-1.5.2.drv147  /nix/store/xd0qgx5kfkw00jgxs1v9rm4ksfdjky95-pg_repack.drv148  /nix/store/fakh4z5ssr1vhknp3xv3ch232i3ph2ax-postgresql-and-plugins-15.19.drv149  /nix/store/4z7sbcap8vdzfs1smz81k2crr4sgm640-postgresql-and-plugins-15.19.drv150  /nix/store/q4qvxkwv7rl1jac9sf5aap56gjx0n5mb-system-path.drv151  /nix/store/9in45xg9fcahx70h7alf6jg08sin568q-dbus-1.drv152  /nix/store/jffmpfrihfl3k6lfgdc4ii4a62343h7x-X-Restart-Triggers-dbus.drv153  /nix/store/0jyfsa7sd5nhfiwbk0i0i0k7bbgigy6z-unit-dbus.service.drv154  /nix/store/70bg25srcrfnwivfph4bhslzhigdgpxw-unit-dbus.service.drv155  /nix/store/cpy2j0c5ribiykpjaig0axzryxzh1g69-user-units.drv156  /nix/store/qbfmigmm8fk4v5nhvb8h71hmhmdaky0g-supabase-db-init.drv157  /nix/store/ggfylf6a7iwk3pn3r08m30684z8rrq5l-unit-supabase-db-init.service.drv158  /nix/store/rjsqz027b1xj9q5dymzvs3wbqn2dv53m-postgresql-init.drv159  /nix/store/qsr1582sizlpmavcla4x0gbp3q52g4pd-unit-postgresql.service.drv160  /nix/store/ydkqsx664pp5ndcfl70c84mvxgixix01-system-units.drv161  /nix/store/y3dck3diii9z9x0w771pz541gjd0zwh3-etc.drv162  /nix/store/srl146pjpar66ijj6l2zw99pmy6wpkl9-activate.drv163  /nix/store/9wc69nxjgbhixmblkw2jjk9m2s6017bl-nixos-system-server-test.drv164  /nix/store/q2g2vsq78xk83ml7d6cbgb611scjh0d3-closure-info.drv165  /nix/store/wr7fgqns5k3zaglqbpqhdgai9pvl3z5n-run-nixos-vm.drv166  /nix/store/cnlwlmv2n0wkkx4a1ys07p1m8dvh8a9w-nixos-vm.drv167  /nix/store/67l9srb884j764q3zcq7pvvqdgp6ans2-nixos-test-driver-timescaledb.drv168  /nix/store/ph7sk5nawzckf5a96jd9agx20p1i0wfw-vm-test-run-timescaledb.drv169these 85 paths will be fetched (105.1 MiB download, 714.1 MiB unpacked):170  /nix/store/z25qyhrbvpcc7d9dsgy471xyvgpxzkfh-boost-1.87.0-dev171  /nix/store/rrn43f6vz2z371hiihxcff7795bry516-expat-2.7.3-dev172  /nix/store/f55xskzxcr2lsy8w941macrciay7h26g-libcxx-21.1.7173  /nix/store/kgvsi4c4ilygfxlxq9hkz1jv9rfxi4n9-libgeotiff-1.7.4-dev174  /nix/store/y12lzz430yqql7z4anhri1b8jxa0lzl4-libsodium-1.0.20-dev175  /nix/store/q1is2r1rlblb70zyhdk8pgcv4hws1hfk-libtiff-4.7.1-bin176  /nix/store/aycba8jzmw3a5acwi7cipjbnbvl4wdrr-libtiff-4.7.1-dev177  /nix/store/1pmpb4d8spv3qv4rr3xm4fxqs27wp56h-libuv-1.51.0-dev178  /nix/store/n7mmdq3z30z6wf0nhrvmic0ypv9abhib-pgroonga-3.0.7.tar.gz179  /nix/store/n8vq6gq011glnc8bkvfjj4n36qxmdliz-pgroonga-3.2.5.tar.gz180  /nix/store/2a0ndp40kvrndnb6r6fw610awz8wb0i5-pgtap-fix-upgrade-from-1.2.0-to-1.3.3.patch181  /nix/store/0g2m8576n31i162v77gcmng9yzza09vf-source182  /nix/store/0npm5dxbq7m64wa83iba9lx3l5rk2f68-source183  /nix/store/11fc13s6n3jp1hv44a6akllgjwhd1ds3-source184  /nix/store/120v29mxhywqng5p871lc6lm19yw657g-source185  /nix/store/210zrqjc4d9grn8xqr3qlsmgg8h09bks-source186  /nix/store/21sw5v9kx17q99p7d23bsyk99clsqz6s-source187  /nix/store/286q3077pma5salzan95m2v7mzpv4wby-source188  /nix/store/2c12715qcrn817mfshv93zs5z71syks6-source189  /nix/store/342ghg1clmvygl10xbw82xh8gb76d4bj-source190  /nix/store/34m0cwjdclyfnwdclmskiibxwbx8a392-source191  /nix/store/3783i7yhcfqnyv5ndli22gcr11ap151m-source192  /nix/store/3ac4zn6nc3hh704bap7p73hi6cb9njc8-source193  /nix/store/3riysfnrdibbfwpz8hjc9ld58frwh27a-source194  /nix/store/3rz4a3slsb5m2cbjbzxqighn7ff4v22z-source195  /nix/store/4b83ydwymbdf21y911hb9xi7p5nysjdp-source196  /nix/store/5zgdqy3bz93jyn79pizxc1hks0cdcadw-source197  /nix/store/6zi14y7jriwv1023irw75gsm6iah576x-source198  /nix/store/74csjfjbxmjshzmdwgzn79qz0rrl9l5l-source199  /nix/store/7dgsykawkl9ss69fdz0iw3xlswl31jlz-source200  /nix/store/7jawnfxj4y52xv6ahv4044m6x2fsj07f-source201  /nix/store/80y4c5pqzr1p2kiqq50i52xfbhg58384-source202  /nix/store/94cccr9b4iga11pgm3yn6ash8lf0a742-source203  /nix/store/agdin0fri4sjc3gk6cd9mlv63q429p6w-source204  /nix/store/anmsi4fdkdljra2jx4b1nn694iz8xmf3-source205  /nix/store/b6215nbvsbxpqjnybrk31idfx4z323ah-source206  /nix/store/bxdzbzjn4yi7ch55dlcgzk6npzx2p4jz-source207  /nix/store/c5rqd9gvfp7gsls5w8nmrgblxpx3c14p-source208  /nix/store/cgxhhzzvf6l5v3s2362nbic86j7pyd7x-source209  /nix/store/cijlkfxy6vfh6pbq2nd4v8pc51nxn75y-source210  /nix/store/ckih432xf5n3b1z6d56qcavss3wx255s-source211  /nix/store/cpxghg5cw7n5fhigvx3yc8vyis8way3s-source212  /nix/store/df9amwqan07pl46ymnylvncb9rrdzvjx-source213  /nix/store/dl4d1z74s9qaym3jc7jybq51f2nphg1k-source214  /nix/store/fdvpi9rrahp0pzx91srrjghjahx1kw43-source215  /nix/store/h4si3vf0mjxqisvjk5syqh3ch0kb9nxj-source216  /nix/store/hjlmfy69f11l9rwqiw17g4ja4d1zk7bg-source217  /nix/store/i011sg9vhbp3ac35kb5amdgivhb5vghd-source218  /nix/store/i8jxjfqvp9bqziqhlsqbybvbk0w9pvqi-source219  /nix/store/ic9msjimrdz3gmyq016afsfm4jsysc3r-source220  /nix/store/jidz820idspg61dh36k8ym9jmw1lrspg-source221  /nix/store/jrdmpv7dllz9p1dyr07mdxgr4rdhm46x-source222  /nix/store/k8c3rak9kd6wykgvhwk6xjzc8yh22yva-source223  /nix/store/khfal387jkzhzmpp318xq8y996m3nsl0-source224  /nix/store/ma7f9mks3an7idchbl1wflyxfd9mp9p3-source225  /nix/store/mb6v9fi1zbgrvwacb7qfg7a446jgd7rq-source226  /nix/store/mp8q0figqyqpd9jz73ijawp6zib966nh-source227  /nix/store/myfcpslapy1rwi4hf176vyyny2zfz7vh-source228  /nix/store/n0rjb7ygjb3586dxhkdfswn12s2l602m-source229  /nix/store/n5icsinchadzki42zgr8faxv1zi69fic-source230  /nix/store/npf69vphjg8blzzmdvmvn9inr01f7pyv-source231  /nix/store/nsmrvbpdymlb57mhf4v51b8il24r1v3g-source232  /nix/store/nyhh9ymb2h9gv8dxvfyg12pkzjnzik5h-source233  /nix/store/qdc1h7rllxi8rnjx3mi8sbs62mz1jmg9-source234  /nix/store/rrgb0fks0hl8fs1y22icckm3r0gq13di-source235  /nix/store/snj3d9g5np6kjwaj6d0vr8cm5lfqcwd1-source236  /nix/store/vawzmlfvb9i5xk8911gvyxf0d1zl7kjz-source237  /nix/store/vpc4dw0l4h5i31cfcpwf343nfbr07q4n-source238  /nix/store/vv4rh3qapqasiki1gbg1aaywxw1p9s5w-source239  /nix/store/vxylm0g2a18fnbbdrvzh5r4n13zwwjd1-source240  /nix/store/w8la249y5z9nhip27wjfzy3wnalxzzk7-source241  /nix/store/wcsm9npwq9vrlhkhmrrc0xm36ilfxwn1-source242  /nix/store/wd1sgz3823778jvjfd24vh9wwzyc04n5-source243  /nix/store/wyisw4pmqj8gjmbxnwlqkiccx6xbnm3g-source244  /nix/store/x9gslw0qychvz955dh2z9sy8fqa34pxy-source245  /nix/store/xg3db5akr5yppdcqzb7n2d7j83pr7cg3-source246  /nix/store/xj81h9si3spl8xjc743spsi2256y6xsf-source247  /nix/store/xp1qj8hf26gryjpk0lry2lipbzl89b1p-source248  /nix/store/ynvy44q0rkky0fhydf3dr0ia0vw8qwaa-source249  /nix/store/yq19xry6gaf45w43y5kwvq32sa3l3vkk-source250  /nix/store/z7c2kqbk0jk2f1hknycri991q5zpbv8a-source251  /nix/store/zi4q3c08k9vnknhi9np46q0gq6wa0ygz-source252  /nix/store/9prciviq1v39c1xfg7zz1dnh3gf54071-sqlite-3.51.1-bin253  /nix/store/ayxchn2mch6cx8kjapnffsp0rpg63z8i-sqlite-3.51.1-dev254  /nix/store/4q25z227rz6sscfw63rbzpra91fg6p8m-v8-9.7.106.18255building '/nix/store/xi5nsaqrnhf1zidjn285i1xcnnjbcklp-hypopg-1.3.1.drv' on 'ssh-ng://nixbot-remote-build@78.232.36.247'256building '/nix/store/ynxf31b3a513l6c880hkv4438bia0099-pg_net-0.2.drv' on 'ssh-ng://nixbot-remote-build@78.232.36.247'257building '/nix/store/9xr9lq8x0raxbg58cnchsywib3829v5c-index_advisor-0.2.0.drv' on 'ssh-ng://nixbot-remote-build@78.232.36.247'258building '/nix/store/ynxf31b3a513l6c880hkv4438bia0099-pg_net-0.2.drv'259pg_net-0.2> Running phase: unpackPhase260pg_net-0.2> unpacking source archive /nix/store/80y4c5pqzr1p2kiqq50i52xfbhg58384-source261pg_net-0.2> source root is source262pg_net-0.2> Running phase: patchPhase263pg_net-0.2> Running phase: updateAutotoolsGnuConfigScriptsPhase264pg_net-0.2> Running phase: configurePhase265pg_net-0.2> no configure script, doing nothing266pg_net-0.2> Running phase: buildPhase267pg_net-0.2> gcc -Wall -Wmissing-prototypes -Wpointer-arith -Wdeclaration-after-statement -Werror=vla -Wendif-labels -Wmissing-format-attribute -Wimplicit-fallthrough=3 -Wcast-function-type -Wformat-security -fno-strict-aliasing -fwrapv -fexcess-precision=standard -Wno-deprecated-non-prototype -Wno-format-truncation -Wno-stringop-truncation -g -O2 -std=gnu17 -fPIC -I. -I./ -I/nix/store/48l45fvi99n90x6p9i4cs1lmzby6cb73-postgresql-15.19/include/server -I/nix/store/48l45fvi99n90x6p9i4cs1lmzby6cb73-postgresql-15.19/include/internal -D_GNU_SOURCE  -I/nix/store/p17klc3qq4nl9ihfwqfpi8cnqvcf92xz-libxml2-2.15.1-dev/include/libxml2 -I/nix/store/mglbi4dy4kpx7v1dcgf6iincp5x38hsc-lz4-1.10.0-dev/include -I/nix/store/g41q9md9rdcr3lkydi6f8zd6fza3h1q4-zstd-1.5.7-dev/include -I/nix/store/n2vnr7ycfk6midbzxcwd28qj3bgb50cz-icu4c-75.1-dev/include  -c -o src/worker.o src/worker.c268pg_net-0.2> src/worker.c: In function 'init':269pg_net-0.2> src/worker.c:184:9: warning: 'CURLOPT_PROTOCOLS' is deprecated: since 7.85.0. Use CURLOPT_PROTOCOLS_STR [-Wdeprecated-declarations]270pg_net-0.2>   184 |         curl_easy_setopt(eh, CURLOPT_PROTOCOLS, CURLPROTO_HTTP | CURLPROTO_HTTPS);271pg_net-0.2>       |         ^~~~~~~~~~~~~~~~272pg_net-0.2> In file included from src/worker.c:28:273pg_net-0.2> /nix/store/jviasb44hibgh09829gbmbssbz2jjnhz-curl-8.17.0-dev/include/curl/curl.h:1786:3: note: declared here274pg_net-0.2>  1786 |   CURLOPTDEPRECATED(CURLOPT_PROTOCOLS, CURLOPTTYPE_LONG, 181,275pg_net-0.2>       |   ^~~~~~~~~~~~~~~~~276pg_net-0.2> gcc -Wall -Wmissing-prototypes -Wpointer-arith -Wdeclaration-after-statement -Werror=vla -Wendif-labels -Wmissing-format-attribute -Wimplicit-fallthrough=3 -Wcast-function-type -Wformat-security -fno-strict-aliasing -fwrapv -fexcess-precision=standard -Wno-deprecated-non-prototype -Wno-format-truncation -Wno-stringop-truncation -g -O2 -std=gnu17 -fPIC -shared -o pg_net.so src/worker.o -L/nix/store/k4dpm55d68aq0df72hjk046xy1124lhn-postgresql-15.19-lib/lib    -L/nix/store/wfk1mrpj1r5f7iyihjnh0jjixr900z7y-libxml2-2.15.1/lib -L/nix/store/62b24z1igfh6ws654fhsgnm3fm7j1z3c-lz4-1.10.0-lib/lib -L/nix/store/fqy9nkaahib56gcy0r77qjk7n03cvnfs-zstd-1.5.7/lib -Wl,--as-needed -Wl,-rpath,'/nix/store/k4dpm55d68aq0df72hjk046xy1124lhn-postgresql-15.19-lib/lib',--enable-new-dtags  -lcurl 277pg_net-0.2> cp sql/pg_net.sql sql/pg_net--0.2.sql278pg_net-0.2> Running phase: installPhase279pg_net-0.2> Running phase: fixupPhase280pg_net-0.2> shrinking RPATHs of ELF executables and libraries in /nix/store/jz9xz9qj7xid6fwslwrz2jcpn4khg53s-pg_net-0.2281pg_net-0.2> shrinking /nix/store/jz9xz9qj7xid6fwslwrz2jcpn4khg53s-pg_net-0.2/lib/pg_net-0.2.so282pg_net-0.2> checking for references to /build/ in /nix/store/jz9xz9qj7xid6fwslwrz2jcpn4khg53s-pg_net-0.2...283pg_net-0.2> patching script interpreter paths in /nix/store/jz9xz9qj7xid6fwslwrz2jcpn4khg53s-pg_net-0.2284pg_net-0.2> stripping (with command strip and flags -S -p) in  /nix/store/jz9xz9qj7xid6fwslwrz2jcpn4khg53s-pg_net-0.2/lib285building '/nix/store/9cyc6qlas6qyrfaaj96s88b727lqc5pl-hypopg.drv' on 'ssh-ng://nixbot-remote-build@78.232.36.247'286building '/nix/store/9cyc6qlas6qyrfaaj96s88b727lqc5pl-hypopg.drv'287hypopg> created 11 symlinks in user environment288hypopg> +++++ ls -A /nix/store/9dpc1iz5z8n6xpc1c89adb92n76z8q0b-hypopg/lib/hypopg-1.3.1.so /nix/store/9dpc1iz5z8n6xpc1c89adb92n76z8q0b-hypopg/lib/hypopg-1.4.1.so /nix/store/9dpc1iz5z8n6xpc1c89adb92n76z8q0b-hypopg/lib/hypopg.so289hypopg> +++++ wc -l290hypopg> ++++ test 3 = 3291building '/nix/store/srr6ndndk2xlrfkbanzfh4sjzgiq4cri-index_advisor.drv' on 'ssh-ng://nixbot-remote-build@78.232.36.247'292building '/nix/store/srr6ndndk2xlrfkbanzfh4sjzgiq4cri-index_advisor.drv'293index_advisor> created 18 symlinks in user environment294building '/nix/store/0nln7k62ggiw9s5y0icr3hyribl5iazb-pg_graphql-1.2.3.drv' on 'ssh-ng://nixbot-remote-build@78.232.36.247'295building '/nix/store/0nln7k62ggiw9s5y0icr3hyribl5iazb-pg_graphql-1.2.3.drv'296pg_graphql-1.2.3> Running phase: unpackPhase297pg_graphql-1.2.3> unpacking source archive /nix/store/9k236rayr00a1y04snahwigbn8lbh0yg-source298pg_graphql-1.2.3> source root is source299pg_graphql-1.2.3> Executing cargoSetupPostUnpackHook300pg_graphql-1.2.3> Finished cargoSetupPostUnpackHook301pg_graphql-1.2.3> Running phase: patchPhase302pg_graphql-1.2.3> Executing cargoSetupPostPatchHook303pg_graphql-1.2.3> Validating consistency between /build/source/Cargo.lock and /build/cargo-vendor-dir/Cargo.lock304pg_graphql-1.2.3> Finished cargoSetupPostPatchHook305pg_graphql-1.2.3> Running phase: updateAutotoolsGnuConfigScriptsPhase306pg_graphql-1.2.3> Running phase: configurePhase307pg_graphql-1.2.3> Running phase: buildPhase308pg_graphql-1.2.3> Executing cargo-pgrx buildPhase309pg_graphql-1.2.3>    Validating /nix/store/48l45fvi99n90x6p9i4cs1lmzby6cb73-postgresql-15.19/bin/pg_config310pg_graphql-1.2.3>  Initializing data directory at /build/tmp.7BaXAqOb8Y/data-15311pg_graphql-1.2.3> waiting for server to start....2026-10-06 13:45:59.008 GMT [88] LOG:  starting PostgreSQL 15.19 on aarch64-unknown-linux-gnu, compiled by gcc (GCC) 15.2.0, 64-bit312pg_graphql-1.2.3> 2026-10-06 13:45:59.011 GMT [88] LOG:  listening on Unix socket "/build/tmp.Ms5h4fgLeB/.s.PGSQL.5432"313pg_graphql-1.2.3> 2026-10-06 13:45:59.020 GMT [91] LOG:  database system was shut down at 2026-10-06 13:45:58 GMT314pg_graphql-1.2.3> 2026-10-06 13:45:59.026 GMT [88] LOG:  database system is ready to accept connections315pg_graphql-1.2.3>  done316pg_graphql-1.2.3> server started317pg_graphql-1.2.3> createuser: error: connection to server at "localhost" (127.0.0.1), port 5432 failed: Connection refused318pg_graphql-1.2.3> 	Is the server running on that host and accepting TCP/IP connections?319pg_graphql-1.2.3> waiting for server to shut down....2026-10-06 13:45:59.091 GMT [88] LOG:  received fast shutdown request320pg_graphql-1.2.3> 2026-10-06 13:45:59.094 GMT [88] LOG:  aborting any active transactions321pg_graphql-1.2.3> 2026-10-06 13:45:59.097 GMT [88] LOG:  background worker "logical replication launcher" (PID 94) exited with exit code 1322pg_graphql-1.2.3> 2026-10-06 13:45:59.102 GMT [89] LOG:  shutting down323pg_graphql-1.2.3> 2026-10-06 13:45:59.105 GMT [89] LOG:  checkpoint starting: shutdown immediate324pg_graphql-1.2.3> 2026-10-06 13:45:59.119 GMT [89] LOG:  checkpoint complete: wrote 3 buffers (0.0%); 0 WAL file(s) added, 0 removed, 0 recycled; write=0.004 s, sync=0.002 s, total=0.017 s; sync files=2, longest=0.001 s, average=0.001 s; distance=0 kB, estimate=0 kB325pg_graphql-1.2.3> 2026-10-06 13:45:59.123 GMT [88] LOG:  database system is shut down326pg_graphql-1.2.3>  done327pg_graphql-1.2.3> server stopped328pg_graphql-1.2.3>        Using PgConfig("pg15") and `pg_config` from /nix/store/48l45fvi99n90x6p9i4cs1lmzby6cb73-postgresql-15.19/bin/pg_config329pg_graphql-1.2.3>     Building extension with features  pg15330pg_graphql-1.2.3>      Running command "/nix/store/kmjm2xvp081ivprjgw95k94xmq1iswls-rust-default-1.70.0/bin/cargo" "build" "--release" "--features" " pg15" "--no-default-features" "--message-format=json-render-diagnostics" "--frozen" "-j" "2"331pg_graphql-1.2.3>    Compiling proc-macro2 v1.0.64332pg_graphql-1.2.3>    Compiling quote v1.0.29333pg_graphql-1.2.3>    Compiling unicode-ident v1.0.10334pg_graphql-1.2.3>    Compiling autocfg v1.1.0335pg_graphql-1.2.3>    Compiling syn v2.0.25336pg_graphql-1.2.3>    Compiling libc v0.2.147337pg_graphql-1.2.3>    Compiling syn v1.0.109338pg_graphql-1.2.3>    Compiling thiserror v1.0.43339pg_graphql-1.2.3>    Compiling serde v1.0.171340pg_graphql-1.2.3>    Compiling eyre v0.6.8341pg_graphql-1.2.3>    Compiling serde_derive v1.0.171342pg_graphql-1.2.3>    Compiling thiserror-impl v1.0.43343pg_graphql-1.2.3>    Compiling indexmap v1.9.3344pg_graphql-1.2.3>    Compiling memchr v2.5.0345pg_graphql-1.2.3>    Compiling tinyvec_macros v0.1.1346pg_graphql-1.2.3>    Compiling equivalent v1.0.0347pg_graphql-1.2.3>    Compiling glob v0.3.1348pg_graphql-1.2.3>    Compiling hashbrown v0.14.0349pg_graphql-1.2.3>    Compiling serde_json v1.0.100350pg_graphql-1.2.3>    Compiling indexmap v2.0.0351pg_graphql-1.2.3>    Compiling toml_datetime v0.6.3352pg_graphql-1.2.3>    Compiling serde_spanned v0.6.3353pg_graphql-1.2.3>    Compiling clang-sys v1.6.1354pg_graphql-1.2.3>    Compiling tinyvec v1.6.0355pg_graphql-1.2.3>    Compiling winnow v0.4.9356pg_graphql-1.2.3>    Compiling anyhow v1.0.71357pg_graphql-1.2.3>    Compiling once_cell v1.18.0358pg_graphql-1.2.3>    Compiling ucd-trie v0.1.6359pg_graphql-1.2.3>    Compiling indenter v0.3.3360pg_graphql-1.2.3>    Compiling pest v2.7.0361pg_graphql-1.2.3>    Compiling toml_edit v0.19.12362pg_graphql-1.2.3>    Compiling unicode-normalization v0.1.22363pg_graphql-1.2.3>    Compiling semver v1.0.17364pg_graphql-1.2.3>    Compiling cfg-if v1.0.0365pg_graphql-1.2.3>    Compiling minimal-lexical v0.2.1366pg_graphql-1.2.3>    Compiling option-ext v0.2.0367pg_graphql-1.2.3>    Compiling futures-core v0.3.28368pg_graphql-1.2.3>    Compiling regex-syntax v0.7.3369pg_graphql-1.2.3>    Compiling percent-encoding v2.3.0370pg_graphql-1.2.3>    Compiling unicode-bidi v0.3.13371pg_graphql-1.2.3>    Compiling idna v0.4.0372pg_graphql-1.2.3>    Compiling regex-automata v0.3.2373pg_graphql-1.2.3>    Compiling form_urlencoded v1.2.0374pg_graphql-1.2.3>    Compiling dirs-sys v0.4.1375pg_graphql-1.2.3>    Compiling nom v7.1.3376pg_graphql-1.2.3>    Compiling libloading v0.7.4377pg_graphql-1.2.3>    Compiling toml v0.7.6378pg_graphql-1.2.3>    Compiling semver-parser v0.10.2379pg_graphql-1.2.3>    Compiling slab v0.4.8380pg_graphql-1.2.3>    Compiling itoa v1.0.8381pg_graphql-1.2.3>    Compiling futures-channel v0.3.28382pg_graphql-1.2.3>    Compiling hashbrown v0.12.3383pg_graphql-1.2.3>    Compiling bindgen v0.66.1384pg_graphql-1.2.3>    Compiling ryu v1.0.14385pg_graphql-1.2.3>    Compiling futures-task v0.3.28386pg_graphql-1.2.3>    Compiling semver v0.11.0387pg_graphql-1.2.3>    Compiling cargo_toml v0.15.3388pg_graphql-1.2.3>    Compiling pathsearch v0.2.0389pg_graphql-1.2.3>    Compiling cexpr v0.6.0390pg_graphql-1.2.3>    Compiling regex v1.9.1391pg_graphql-1.2.3>    Compiling dirs v5.0.1392pg_graphql-1.2.3>    Compiling url v2.4.0393pg_graphql-1.2.3>    Compiling getrandom v0.2.10394pg_graphql-1.2.3>    Compiling lazy_static v1.4.0395pg_graphql-1.2.3>    Compiling ident_case v1.0.1396pg_graphql-1.2.3>    Compiling unicode-segmentation v1.10.1397pg_graphql-1.2.3>    Compiling fixedbitset v0.4.2398pg_graphql-1.2.3>    Compiling rustc-hash v1.1.0399pg_graphql-1.2.3>    Compiling futures-util v0.3.28400pg_graphql-1.2.3>    Compiling owo-colors v3.5.0401pg_graphql-1.2.3>    Compiling peeking_take_while v0.1.2402pg_graphql-1.2.3>    Compiling pin-project-lite v0.2.10403pg_graphql-1.2.3>    Compiling strsim v0.10.0404pg_graphql-1.2.3>    Compiling bitflags v2.3.3405pg_graphql-1.2.3>    Compiling futures-sink v0.3.28406pg_graphql-1.2.3>    Compiling shlex v1.1.0407pg_graphql-1.2.3>    Compiling fnv v1.0.7408pg_graphql-1.2.3>    Compiling byteorder v1.4.3409pg_graphql-1.2.3>    Compiling lazycell v1.3.0410pg_graphql-1.2.3>    Compiling darling_core v0.13.4411pg_graphql-1.2.3>    Compiling pgrx-pg-config v0.9.7412pg_graphql-1.2.3>    Compiling petgraph v0.6.3413pg_graphql-1.2.3>    Compiling convert_case v0.6.0414pg_graphql-1.2.3>    Compiling rustc_version v0.4.0415pg_graphql-1.2.3>    Compiling rustc_version v0.3.3416pg_graphql-1.2.3>    Compiling futures-macro v0.3.28417pg_graphql-1.2.3>    Compiling memoffset v0.9.0418pg_graphql-1.2.3>    Compiling radium v0.7.0419pg_graphql-1.2.3>    Compiling pin-utils v0.1.0420pg_graphql-1.2.3>    Compiling futures-io v0.3.28421pg_graphql-1.2.3>    Compiling unescape v0.1.0422pg_graphql-1.2.3>    Compiling pgrx-sql-entity-graph v0.9.7423pg_graphql-1.2.3>    Compiling atomic-traits v0.3.0424pg_graphql-1.2.3>    Compiling heapless v0.7.16425pg_graphql-1.2.3>    Compiling pgrx-pg-sys v0.9.7426pg_graphql-1.2.3>    Compiling darling_macro v0.13.4427pg_graphql-1.2.3>    Compiling tokio v1.29.1428pg_graphql-1.2.3>    Compiling async-trait v0.1.71429pg_graphql-1.2.3>    Compiling tap v1.0.1430pg_graphql-1.2.3>    Compiling either v1.8.1431pg_graphql-1.2.3>    Compiling void v1.0.2432pg_graphql-1.2.3>    Compiling unreachable v1.0.0433pg_graphql-1.2.3>    Compiling wyz v0.5.1434pg_graphql-1.2.3>    Compiling darling v0.13.4435pg_graphql-1.2.3>    Compiling pgrx-macros v0.9.7436pg_graphql-1.2.3>    Compiling futures-executor v0.3.28437pg_graphql-1.2.3>    Compiling hash32 v0.2.1438pg_graphql-1.2.3>    Compiling rand_core v0.6.4439pg_graphql-1.2.3>    Compiling aho-corasick v1.0.2440pg_graphql-1.2.3>    Compiling num_cpus v1.16.0441pg_graphql-1.2.3>    Compiling enum-map-derive v0.12.0442pg_graphql-1.2.3>    Compiling tokio-macros v2.1.0443pg_graphql-1.2.3>    Compiling cached_proc_macro_types v0.1.0444pg_graphql-1.2.3>    Compiling half v1.8.2445pg_graphql-1.2.3>    Compiling sptr v0.3.2446pg_graphql-1.2.3>    Compiling stable_deref_trait v1.2.0447pg_graphql-1.2.3>    Compiling ascii v0.9.3448pg_graphql-1.2.3>    Compiling funty v2.0.0449pg_graphql-1.2.3>    Compiling ppv-lite86 v0.2.17450pg_graphql-1.2.3>    Compiling rand_chacha v0.3.1451pg_graphql-1.2.3>    Compiling bitvec v1.0.1452pg_graphql-1.2.3>    Compiling combine v3.8.1453pg_graphql-1.2.3>    Compiling serde_cbor v0.11.2454pg_graphql-1.2.3>    Compiling cached_proc_macro v0.12.0455pg_graphql-1.2.3>    Compiling enum-map v2.6.0456pg_graphql-1.2.3>    Compiling futures v0.3.28457pg_graphql-1.2.3>    Compiling uuid v1.4.0458pg_graphql-1.2.3>    Compiling seq-macro v0.3.4459pg_graphql-1.2.3>    Compiling seahash v4.1.0460pg_graphql-1.2.3>    Compiling async_once v0.2.6461pg_graphql-1.2.3>    Compiling pgrx v0.9.7462pg_graphql-1.2.3>    Compiling cached v0.34.1463pg_graphql-1.2.3>    Compiling graphql-parser v0.4.0464pg_graphql-1.2.3>    Compiling rand v0.8.5465pg_graphql-1.2.3>    Compiling itertools v0.10.5466pg_graphql-1.2.3>    Compiling base64 v0.13.1467pg_graphql-1.2.3>    Compiling pg_graphql v1.2.3 (/build/source)468pg_graphql-1.2.3>     Finished release [optimized] target(s) in 11m 38s469pg_graphql-1.2.3>   Installing extension470pg_graphql-1.2.3>      Copying control file to /nix/store/rk3f93w1dpcpfwb9xv9jq1lmr23k50f5-pg_graphql-1.2.3/nix/store/48l45fvi99n90x6p9i4cs1lmzby6cb73-postgresql-15.19/share/postgresql/extension/pg_graphql.control471pg_graphql-1.2.3>      Copying shared library to /nix/store/rk3f93w1dpcpfwb9xv9jq1lmr23k50f5-pg_graphql-1.2.3/nix/store/k4dpm55d68aq0df72hjk046xy1124lhn-postgresql-15.19-lib/lib/pg_graphql.so472pg_graphql-1.2.3>  Discovering SQL entities473pg_graphql-1.2.3>   Discovered 5 SQL entities: 0 schemas (0 unique), 1 functions, 0 types, 0 enums, 4 sqls, 0 ords, 0 hashes, 0 aggregates, 0 triggers474pg_graphql-1.2.3>      Writing SQL entities to /nix/store/rk3f93w1dpcpfwb9xv9jq1lmr23k50f5-pg_graphql-1.2.3/nix/store/48l45fvi99n90x6p9i4cs1lmzby6cb73-postgresql-15.19/share/postgresql/extension/pg_graphql--1.2.3.sql475pg_graphql-1.2.3>     Finished installing pg_graphql476pg_graphql-1.2.3> buildPhase completed in 11 minutes 57 seconds477pg_graphql-1.2.3> Running phase: checkPhase478pg_graphql-1.2.3>    Validating /nix/store/48l45fvi99n90x6p9i4cs1lmzby6cb73-postgresql-15.19/bin/pg_config479pg_graphql-1.2.3>  Initializing data directory at /build/tmp.Z86hzGlOSo/data-15480pg_graphql-1.2.3> waiting for server to start....2026-10-06 13:57:56.822 GMT [3347] LOG:  starting PostgreSQL 15.19 on aarch64-unknown-linux-gnu, compiled by gcc (GCC) 15.2.0, 64-bit481pg_graphql-1.2.3> 2026-10-06 13:57:56.833 GMT [3347] LOG:  listening on Unix socket "/build/tmp.eV2lePwYXj/.s.PGSQL.5432"482pg_graphql-1.2.3> 2026-10-06 13:57:56.844 GMT [3350] LOG:  database system was shut down at 2026-10-06 13:57:56 GMT483pg_graphql-1.2.3> 2026-10-06 13:57:56.854 GMT [3347] LOG:  database system is ready to accept connections484pg_graphql-1.2.3>  done485pg_graphql-1.2.3> server started486pg_graphql-1.2.3> createuser: error: connection to server at "localhost" (127.0.0.1), port 5432 failed: Connection refused487pg_graphql-1.2.3> 	Is the server running on that host and accepting TCP/IP connections?488pg_graphql-1.2.3> waiting for server to shut down....2026-10-06 13:57:56.902 GMT [3347] LOG:  received fast shutdown request489pg_graphql-1.2.3> 2026-10-06 13:57:56.907 GMT [3347] LOG:  aborting any active transactions490pg_graphql-1.2.3> 2026-10-06 13:57:56.911 GMT [3347] LOG:  background worker "logical replication launcher" (PID 3353) exited with exit code 1491pg_graphql-1.2.3> 2026-10-06 13:57:56.913 GMT [3348] LOG:  shutting down492pg_graphql-1.2.3> 2026-10-06 13:57:56.917 GMT [3348] LOG:  checkpoint starting: shutdown immediate493pg_graphql-1.2.3> 2026-10-06 13:57:56.953 GMT [3348] LOG:  checkpoint complete: wrote 3 buffers (0.0%); 0 WAL file(s) added, 0 removed, 0 recycled; write=0.019 s, sync=0.003 s, total=0.041 s; sync files=2, longest=0.002 s, average=0.002 s; distance=0 kB, estimate=0 kB494pg_graphql-1.2.3> 2026-10-06 13:57:56.958 GMT [3347] LOG:  database system is shut down495pg_graphql-1.2.3>  done496pg_graphql-1.2.3> server stopped497pg_graphql-1.2.3>    Validating /build/tmp.YZZrpTL8gE/15/bin/pg_config498pg_graphql-1.2.3>  Initializing data directory at /build/tmp.YZZrpTL8gE/data-15499pg_graphql-1.2.3>        Using PgConfig("pg15") and `pg_config` from /build/tmp.YZZrpTL8gE/15/bin/pg_config500pg_graphql-1.2.3>     Building extension with features pg15501pg_graphql-1.2.3>      Running command "/nix/store/kmjm2xvp081ivprjgw95k94xmq1iswls-rust-default-1.70.0/bin/cargo" "build" "--release" "--features" "pg15" "--no-default-features" "--message-format=json-render-diagnostics" "--frozen" "-j" "2"502pg_graphql-1.2.3>     Finished release [optimized] target(s) in 0.12s503pg_graphql-1.2.3>   Installing extension504pg_graphql-1.2.3>      Copying control file to /build/tmp.YZZrpTL8gE/15/share/postgresql/extension/pg_graphql.control505pg_graphql-1.2.3>      Copying shared library to /build/tmp.YZZrpTL8gE/15/lib/pg_graphql.so506pg_graphql-1.2.3>  Discovering SQL entities507pg_graphql-1.2.3>   Discovered 5 SQL entities: 0 schemas (0 unique), 1 functions, 0 types, 0 enums, 4 sqls, 0 ords, 0 hashes, 0 aggregates, 0 triggers508pg_graphql-1.2.3>      Writing SQL entities to /build/tmp.YZZrpTL8gE/15/share/postgresql/extension/pg_graphql--1.2.3.sql509pg_graphql-1.2.3>     Finished installing pg_graphql510pg_graphql-1.2.3> ++ mktemp -d511pg_graphql-1.2.3> + TMPDIR=/build/tmp.dvJGRtX3oG512pg_graphql-1.2.3> + export PGDATA=/build/tmp.dvJGRtX3oG513pg_graphql-1.2.3> + PGDATA=/build/tmp.dvJGRtX3oG514pg_graphql-1.2.3> + export PGHOST=/build/tmp.dvJGRtX3oG515pg_graphql-1.2.3> + PGHOST=/build/tmp.dvJGRtX3oG516pg_graphql-1.2.3> + export PGUSER=postgres517pg_graphql-1.2.3> + PGUSER=postgres518pg_graphql-1.2.3> + export PGDATABASE=postgres519pg_graphql-1.2.3> + PGDATABASE=postgres520pg_graphql-1.2.3> + export PGTZ=UTC521pg_graphql-1.2.3> + PGTZ=UTC522pg_graphql-1.2.3> + export PG_COLOR=auto523pg_graphql-1.2.3> + PG_COLOR=auto524pg_graphql-1.2.3> + trap 'pg_ctl stop -m i' sigint sigterm exit525pg_graphql-1.2.3> + rm -rf ''526pg_graphql-1.2.3> + initdb --no-locale --encoding=UTF8 --nosync -U postgres527pg_graphql-1.2.3> The files belonging to this database system will be owned by user "nixbld".528pg_graphql-1.2.3> This user must also own the server process.529pg_graphql-1.2.3> 530pg_graphql-1.2.3> The database cluster will be initialized with locale "C".531pg_graphql-1.2.3> The default text search configuration will be set to "english".532pg_graphql-1.2.3> 533pg_graphql-1.2.3> Data page checksums are disabled.534pg_graphql-1.2.3> 535pg_graphql-1.2.3> fixing permissions on existing directory /build/tmp.dvJGRtX3oG ... ok536pg_graphql-1.2.3> creating subdirectories ... ok537pg_graphql-1.2.3> selecting dynamic shared memory implementation ... posix538pg_graphql-1.2.3> selecting default max_connections ... 100539pg_graphql-1.2.3> selecting default shared_buffers ... 128MB540pg_graphql-1.2.3> selecting default time zone ... UTC541pg_graphql-1.2.3> creating configuration files ... ok542pg_graphql-1.2.3> running bootstrap script ... ok543pg_graphql-1.2.3> performing post-bootstrap initialization ... ok544pg_graphql-1.2.3> 545pg_graphql-1.2.3> Sync to disk skipped.546pg_graphql-1.2.3> The data directory might become corrupt if the operating system crashes.547pg_graphql-1.2.3> 548pg_graphql-1.2.3> initdb: warning: enabling "trust" authentication for local connections549pg_graphql-1.2.3> initdb: hint: You can change this by editing pg_hba.conf or using the option -A, or --auth-local and --auth-host, the next time you run initdb.550pg_graphql-1.2.3> 551pg_graphql-1.2.3> Success. You can now start the database server using:552pg_graphql-1.2.3> 553pg_graphql-1.2.3>     /build/tmp.YZZrpTL8gE/15/bin/pg_ctl -D /build/tmp.dvJGRtX3oG -l logfile start554pg_graphql-1.2.3> 555pg_graphql-1.2.3> + pg_ctl start -o '-F -c listen_addresses="" -c log_min_messages=WARNING -k /build/tmp.dvJGRtX3oG'556pg_graphql-1.2.3> waiting for server to start....2026-10-06 13:58:16.344 UTC [3440] LOG:  starting PostgreSQL 15.19 on aarch64-unknown-linux-gnu, compiled by gcc (GCC) 15.2.0, 64-bit557pg_graphql-1.2.3> 2026-10-06 13:58:16.345 UTC [3440] LOG:  listening on Unix socket "/build/tmp.dvJGRtX3oG/.s.PGSQL.5432"558pg_graphql-1.2.3> 2026-10-06 13:58:16.346 UTC [3443] LOG:  database system was shut down at 2026-10-06 13:58:16 UTC559pg_graphql-1.2.3> 2026-10-06 13:58:16.350 UTC [3440] LOG:  database system is ready to accept connections560pg_graphql-1.2.3>  done561pg_graphql-1.2.3> server started562pg_graphql-1.2.3> + createdb contrib_regression563pg_graphql-1.2.3> + TESTDIR=test564pg_graphql-1.2.3> +++ pg_config --pgxs565pg_graphql-1.2.3> ++ dirname /nix/store/48l45fvi99n90x6p9i4cs1lmzby6cb73-postgresql-15.19/lib/pgxs/src/makefiles/pgxs.mk566pg_graphql-1.2.3> + PGXS=/nix/store/48l45fvi99n90x6p9i4cs1lmzby6cb73-postgresql-15.19/lib/pgxs/src/makefiles567pg_graphql-1.2.3> + REGRESS=/nix/store/48l45fvi99n90x6p9i4cs1lmzby6cb73-postgresql-15.19/lib/pgxs/src/makefiles/../test/regress/pg_regress568pg_graphql-1.2.3> ++ ls test/sql569pg_graphql-1.2.3> ++ sed -e 's/\..*$//'570pg_graphql-1.2.3> ++ sort571pg_graphql-1.2.3> + TESTS=$'aliases\nallow_camel_names\nbigint_is_string\nbuiltin_directives\ncomment_directive\ncomment_directive_description\nempty_mutations\nextend_type_with_function\nextend_type_with_function_relation\nextend_type_with_generated_column\nfilter_by_node_id\nfragment_on_mutation\nfragment_on_query\ninflection_fields\ninflection_function\ninflection_relationships\ninflection_types\nissue_163\nissue_170\nissue_225\nissue_300\nissue_306\nissue_312\nissue_334_ambiguous_function\nissue_339_function_return_json\nissue_339_function_return_table\nissue_373\nissue_377_enum_search_path\njson_is_stringified\nmax_page_size\nmax_rows_directive\nmulti_column_primary_key\nmultiple_mutations\nmultiple_queries\nmutation_delete\nmutation_delete_variable\nmutation_insert\nmutation_update\nnull_argument\nomit_exotic_types\nomit_weird_names\noperation_name\noverride_enum_name\noverride_field_name\noverride_func_field_name\noverride_relationship_field_name\noverride_type_name\npage_info\npermissions_connection_column\npermissions_node_column\npermissions_table_level\npermissions_types\nprimary_key_is_required\nrelationship_one_to_one\nresolve___schema\nresolve___type\nresolve___typename\nresolve_array_type\nresolve_connection_filter\nresolve_connection_named\nresolve_connection_order_by\nresolve_connection_pagination_args\nresolve_connection_to_conn\nresolve_connection_to_node\nresolve_error_connection_edge_no_field\nresolve_error_connection_edge_node_no_field\nresolve_error_connection_no_field\nresolve_error_from_parser\nresolve_error_mutation_no_field\nresolve_error_node_no_field\nresolve_error_query_no_field\nresolve_fragment\nresolve_graphiql_schema\nresolve_one\nroundtrip_types\nrow_level_security\nsqli_connection\nstring_filters\ntest_error_anon_and_named_operations\ntest_error_invalid_offset\ntest_error_multiple_anon_operations\ntest_error_mutation_transpilation\ntest_error_operation_name_not_found\ntest_error_operation_names_not_unique\ntest_error_parsing\ntest_error_query_transpilation\ntest_error_subscription\ntest_query__type\ntotal_count\ntype_bigfloat\ntype_modifier_max_length\ntype_opaque\nviews_integration'572pg_graphql-1.2.3> + psql -v ON_ERROR_STOP=1 -f test/fixtures.sql -d contrib_regression573pg_graphql-1.2.3> psql:test/fixtures.sql:1: NOTICE:  extension "pg_graphql" does not exist, skipping574pg_graphql-1.2.3> DROP EXTENSION575pg_graphql-1.2.3> CREATE EXTENSION576pg_graphql-1.2.3> COMMENT577pg_graphql-1.2.3> CREATE FUNCTION578pg_graphql-1.2.3> + /nix/store/48l45fvi99n90x6p9i4cs1lmzby6cb73-postgresql-15.19/lib/pgxs/src/makefiles/../test/regress/pg_regress --use-existing --dbname=contrib_regression --inputdir=test aliases allow_camel_names bigint_is_string builtin_directives comment_directive comment_directive_description empty_mutations extend_type_with_function extend_type_with_function_relation extend_type_with_generated_column filter_by_node_id fragment_on_mutation fragment_on_query inflection_fields inflection_function inflection_relationships inflection_types issue_163 issue_170 issue_225 issue_300 issue_306 issue_312 issue_334_ambiguous_function issue_339_function_return_json issue_339_function_return_table issue_373 issue_377_enum_search_path json_is_stringified max_page_size max_rows_directive multi_column_primary_key multiple_mutations multiple_queries mutation_delete mutation_delete_variable mutation_insert mutation_update null_argument omit_exotic_types omit_weird_names operation_name override_enum_name override_field_name override_func_field_name override_relationship_field_name override_type_name page_info permissions_connection_column permissions_node_column permissions_table_level permissions_types primary_key_is_required relationship_one_to_one resolve___schema resolve___type resolve___typename resolve_array_type resolve_connection_filter resolve_connection_named resolve_connection_order_by resolve_connection_pagination_args resolve_connection_to_conn resolve_connection_to_node resolve_error_connection_edge_no_field resolve_error_connection_edge_node_no_field resolve_error_connection_no_field resolve_error_from_parser resolve_error_mutation_no_field resolve_error_node_no_field resolve_error_query_no_field resolve_fragment resolve_graphiql_schema resolve_one roundtrip_types row_level_security sqli_connection string_filters test_error_anon_and_named_operations test_error_invalid_offset test_error_multiple_anon_operations test_error_mutation_transpilation test_error_operation_name_not_found test_error_operation_names_not_unique test_error_parsing test_error_query_transpilation test_error_subscription test_query__type total_count type_bigfloat type_modifier_max_length type_opaque views_integration579pg_graphql-1.2.3> (using postmaster on /build/tmp.dvJGRtX3oG, default port)580pg_graphql-1.2.3> ============== running regression test queries        ==============581pg_graphql-1.2.3> test aliases                      ... ok           67 ms582pg_graphql-1.2.3> test allow_camel_names            ... ok           69 ms583pg_graphql-1.2.3> test bigint_is_string             ... ok           64 ms584pg_graphql-1.2.3> test builtin_directives           ... ok           70 ms585pg_graphql-1.2.3> test comment_directive            ... ok            9 ms586pg_graphql-1.2.3> test comment_directive_description ... ok           56 ms587pg_graphql-1.2.3> test empty_mutations              ... ok           58 ms588pg_graphql-1.2.3> test extend_type_with_function    ... ok           61 ms589pg_graphql-1.2.3> test extend_type_with_function_relation ... ok          185 ms590pg_graphql-1.2.3> test extend_type_with_generated_column ... ok           59 ms591pg_graphql-1.2.3> test filter_by_node_id            ... ok           70 ms592pg_graphql-1.2.3> test fragment_on_mutation         ... ok           58 ms593pg_graphql-1.2.3> test fragment_on_query            ... ok           58 ms594pg_graphql-1.2.3> test inflection_fields            ... ok          164 ms595pg_graphql-1.2.3> test inflection_function          ... ok          165 ms596pg_graphql-1.2.3> test inflection_relationships     ... ok          243 ms597pg_graphql-1.2.3> test inflection_types             ... ok          165 ms598pg_graphql-1.2.3> test issue_163                    ... ok           59 ms599pg_graphql-1.2.3> test issue_170                    ... ok           59 ms600pg_graphql-1.2.3> test issue_225                    ... ok           65 ms601pg_graphql-1.2.3> test issue_300                    ... ok           61 ms602pg_graphql-1.2.3> test issue_306                    ... ok           64 ms603pg_graphql-1.2.3> test issue_312                    ... ok           59 ms604pg_graphql-1.2.3> test issue_334_ambiguous_function ... ok           61 ms605pg_graphql-1.2.3> test issue_339_function_return_json ... ok           59 ms606pg_graphql-1.2.3> test issue_339_function_return_table ... ok           57 ms607pg_graphql-1.2.3> test issue_373                    ... ok           62 ms608pg_graphql-1.2.3> test issue_377_enum_search_path   ... ok           96 ms609pg_graphql-1.2.3> test json_is_stringified          ... ok           63 ms610pg_graphql-1.2.3> test max_page_size                ... ok           58 ms611pg_graphql-1.2.3> test max_rows_directive           ... ok          131 ms612pg_graphql-1.2.3> test multi_column_primary_key     ... ok           72 ms613pg_graphql-1.2.3> test multiple_mutations           ... ok           62 ms614pg_graphql-1.2.3> test multiple_queries             ... ok           60 ms615pg_graphql-1.2.3> test mutation_delete              ... ok           71 ms616pg_graphql-1.2.3> test mutation_delete_variable     ... ok           61 ms617pg_graphql-1.2.3> test mutation_insert              ... ok           74 ms618pg_graphql-1.2.3> test mutation_update              ... ok           77 ms619pg_graphql-1.2.3> test null_argument                ... ok           60 ms620pg_graphql-1.2.3> test omit_exotic_types            ... ok           61 ms621pg_graphql-1.2.3> test omit_weird_names             ... ok           95 ms622pg_graphql-1.2.3> test operation_name               ... ok           60 ms623pg_graphql-1.2.3> test override_enum_name           ... ok           54 ms624pg_graphql-1.2.3> test override_field_name          ... ok           58 ms625pg_graphql-1.2.3> test override_func_field_name     ... ok           61 ms626pg_graphql-1.2.3> test override_relationship_field_name ... ok           62 ms627pg_graphql-1.2.3> test override_type_name           ... ok           57 ms628pg_graphql-1.2.3> test page_info                    ... ok           70 ms629pg_graphql-1.2.3> test permissions_connection_column ... ok          105 ms630pg_graphql-1.2.3> test permissions_node_column      ... ok          103 ms631pg_graphql-1.2.3> test permissions_table_level      ... ok          210 ms632pg_graphql-1.2.3> test permissions_types            ... ok          121 ms633pg_graphql-1.2.3> test primary_key_is_required      ... ok           94 ms634pg_graphql-1.2.3> test relationship_one_to_one      ... ok           64 ms635pg_graphql-1.2.3> test resolve___schema             ... ok           71 ms636pg_graphql-1.2.3> test resolve___type               ... ok           58 ms637pg_graphql-1.2.3> test resolve___typename           ... ok           62 ms638pg_graphql-1.2.3> test resolve_array_type           ... ok           62 ms639pg_graphql-1.2.3> test resolve_connection_filter    ... ok          106 ms640pg_graphql-1.2.3> test resolve_connection_named     ... ok           58 ms641pg_graphql-1.2.3> test resolve_connection_order_by  ... ok           86 ms642pg_graphql-1.2.3> test resolve_connection_pagination_args ... ok          117 ms643pg_graphql-1.2.3> test resolve_connection_to_conn   ... ok           65 ms644pg_graphql-1.2.3> test resolve_connection_to_node   ... ok           63 ms645pg_graphql-1.2.3> test resolve_error_connection_edge_no_field ... ok           57 ms646pg_graphql-1.2.3> test resolve_error_connection_edge_node_no_field ... ok           57 ms647pg_graphql-1.2.3> test resolve_error_connection_no_field ... ok           57 ms648pg_graphql-1.2.3> test resolve_error_from_parser    ... ok           11 ms649pg_graphql-1.2.3> test resolve_error_mutation_no_field ... ok           54 ms650pg_graphql-1.2.3> test resolve_error_node_no_field  ... ok           58 ms651pg_graphql-1.2.3> test resolve_error_query_no_field ... ok           52 ms652pg_graphql-1.2.3> test resolve_fragment             ... ok           63 ms653pg_graphql-1.2.3> test resolve_graphiql_schema      ... ok          100 ms654pg_graphql-1.2.3> test resolve_one                  ... ok          109 ms655pg_graphql-1.2.3> test roundtrip_types              ... ok           71 ms656pg_graphql-1.2.3> test row_level_security           ... ok           62 ms657pg_graphql-1.2.3> test sqli_connection              ... ok           70 ms658pg_graphql-1.2.3> test string_filters               ... ok           68 ms659pg_graphql-1.2.3> test test_error_anon_and_named_operations ... ok           51 ms660pg_graphql-1.2.3> test test_error_invalid_offset    ... ok           94 ms661pg_graphql-1.2.3> test test_error_multiple_anon_operations ... ok           51 ms662pg_graphql-1.2.3> test test_error_mutation_transpilation ... ok           58 ms663pg_graphql-1.2.3> test test_error_operation_name_not_found ... ok           53 ms664pg_graphql-1.2.3> test test_error_operation_names_not_unique ... ok           52 ms665pg_graphql-1.2.3> test test_error_parsing           ... ok           11 ms666pg_graphql-1.2.3> test test_error_query_transpilation ... ok           60 ms667pg_graphql-1.2.3> test test_error_subscription      ... ok           51 ms668pg_graphql-1.2.3> test test_query__type             ... ok           51 ms669pg_graphql-1.2.3> test total_count                  ... ok           94 ms670pg_graphql-1.2.3> test type_bigfloat                ... ok           61 ms671pg_graphql-1.2.3> test type_modifier_max_length     ... ok           61 ms672pg_graphql-1.2.3> test type_opaque                  ... ok           63 ms673pg_graphql-1.2.3> test views_integration            ... ok          222 ms674pg_graphql-1.2.3> 675pg_graphql-1.2.3> ======================676pg_graphql-1.2.3>  All 93 tests passed. 677pg_graphql-1.2.3> ======================678pg_graphql-1.2.3> 679pg_graphql-1.2.3> + pg_ctl stop -m i680pg_graphql-1.2.3> waiting for server to shut down....2026-10-06 13:58:23.713 UTC [3440] LOG:  received immediate shutdown request681pg_graphql-1.2.3> 2026-10-06 13:58:23.725 UTC [3440] LOG:  database system is shut down682pg_graphql-1.2.3>  done683pg_graphql-1.2.3> server stopped684pg_graphql-1.2.3> Running phase: installPhase685pg_graphql-1.2.3> Executing buildPgrxExtension install686pg_graphql-1.2.3> Running phase: fixupPhase687pg_graphql-1.2.3> shrinking RPATHs of ELF executables and libraries in /nix/store/rk3f93w1dpcpfwb9xv9jq1lmr23k50f5-pg_graphql-1.2.3688pg_graphql-1.2.3> shrinking /nix/store/rk3f93w1dpcpfwb9xv9jq1lmr23k50f5-pg_graphql-1.2.3/lib/pg_graphql-1.2.3.so689pg_graphql-1.2.3> checking for references to /build/ in /nix/store/rk3f93w1dpcpfwb9xv9jq1lmr23k50f5-pg_graphql-1.2.3...690pg_graphql-1.2.3> patching script interpreter paths in /nix/store/rk3f93w1dpcpfwb9xv9jq1lmr23k50f5-pg_graphql-1.2.3691pg_graphql-1.2.3> stripping (with command strip and flags -S -p) in  /nix/store/rk3f93w1dpcpfwb9xv9jq1lmr23k50f5-pg_graphql-1.2.3/lib692pg_graphql-1.2.3> stripping (with command strip and flags -s -p) in  /nix/store/rk3f93w1dpcpfwb9xv9jq1lmr23k50f5-pg_graphql-1.2.3/lib693building '/nix/store/mc1n2fml7avin2lrpgrd5cx7wjdb4gcg-pg_hashids-1.3.0-cd0e1b31d52b394a0df64079406a14a4f7387cd6.drv' on 'ssh-ng://nixbot-remote-build@78.232.36.247'694building '/nix/store/jsqjxdn4qp571nvc40r8xx103s9qb7c9-pg_hashids.drv' on 'ssh-ng://nixbot-remote-build@78.232.36.247'695building '/nix/store/jsqjxdn4qp571nvc40r8xx103s9qb7c9-pg_hashids.drv'696pg_hashids> created 14 symlinks in user environment697pg_hashids> +++++ ls -A /nix/store/mbgwhlxz2jnmrdjfyahrs4mall3mzh1x-pg_hashids/lib/pg_hashids-1.2.1.so /nix/store/mbgwhlxz2jnmrdjfyahrs4mall3mzh1x-pg_hashids/lib/pg_hashids-1.3.0-cd0e1b31d52b394a0df64079406a14a4f7387cd6.so /nix/store/mbgwhlxz2jnmrdjfyahrs4mall3mzh1x-pg_hashids/lib/pg_hashids.so698pg_hashids> +++++ wc -l699pg_hashids> ++++ test 3 = 3700building '/nix/store/0n0iaya9csx9by2pimrx1yglzw8dp4zs-pg_net-0.13.0.drv' on 'ssh-ng://nixbot-remote-build@78.232.36.247'701building '/nix/store/0n0iaya9csx9by2pimrx1yglzw8dp4zs-pg_net-0.13.0.drv'702pg_net-0.13.0> Running phase: unpackPhase703pg_net-0.13.0> unpacking source archive /nix/store/bxdzbzjn4yi7ch55dlcgzk6npzx2p4jz-source704pg_net-0.13.0> source root is source705pg_net-0.13.0> Running phase: patchPhase706pg_net-0.13.0> Running phase: updateAutotoolsGnuConfigScriptsPhase707pg_net-0.13.0> Running phase: configurePhase708pg_net-0.13.0> no configure script, doing nothing709pg_net-0.13.0> Running phase: buildPhase710pg_net-0.13.0> gcc -Wall -Wmissing-prototypes -Wpointer-arith -Wdeclaration-after-statement -Werror=vla -Wendif-labels -Wmissing-format-attribute -Wimplicit-fallthrough=3 -Wcast-function-type -Wformat-security -fno-strict-aliasing -fwrapv -fexcess-precision=standard -Wno-deprecated-non-prototype -Wno-format-truncation -Wno-stringop-truncation -g -O2 -std=gnu17 -std=c11 -Werror -Wno-declaration-after-statement -fPIC  -DEXTVERSION=\"0.13.0\" -I. -I./ -I/nix/store/48l45fvi99n90x6p9i4cs1lmzby6cb73-postgresql-15.19/include/server -I/nix/store/48l45fvi99n90x6p9i4cs1lmzby6cb73-postgresql-15.19/include/internal -D_GNU_SOURCE  -I/nix/store/p17klc3qq4nl9ihfwqfpi8cnqvcf92xz-libxml2-2.15.1-dev/include/libxml2 -I/nix/store/mglbi4dy4kpx7v1dcgf6iincp5x38hsc-lz4-1.10.0-dev/include -I/nix/store/g41q9md9rdcr3lkydi6f8zd6fza3h1q4-zstd-1.5.7-dev/include -I/nix/store/n2vnr7ycfk6midbzxcwd28qj3bgb50cz-icu4c-75.1-dev/include  -c -o src/worker.o src/worker.c711pg_net-0.13.0> gcc -Wall -Wmissing-prototypes -Wpointer-arith -Wdeclaration-after-statement -Werror=vla -Wendif-labels -Wmissing-format-attribute -Wimplicit-fallthrough=3 -Wcast-function-type -Wformat-security -fno-strict-aliasing -fwrapv -fexcess-precision=standard -Wno-deprecated-non-prototype -Wno-format-truncation -Wno-stringop-truncation -g -O2 -std=gnu17 -std=c11 -Werror -Wno-declaration-after-statement -fPIC  -DEXTVERSION=\"0.13.0\" -I. -I./ -I/nix/store/48l45fvi99n90x6p9i4cs1lmzby6cb73-postgresql-15.19/include/server -I/nix/store/48l45fvi99n90x6p9i4cs1lmzby6cb73-postgresql-15.19/include/internal -D_GNU_SOURCE  -I/nix/store/p17klc3qq4nl9ihfwqfpi8cnqvcf92xz-libxml2-2.15.1-dev/include/libxml2 -I/nix/store/mglbi4dy4kpx7v1dcgf6iincp5x38hsc-lz4-1.10.0-dev/include -I/nix/store/g41q9md9rdcr3lkydi6f8zd6fza3h1q4-zstd-1.5.7-dev/include -I/nix/store/n2vnr7ycfk6midbzxcwd28qj3bgb50cz-icu4c-75.1-dev/include  -c -o src/util.o src/util.c712pg_net-0.13.0> gcc -Wall -Wmissing-prototypes -Wpointer-arith -Wdeclaration-after-statement -Werror=vla -Wendif-labels -Wmissing-format-attribute -Wimplicit-fallthrough=3 -Wcast-function-type -Wformat-security -fno-strict-aliasing -fwrapv -fexcess-precision=standard -Wno-deprecated-non-prototype -Wno-format-truncation -Wno-stringop-truncation -g -O2 -std=gnu17 -std=c11 -Werror -Wno-declaration-after-statement -fPIC  -DEXTVERSION=\"0.13.0\" -I. -I./ -I/nix/store/48l45fvi99n90x6p9i4cs1lmzby6cb73-postgresql-15.19/include/server -I/nix/store/48l45fvi99n90x6p9i4cs1lmzby6cb73-postgresql-15.19/include/internal -D_GNU_SOURCE  -I/nix/store/p17klc3qq4nl9ihfwqfpi8cnqvcf92xz-libxml2-2.15.1-dev/include/libxml2 -I/nix/store/mglbi4dy4kpx7v1dcgf6iincp5x38hsc-lz4-1.10.0-dev/include -I/nix/store/g41q9md9rdcr3lkydi6f8zd6fza3h1q4-zstd-1.5.7-dev/include -I/nix/store/n2vnr7ycfk6midbzxcwd28qj3bgb50cz-icu4c-75.1-dev/include  -c -o src/core.o src/core.c713pg_net-0.13.0> In file included from src/core.c:23:714pg_net-0.13.0> In function 'init_curl_handle',715pg_net-0.13.0>     inlined from 'consume_request_queue' at src/core.c:273:5:716pg_net-0.13.0> src/util.h:6:11: warning: call to 'Wcurl_easy_setopt_err_long' declared with attribute warning: curl_easy_setopt expects a long argument [-Wattribute-warning]717pg_net-0.13.0>     6 |       if (curl_easy_setopt(hdl, opt, prm) != CURLE_OK) \718pg_net-0.13.0>       |           ^~~~~~~~~~~~~~~~719pg_net-0.13.0> src/core.c:94:7: note: in expansion of macro 'CURL_EZ_SETOPT'720pg_net-0.13.0>    94 |       CURL_EZ_SETOPT(curl_ez_handle, CURLOPT_POST, 1);721pg_net-0.13.0>       |       ^~~~~~~~~~~~~~722pg_net-0.13.0> src/util.h:6:11: warning: call to 'Wcurl_easy_setopt_err_long' declared with attribute warning: curl_easy_setopt expects a long argument [-Wattribute-warning]723pg_net-0.13.0>     6 |       if (curl_easy_setopt(hdl, opt, prm) != CURLE_OK) \724pg_net-0.13.0>       |           ^~~~~~~~~~~~~~~~725pg_net-0.13.0> src/core.c:95:7: note: in expansion of macro 'CURL_EZ_SETOPT'726pg_net-0.13.0>    95 |       CURL_EZ_SETOPT(curl_ez_handle, CURLOPT_POSTFIELDSIZE, 0);727pg_net-0.13.0>       |       ^~~~~~~~~~~~~~728pg_net-0.13.0> src/util.h:6:11: warning: call to 'Wcurl_easy_setopt_err_long' declared with attribute warning: curl_easy_setopt expects a long argument [-Wattribute-warning]729pg_net-0.13.0>     6 |       if (curl_easy_setopt(hdl, opt, prm) != CURLE_OK) \730pg_net-0.13.0>       |           ^~~~~~~~~~~~~~~~731pg_net-0.13.0> src/core.c:108:3: note: in expansion of macro 'CURL_EZ_SETOPT'732pg_net-0.13.0>   108 |   CURL_EZ_SETOPT(curl_ez_handle, CURLOPT_TIMEOUT_MS, timeout_milliseconds);733pg_net-0.13.0>       |   ^~~~~~~~~~~~~~734pg_net-0.13.0> src/util.h:6:11: warning: call to 'Wcurl_easy_setopt_err_long' declared with attribute warning: curl_easy_setopt expects a long argument [-Wattribute-warning]735pg_net-0.13.0>     6 |       if (curl_easy_setopt(hdl, opt, prm) != CURLE_OK) \736pg_net-0.13.0>       |           ^~~~~~~~~~~~~~~~737pg_net-0.13.0> src/core.c:110:3: note: in expansion of macro 'CURL_EZ_SETOPT'738pg_net-0.13.0>   110 |   CURL_EZ_SETOPT(curl_ez_handle, CURLOPT_FOLLOWLOCATION, true);739pg_net-0.13.0>       |   ^~~~~~~~~~~~~~740pg_net-0.13.0> gcc -Wall -Wmissing-prototypes -Wpointer-arith -Wdeclaration-after-statement -Werror=vla -Wendif-labels -Wmissing-format-attribute -Wimplicit-fallthrough=3 -Wcast-function-type -Wformat-security -fno-strict-aliasing -fwrapv -fexcess-precision=standard -Wno-deprecated-non-prototype -Wno-format-truncation -Wno-stringop-truncation -g -O2 -std=gnu17 -std=c11 -Werror -Wno-declaration-after-statement -fPIC  -DEXTVERSION=\"0.13.0\" -I. -I./ -I/nix/store/48l45fvi99n90x6p9i4cs1lmzby6cb73-postgresql-15.19/include/server -I/nix/store/48l45fvi99n90x6p9i4cs1lmzby6cb73-postgresql-15.19/include/internal -D_GNU_SOURCE  -I/nix/store/p17klc3qq4nl9ihfwqfpi8cnqvcf92xz-libxml2-2.15.1-dev/include/libxml2 -I/nix/store/mglbi4dy4kpx7v1dcgf6iincp5x38hsc-lz4-1.10.0-dev/include -I/nix/store/g41q9md9rdcr3lkydi6f8zd6fza3h1q4-zstd-1.5.7-dev/include -I/nix/store/n2vnr7ycfk6midbzxcwd28qj3bgb50cz-icu4c-75.1-dev/include  -c -o src/event.o src/event.c741pg_net-0.13.0> In file included from /nix/store/jviasb44hibgh09829gbmbssbz2jjnhz-curl-8.17.0-dev/include/curl/curl.h:3333,742pg_net-0.13.0>                  from /nix/store/jviasb44hibgh09829gbmbssbz2jjnhz-curl-8.17.0-dev/include/curl/multi.h:51,743pg_net-0.13.0>                  from src/event.h:4,744pg_net-0.13.0>                  from src/event.c:6:745pg_net-0.13.0> /nix/store/jviasb44hibgh09829gbmbssbz2jjnhz-curl-8.17.0-dev/include/curl/multi.h:429:23: error: expected identifier or '(' before '__extension__'746pg_net-0.13.0>   429 | CURL_EXTERN CURLMcode curl_multi_setopt(CURLM *multi_handle,747pg_net-0.13.0>       |                       ^~~~~~~~~~~~~~~~~748pg_net-0.13.0> /nix/store/jviasb44hibgh09829gbmbssbz2jjnhz-curl-8.17.0-dev/include/curl/multi.h:429:23: error: expected identifier or '(' before ')' token749pg_net-0.13.0>   429 | CURL_EXTERN CURLMcode curl_multi_setopt(CURLM *multi_handle,750pg_net-0.13.0>       |                       ^~~~~~~~~~~~~~~~~751pg_net-0.13.0> make: *** [<builtin>: src/event.o] Error 1752error: build of '/nix/store/0n0iaya9csx9by2pimrx1yglzw8dp4zs-pg_net-0.13.0.drv' on 'ssh-ng://nixbot-remote-build@78.232.36.247' failed: Cannot build '/nix/store/0n0iaya9csx9by2pimrx1yglzw8dp4zs-pg_net-0.13.0.drv'.753       Reason: builder failed with exit code 2.754       Output paths:755         /nix/store/14dkr1mhbrh869r2k75r03ngw6q7c4ma-pg_net-0.13.0756       Last 25 log lines:757       >       |       ^~~~~~~~~~~~~~758       > src/util.h:6:11: warning: call to 'Wcurl_easy_setopt_err_long' declared with attribute warning: curl_easy_setopt expects a long argument [-Wattribute-warning]759       >     6 |       if (curl_easy_setopt(hdl, opt, prm) != CURLE_OK) \760       >       |           ^~~~~~~~~~~~~~~~761       > src/core.c:108:3: note: in expansion of macro 'CURL_EZ_SETOPT'762       >   108 |   CURL_EZ_SETOPT(curl_ez_handle, CURLOPT_TIMEOUT_MS, timeout_milliseconds);763       >       |   ^~~~~~~~~~~~~~764       > src/util.h:6:11: warning: call to 'Wcurl_easy_setopt_err_long' declared with attribute warning: curl_easy_setopt expects a long argument [-Wattribute-warning]765       >     6 |       if (curl_easy_setopt(hdl, opt, prm) != CURLE_OK) \766       >       |           ^~~~~~~~~~~~~~~~767       > src/core.c:110:3: note: in expansion of macro 'CURL_EZ_SETOPT'768       >   110 |   CURL_EZ_SETOPT(curl_ez_handle, CURLOPT_FOLLOWLOCATION, true);769       >       |   ^~~~~~~~~~~~~~770       > gcc -Wall -Wmissing-prototypes -Wpointer-arith -Wdeclaration-after-statement -Werror=vla -Wendif-labels -Wmissing-format-attribute -Wimplicit-fallthrough=3 -Wcast-function-type -Wformat-security -fno-strict-aliasing -fwrapv -fexcess-precision=standard -Wno-deprecated-non-prototype -Wno-format-truncation -Wno-stringop-truncation -g -O2 -std=gnu17 -std=c11 -Werror -Wno-declaration-after-statement -fPIC  -DEXTVERSION=\"0.13.0\" -I. -I./ -I/nix/store/48l45fvi99n90x6p9i4cs1lmzby6cb73-postgresql-15.19/include/server -I/nix/store/48l45fvi99n90x6p9i4cs1lmzby6cb73-postgresql-15.19/include/internal -D_GNU_SOURCE  -I/nix/store/p17klc3qq4nl9ihfwqfpi8cnqvcf92xz-libxml2-2.15.1-dev/include/libxml2 -I/nix/store/mglbi4dy4kpx7v1dcgf6iincp5x38hsc-lz4-1.10.0-dev/include -I/nix/store/g41q9md9rdcr3lkydi6f8zd6fza3h1q4-zstd-1.5.7-dev/include -I/nix/store/n2vnr7ycfk6midbzxcwd28qj3bgb50cz-icu4c-75.1-dev/include  -c -o src/event.o src/event.c771       > In file included from /nix/store/jviasb44hibgh09829gbmbssbz2jjnhz-curl-8.17.0-dev/include/curl/curl.h:3333,772       >                  from /nix/store/jviasb44hibgh09829gbmbssbz2jjnhz-curl-8.17.0-dev/include/curl/multi.h:51,773       >                  from src/event.h:4,774       >                  from src/event.c:6:775       > /nix/store/jviasb44hibgh09829gbmbssbz2jjnhz-curl-8.17.0-dev/include/curl/multi.h:429:23: error: expected identifier or '(' before '__extension__'776       >   429 | CURL_EXTERN CURLMcode curl_multi_setopt(CURLM *multi_handle,777       >       |                       ^~~~~~~~~~~~~~~~~778       > /nix/store/jviasb44hibgh09829gbmbssbz2jjnhz-curl-8.17.0-dev/include/curl/multi.h:429:23: error: expected identifier or '(' before ')' token779       >   429 | CURL_EXTERN CURLMcode curl_multi_setopt(CURLM *multi_handle,780       >       |                       ^~~~~~~~~~~~~~~~~781       > make: *** [<builtin>: src/event.o] Error 1782       For full logs, run:783         nix log /nix/store/0n0iaya9csx9by2pimrx1yglzw8dp4zs-pg_net-0.13.0.drv784error: Cannot build '/nix/store/0n0iaya9csx9by2pimrx1yglzw8dp4zs-pg_net-0.13.0.drv'.785       Reason: builder failed with exit code 1.786       Output paths:787         /nix/store/14dkr1mhbrh869r2k75r03ngw6q7c4ma-pg_net-0.13.0788building '/nix/store/cfrc2vk3cgabx1447j2n7s3zxraq6395-pg_net-0.14.0.drv' on 'ssh-ng://nixbot-remote-build@78.232.36.247'789building '/nix/store/cfrc2vk3cgabx1447j2n7s3zxraq6395-pg_net-0.14.0.drv'790pg_net-0.14.0> Running phase: unpackPhase791pg_net-0.14.0> unpacking source archive /nix/store/cijlkfxy6vfh6pbq2nd4v8pc51nxn75y-source792pg_net-0.14.0> source root is source793pg_net-0.14.0> Running phase: patchPhase794pg_net-0.14.0> Running phase: updateAutotoolsGnuConfigScriptsPhase795pg_net-0.14.0> Running phase: configurePhase796pg_net-0.14.0> no configure script, doing nothing797pg_net-0.14.0> Running phase: buildPhase798pg_net-0.14.0> gcc -Wall -Wmissing-prototypes -Wpointer-arith -Wdeclaration-after-statement -Werror=vla -Wendif-labels -Wmissing-format-attribute -Wimplicit-fallthrough=3 -Wcast-function-type -Wformat-security -fno-strict-aliasing -fwrapv -fexcess-precision=standard -Wno-deprecated-non-prototype -Wno-format-truncation -Wno-stringop-truncation -g -O2 -std=gnu17 -std=c11 -Werror -Wno-declaration-after-statement -fPIC  -DEXTVERSION=\"0.14.0\" -I. -I./ -I/nix/store/48l45fvi99n90x6p9i4cs1lmzby6cb73-postgresql-15.19/include/server -I/nix/store/48l45fvi99n90x6p9i4cs1lmzby6cb73-postgresql-15.19/include/internal -D_GNU_SOURCE  -I/nix/store/p17klc3qq4nl9ihfwqfpi8cnqvcf92xz-libxml2-2.15.1-dev/include/libxml2 -I/nix/store/mglbi4dy4kpx7v1dcgf6iincp5x38hsc-lz4-1.10.0-dev/include -I/nix/store/g41q9md9rdcr3lkydi6f8zd6fza3h1q4-zstd-1.5.7-dev/include -I/nix/store/n2vnr7ycfk6midbzxcwd28qj3bgb50cz-icu4c-75.1-dev/include  -c -o src/core.o src/core.c799pg_net-0.14.0> In file included from src/core.c:23:800pg_net-0.14.0> In function 'init_curl_handle',801pg_net-0.14.0>     inlined from 'consume_request_queue' at src/core.c:306:5:802pg_net-0.14.0> src/errors.h:6:11: warning: call to 'Wcurl_easy_setopt_err_long' declared with attribute warning: curl_easy_setopt expects a long argument [-Wattribute-warning]803pg_net-0.14.0>     6 |       if (curl_easy_setopt(hdl, opt, prm) != CURLE_OK) \804pg_net-0.14.0>       |           ^~~~~~~~~~~~~~~~805pg_net-0.14.0> src/core.c:120:7: note: in expansion of macro 'EREPORT_CURL_SETOPT'806pg_net-0.14.0>   120 |       EREPORT_CURL_SETOPT(curl_ez_handle, CURLOPT_POST, 1);807pg_net-0.14.0>       |       ^~~~~~~~~~~~~~~~~~~808pg_net-0.14.0> src/errors.h:6:11: warning: call to 'Wcurl_easy_setopt_err_long' declared with attribute warning: curl_easy_setopt expects a long argument [-Wattribute-warning]809pg_net-0.14.0>     6 |       if (curl_easy_setopt(hdl, opt, prm) != CURLE_OK) \810pg_net-0.14.0>       |           ^~~~~~~~~~~~~~~~811pg_net-0.14.0> src/core.c:121:7: note: in expansion of macro 'EREPORT_CURL_SETOPT'812pg_net-0.14.0>   121 |       EREPORT_CURL_SETOPT(curl_ez_handle, CURLOPT_POSTFIELDSIZE, 0);813pg_net-0.14.0>       |       ^~~~~~~~~~~~~~~~~~~814pg_net-0.14.0> src/errors.h:6:11: warning: call to 'Wcurl_easy_setopt_err_long' declared with attribute warning: curl_easy_setopt expects a long argument [-Wattribute-warning]815pg_net-0.14.0>     6 |       if (curl_easy_setopt(hdl, opt, prm) != CURLE_OK) \816pg_net-0.14.0>       |           ^~~~~~~~~~~~~~~~817pg_net-0.14.0> src/core.c:134:3: note: in expansion of macro 'EREPORT_CURL_SETOPT'818pg_net-0.14.0>   134 |   EREPORT_CURL_SETOPT(curl_ez_handle, CURLOPT_TIMEOUT_MS, cdata->timeout_milliseconds);819pg_net-0.14.0>       |   ^~~~~~~~~~~~~~~~~~~820pg_net-0.14.0> src/errors.h:6:11: warning: call to 'Wcurl_easy_setopt_err_long' declared with attribute warning: curl_easy_setopt expects a long argument [-Wattribute-warning]821pg_net-0.14.0>     6 |       if (curl_easy_setopt(hdl, opt, prm) != CURLE_OK) \822pg_net-0.14.0>       |           ^~~~~~~~~~~~~~~~823pg_net-0.14.0> src/core.c:136:3: note: in expansion of macro 'EREPORT_CURL_SETOPT'824pg_net-0.14.0>   136 |   EREPORT_CURL_SETOPT(curl_ez_handle, CURLOPT_FOLLOWLOCATION, true);825pg_net-0.14.0>       |   ^~~~~~~~~~~~~~~~~~~826pg_net-0.14.0> gcc -Wall -Wmissing-prototypes -Wpointer-arith -Wdeclaration-after-statement -Werror=vla -Wendif-labels -Wmissing-format-attribute -Wimplicit-fallthrough=3 -Wcast-function-type -Wformat-security -fno-strict-aliasing -fwrapv -fexcess-precision=standard -Wno-deprecated-non-prototype -Wno-format-truncation -Wno-stringop-truncation -g -O2 -std=gnu17 -std=c11 -Werror -Wno-declaration-after-statement -fPIC  -DEXTVERSION=\"0.14.0\" -I. -I./ -I/nix/store/48l45fvi99n90x6p9i4cs1lmzby6cb73-postgresql-15.19/include/server -I/nix/store/48l45fvi99n90x6p9i4cs1lmzby6cb73-postgresql-15.19/include/internal -D_GNU_SOURCE  -I/nix/store/p17klc3qq4nl9ihfwqfpi8cnqvcf92xz-libxml2-2.15.1-dev/include/libxml2 -I/nix/store/mglbi4dy4kpx7v1dcgf6iincp5x38hsc-lz4-1.10.0-dev/include -I/nix/store/g41q9md9rdcr3lkydi6f8zd6fza3h1q4-zstd-1.5.7-dev/include -I/nix/store/n2vnr7ycfk6midbzxcwd28qj3bgb50cz-icu4c-75.1-dev/include  -c -o src/errors.o src/errors.c827pg_net-0.14.0> gcc -Wall -Wmissing-prototypes -Wpointer-arith -Wdeclaration-after-statement -Werror=vla -Wendif-labels -Wmissing-format-attribute -Wimplicit-fallthrough=3 -Wcast-function-type -Wformat-security -fno-strict-aliasing -fwrapv -fexcess-precision=standard -Wno-deprecated-non-prototype -Wno-format-truncation -Wno-stringop-truncation -g -O2 -std=gnu17 -std=c11 -Werror -Wno-declaration-after-statement -fPIC  -DEXTVERSION=\"0.14.0\" -I. -I./ -I/nix/store/48l45fvi99n90x6p9i4cs1lmzby6cb73-postgresql-15.19/include/server -I/nix/store/48l45fvi99n90x6p9i4cs1lmzby6cb73-postgresql-15.19/include/internal -D_GNU_SOURCE  -I/nix/store/p17klc3qq4nl9ihfwqfpi8cnqvcf92xz-libxml2-2.15.1-dev/include/libxml2 -I/nix/store/mglbi4dy4kpx7v1dcgf6iincp5x38hsc-lz4-1.10.0-dev/include -I/nix/store/g41q9md9rdcr3lkydi6f8zd6fza3h1q4-zstd-1.5.7-dev/include -I/nix/store/n2vnr7ycfk6midbzxcwd28qj3bgb50cz-icu4c-75.1-dev/include  -c -o src/event.o src/event.c828pg_net-0.14.0> In file included from /nix/store/jviasb44hibgh09829gbmbssbz2jjnhz-curl-8.17.0-dev/include/curl/curl.h:3333,829pg_net-0.14.0>                  from /nix/store/jviasb44hibgh09829gbmbssbz2jjnhz-curl-8.17.0-dev/include/curl/multi.h:51,830pg_net-0.14.0>                  from src/event.h:4,831pg_net-0.14.0>                  from src/event.c:6:832pg_net-0.14.0> /nix/store/jviasb44hibgh09829gbmbssbz2jjnhz-curl-8.17.0-dev/include/curl/multi.h:429:23: error: expected identifier or '(' before '__extension__'833pg_net-0.14.0>   429 | CURL_EXTERN CURLMcode curl_multi_setopt(CURLM *multi_handle,834pg_net-0.14.0>       |                       ^~~~~~~~~~~~~~~~~835pg_net-0.14.0> /nix/store/jviasb44hibgh09829gbmbssbz2jjnhz-curl-8.17.0-dev/include/curl/multi.h:429:23: error: expected identifier or '(' before ')' token836pg_net-0.14.0>   429 | CURL_EXTERN CURLMcode curl_multi_setopt(CURLM *multi_handle,837pg_net-0.14.0>       |                       ^~~~~~~~~~~~~~~~~838pg_net-0.14.0> make: *** [<builtin>: src/event.o] Error 1839error: build of '/nix/store/cfrc2vk3cgabx1447j2n7s3zxraq6395-pg_net-0.14.0.drv' on 'ssh-ng://nixbot-remote-build@78.232.36.247' failed: Cannot build '/nix/store/cfrc2vk3cgabx1447j2n7s3zxraq6395-pg_net-0.14.0.drv'.840       Reason: builder failed with exit code 2.841       Output paths:842         /nix/store/m4c4b79prkz8x60agzy6dy9bn0cdcy0d-pg_net-0.14.0843       Last 25 log lines:844       > src/errors.h:6:11: warning: call to 'Wcurl_easy_setopt_err_long' declared with attribute warning: curl_easy_setopt expects a long argument [-Wattribute-warning]845       >     6 |       if (curl_easy_setopt(hdl, opt, prm) != CURLE_OK) \846       >       |           ^~~~~~~~~~~~~~~~847       > src/core.c:134:3: note: in expansion of macro 'EREPORT_CURL_SETOPT'848       >   134 |   EREPORT_CURL_SETOPT(curl_ez_handle, CURLOPT_TIMEOUT_MS, cdata->timeout_milliseconds);849       >       |   ^~~~~~~~~~~~~~~~~~~850       > src/errors.h:6:11: warning: call to 'Wcurl_easy_setopt_err_long' declared with attribute warning: curl_easy_setopt expects a long argument [-Wattribute-warning]851       >     6 |       if (curl_easy_setopt(hdl, opt, prm) != CURLE_OK) \852       >       |           ^~~~~~~~~~~~~~~~853       > src/core.c:136:3: note: in expansion of macro 'EREPORT_CURL_SETOPT'854       >   136 |   EREPORT_CURL_SETOPT(curl_ez_handle, CURLOPT_FOLLOWLOCATION, true);855       >       |   ^~~~~~~~~~~~~~~~~~~856       > gcc -Wall -Wmissing-prototypes -Wpointer-arith -Wdeclaration-after-statement -Werror=vla -Wendif-labels -Wmissing-format-attribute -Wimplicit-fallthrough=3 -Wcast-function-type -Wformat-security -fno-strict-aliasing -fwrapv -fexcess-precision=standard -Wno-deprecated-non-prototype -Wno-format-truncation -Wno-stringop-truncation -g -O2 -std=gnu17 -std=c11 -Werror -Wno-declaration-after-statement -fPIC  -DEXTVERSION=\"0.14.0\" -I. -I./ -I/nix/store/48l45fvi99n90x6p9i4cs1lmzby6cb73-postgresql-15.19/include/server -I/nix/store/48l45fvi99n90x6p9i4cs1lmzby6cb73-postgresql-15.19/include/internal -D_GNU_SOURCE  -I/nix/store/p17klc3qq4nl9ihfwqfpi8cnqvcf92xz-libxml2-2.15.1-dev/include/libxml2 -I/nix/store/mglbi4dy4kpx7v1dcgf6iincp5x38hsc-lz4-1.10.0-dev/include -I/nix/store/g41q9md9rdcr3lkydi6f8zd6fza3h1q4-zstd-1.5.7-dev/include -I/nix/store/n2vnr7ycfk6midbzxcwd28qj3bgb50cz-icu4c-75.1-dev/include  -c -o src/errors.o src/errors.c857       > gcc -Wall -Wmissing-prototypes -Wpointer-arith -Wdeclaration-after-statement -Werror=vla -Wendif-labels -Wmissing-format-attribute -Wimplicit-fallthrough=3 -Wcast-function-type -Wformat-security -fno-strict-aliasing -fwrapv -fexcess-precision=standard -Wno-deprecated-non-prototype -Wno-format-truncation -Wno-stringop-truncation -g -O2 -std=gnu17 -std=c11 -Werror -Wno-declaration-after-statement -fPIC  -DEXTVERSION=\"0.14.0\" -I. -I./ -I/nix/store/48l45fvi99n90x6p9i4cs1lmzby6cb73-postgresql-15.19/include/server -I/nix/store/48l45fvi99n90x6p9i4cs1lmzby6cb73-postgresql-15.19/include/internal -D_GNU_SOURCE  -I/nix/store/p17klc3qq4nl9ihfwqfpi8cnqvcf92xz-libxml2-2.15.1-dev/include/libxml2 -I/nix/store/mglbi4dy4kpx7v1dcgf6iincp5x38hsc-lz4-1.10.0-dev/include -I/nix/store/g41q9md9rdcr3lkydi6f8zd6fza3h1q4-zstd-1.5.7-dev/include -I/nix/store/n2vnr7ycfk6midbzxcwd28qj3bgb50cz-icu4c-75.1-dev/include  -c -o src/event.o src/event.c858       > In file included from /nix/store/jviasb44hibgh09829gbmbssbz2jjnhz-curl-8.17.0-dev/include/curl/curl.h:3333,859       >                  from /nix/store/jviasb44hibgh09829gbmbssbz2jjnhz-curl-8.17.0-dev/include/curl/multi.h:51,860       >                  from src/event.h:4,861       >                  from src/event.c:6:862       > /nix/store/jviasb44hibgh09829gbmbssbz2jjnhz-curl-8.17.0-dev/include/curl/multi.h:429:23: error: expected identifier or '(' before '__extension__'863       >   429 | CURL_EXTERN CURLMcode curl_multi_setopt(CURLM *multi_handle,864       >       |                       ^~~~~~~~~~~~~~~~~865       > /nix/store/jviasb44hibgh09829gbmbssbz2jjnhz-curl-8.17.0-dev/include/curl/multi.h:429:23: error: expected identifier or '(' before ')' token866       >   429 | CURL_EXTERN CURLMcode curl_multi_setopt(CURLM *multi_handle,867       >       |                       ^~~~~~~~~~~~~~~~~868       > make: *** [<builtin>: src/event.o] Error 1869       For full logs, run:870         nix log /nix/store/cfrc2vk3cgabx1447j2n7s3zxraq6395-pg_net-0.14.0.drv871error: Cannot build '/nix/store/cfrc2vk3cgabx1447j2n7s3zxraq6395-pg_net-0.14.0.drv'.872       Reason: builder failed with exit code 1.873       Output paths:874         /nix/store/m4c4b79prkz8x60agzy6dy9bn0cdcy0d-pg_net-0.14.0875building '/nix/store/7iq4z475k625nsn9wc9nf4vxa7x1f1qd-pg_net-0.19.5.drv' on 'ssh-ng://nixbot-remote-build@78.232.36.247'876building '/nix/store/7iq4z475k625nsn9wc9nf4vxa7x1f1qd-pg_net-0.19.5.drv'877pg_net-0.19.5> Running phase: unpackPhase878pg_net-0.19.5> unpacking source archive /nix/store/5zgdqy3bz93jyn79pizxc1hks0cdcadw-source879pg_net-0.19.5> source root is source880pg_net-0.19.5> Running phase: patchPhase881pg_net-0.19.5> Running phase: updateAutotoolsGnuConfigScriptsPhase882pg_net-0.19.5> Running phase: configurePhase883pg_net-0.19.5> no configure script, doing nothing884pg_net-0.19.5> Running phase: buildPhase885pg_net-0.19.5> gcc -Wall -Wmissing-prototypes -Wpointer-arith -Wdeclaration-after-statement -Werror=vla -Wendif-labels -Wmissing-format-attribute -Wimplicit-fallthrough=3 -Wcast-function-type -Wformat-security -fno-strict-aliasing -fwrapv -fexcess-precision=standard -Wno-deprecated-non-prototype -Wno-format-truncation -Wno-stringop-truncation -g -O2 -std=gnu17 -std=c11 -Wextra -Wall -Werror -Wno-declaration-after-statement -Wno-vla -Wno-long-long -Wmissing-variable-declarations -fPIC  -DEXTVERSION=\"0.19.5\" -I. -I./ -I/nix/store/48l45fvi99n90x6p9i4cs1lmzby6cb73-postgresql-15.19/include/server -I/nix/store/48l45fvi99n90x6p9i4cs1lmzby6cb73-postgresql-15.19/include/internal -D_GNU_SOURCE  -I/nix/store/p17klc3qq4nl9ihfwqfpi8cnqvcf92xz-libxml2-2.15.1-dev/include/libxml2 -I/nix/store/mglbi4dy4kpx7v1dcgf6iincp5x38hsc-lz4-1.10.0-dev/include -I/nix/store/g41q9md9rdcr3lkydi6f8zd6fza3h1q4-zstd-1.5.7-dev/include -I/nix/store/n2vnr7ycfk6midbzxcwd28qj3bgb50cz-icu4c-75.1-dev/include  -c -o src/core.o src/core.c886pg_net-0.19.5> gcc -Wall -Wmissing-prototypes -Wpointer-arith -Wdeclaration-after-statement -Werror=vla -Wendif-labels -Wmissing-format-attribute -Wimplicit-fallthrough=3 -Wcast-function-type -Wformat-security -fno-strict-aliasing -fwrapv -fexcess-precision=standard -Wno-deprecated-non-prototype -Wno-format-truncation -Wno-stringop-truncation -g -O2 -std=gnu17 -std=c11 -Wextra -Wall -Werror -Wno-declaration-after-statement -Wno-vla -Wno-long-long -Wmissing-variable-declarations -fPIC  -DEXTVERSION=\"0.19.5\" -I. -I./ -I/nix/store/48l45fvi99n90x6p9i4cs1lmzby6cb73-postgresql-15.19/include/server -I/nix/store/48l45fvi99n90x6p9i4cs1lmzby6cb73-postgresql-15.19/include/internal -D_GNU_SOURCE  -I/nix/store/p17klc3qq4nl9ihfwqfpi8cnqvcf92xz-libxml2-2.15.1-dev/include/libxml2 -I/nix/store/mglbi4dy4kpx7v1dcgf6iincp5x38hsc-lz4-1.10.0-dev/include -I/nix/store/g41q9md9rdcr3lkydi6f8zd6fza3h1q4-zstd-1.5.7-dev/include -I/nix/store/n2vnr7ycfk6midbzxcwd28qj3bgb50cz-icu4c-75.1-dev/include  -c -o src/errors.o src/errors.c887pg_net-0.19.5> gcc -Wall -Wmissing-prototypes -Wpointer-arith -Wdeclaration-after-statement -Werror=vla -Wendif-labels -Wmissing-format-attribute -Wimplicit-fallthrough=3 -Wcast-function-type -Wformat-security -fno-strict-aliasing -fwrapv -fexcess-precision=standard -Wno-deprecated-non-prototype -Wno-format-truncation -Wno-stringop-truncation -g -O2 -std=gnu17 -std=c11 -Wextra -Wall -Werror -Wno-declaration-after-statement -Wno-vla -Wno-long-long -Wmissing-variable-declarations -fPIC  -DEXTVERSION=\"0.19.5\" -I. -I./ -I/nix/store/48l45fvi99n90x6p9i4cs1lmzby6cb73-postgresql-15.19/include/server -I/nix/store/48l45fvi99n90x6p9i4cs1lmzby6cb73-postgresql-15.19/include/internal -D_GNU_SOURCE  -I/nix/store/p17klc3qq4nl9ihfwqfpi8cnqvcf92xz-libxml2-2.15.1-dev/include/libxml2 -I/nix/store/mglbi4dy4kpx7v1dcgf6iincp5x38hsc-lz4-1.10.0-dev/include -I/nix/store/g41q9md9rdcr3lkydi6f8zd6fza3h1q4-zstd-1.5.7-dev/include -I/nix/store/n2vnr7ycfk6midbzxcwd28qj3bgb50cz-icu4c-75.1-dev/include  -c -o src/event.o src/event.c888pg_net-0.19.5> In file included from /nix/store/jviasb44hibgh09829gbmbssbz2jjnhz-curl-8.17.0-dev/include/curl/curl.h:3333,889pg_net-0.19.5>                  from /nix/store/jviasb44hibgh09829gbmbssbz2jjnhz-curl-8.17.0-dev/include/curl/multi.h:51,890pg_net-0.19.5>                  from src/event.h:4,891pg_net-0.19.5>                  from src/event.c:6:892pg_net-0.19.5> /nix/store/jviasb44hibgh09829gbmbssbz2jjnhz-curl-8.17.0-dev/include/curl/multi.h:429:23: error: expected identifier or '(' before '__extension__'893pg_net-0.19.5>   429 | CURL_EXTERN CURLMcode curl_multi_setopt(CURLM *multi_handle,894pg_net-0.19.5>       |                       ^~~~~~~~~~~~~~~~~895pg_net-0.19.5> /nix/store/jviasb44hibgh09829gbmbssbz2jjnhz-curl-8.17.0-dev/include/curl/multi.h:429:23: error: expected identifier or '(' before ')' token896pg_net-0.19.5>   429 | CURL_EXTERN CURLMcode curl_multi_setopt(CURLM *multi_handle,897pg_net-0.19.5>       |                       ^~~~~~~~~~~~~~~~~898pg_net-0.19.5> make: *** [<builtin>: src/event.o] Error 1899error: build of '/nix/store/7iq4z475k625nsn9wc9nf4vxa7x1f1qd-pg_net-0.19.5.drv' on 'ssh-ng://nixbot-remote-build@78.232.36.247' failed: Cannot build '/nix/store/7iq4z475k625nsn9wc9nf4vxa7x1f1qd-pg_net-0.19.5.drv'.900       Reason: builder failed with exit code 2.901       Output paths:902         /nix/store/mx90q334pqf6iwkyb9vk1wzl5nhmqmiv-pg_net-0.19.5903       Last 22 log lines:904       > Running phase: unpackPhase905       > unpacking source archive /nix/store/5zgdqy3bz93jyn79pizxc1hks0cdcadw-source906       > source root is source907       > Running phase: patchPhase908       > Running phase: updateAutotoolsGnuConfigScriptsPhase909       > Running phase: configurePhase910       > no configure script, doing nothing911       > Running phase: buildPhase912       > gcc -Wall -Wmissing-prototypes -Wpointer-arith -Wdeclaration-after-statement -Werror=vla -Wendif-labels -Wmissing-format-attribute -Wimplicit-fallthrough=3 -Wcast-function-type -Wformat-security -fno-strict-aliasing -fwrapv -fexcess-precision=standard -Wno-deprecated-non-prototype -Wno-format-truncation -Wno-stringop-truncation -g -O2 -std=gnu17 -std=c11 -Wextra -Wall -Werror -Wno-declaration-after-statement -Wno-vla -Wno-long-long -Wmissing-variable-declarations -fPIC  -DEXTVERSION=\"0.19.5\" -I. -I./ -I/nix/store/48l45fvi99n90x6p9i4cs1lmzby6cb73-postgresql-15.19/include/server -I/nix/store/48l45fvi99n90x6p9i4cs1lmzby6cb73-postgresql-15.19/include/internal -D_GNU_SOURCE  -I/nix/store/p17klc3qq4nl9ihfwqfpi8cnqvcf92xz-libxml2-2.15.1-dev/include/libxml2 -I/nix/store/mglbi4dy4kpx7v1dcgf6iincp5x38hsc-lz4-1.10.0-dev/include -I/nix/store/g41q9md9rdcr3lkydi6f8zd6fza3h1q4-zstd-1.5.7-dev/include -I/nix/store/n2vnr7ycfk6midbzxcwd28qj3bgb50cz-icu4c-75.1-dev/include  -c -o src/core.o src/core.c913       > gcc -Wall -Wmissing-prototypes -Wpointer-arith -Wdeclaration-after-statement -Werror=vla -Wendif-labels -Wmissing-format-attribute -Wimplicit-fallthrough=3 -Wcast-function-type -Wformat-security -fno-strict-aliasing -fwrapv -fexcess-precision=standard -Wno-deprecated-non-prototype -Wno-format-truncation -Wno-stringop-truncation -g -O2 -std=gnu17 -std=c11 -Wextra -Wall -Werror -Wno-declaration-after-statement -Wno-vla -Wno-long-long -Wmissing-variable-declarations -fPIC  -DEXTVERSION=\"0.19.5\" -I. -I./ -I/nix/store/48l45fvi99n90x6p9i4cs1lmzby6cb73-postgresql-15.19/include/server -I/nix/store/48l45fvi99n90x6p9i4cs1lmzby6cb73-postgresql-15.19/include/internal -D_GNU_SOURCE  -I/nix/store/p17klc3qq4nl9ihfwqfpi8cnqvcf92xz-libxml2-2.15.1-dev/include/libxml2 -I/nix/store/mglbi4dy4kpx7v1dcgf6iincp5x38hsc-lz4-1.10.0-dev/include -I/nix/store/g41q9md9rdcr3lkydi6f8zd6fza3h1q4-zstd-1.5.7-dev/include -I/nix/store/n2vnr7ycfk6midbzxcwd28qj3bgb50cz-icu4c-75.1-dev/include  -c -o src/errors.o src/errors.c914       > gcc -Wall -Wmissing-prototypes -Wpointer-arith -Wdeclaration-after-statement -Werror=vla -Wendif-labels -Wmissing-format-attribute -Wimplicit-fallthrough=3 -Wcast-function-type -Wformat-security -fno-strict-aliasing -fwrapv -fexcess-precision=standard -Wno-deprecated-non-prototype -Wno-format-truncation -Wno-stringop-truncation -g -O2 -std=gnu17 -std=c11 -Wextra -Wall -Werror -Wno-declaration-after-statement -Wno-vla -Wno-long-long -Wmissing-variable-declarations -fPIC  -DEXTVERSION=\"0.19.5\" -I. -I./ -I/nix/store/48l45fvi99n90x6p9i4cs1lmzby6cb73-postgresql-15.19/include/server -I/nix/store/48l45fvi99n90x6p9i4cs1lmzby6cb73-postgresql-15.19/include/internal -D_GNU_SOURCE  -I/nix/store/p17klc3qq4nl9ihfwqfpi8cnqvcf92xz-libxml2-2.15.1-dev/include/libxml2 -I/nix/store/mglbi4dy4kpx7v1dcgf6iincp5x38hsc-lz4-1.10.0-dev/include -I/nix/store/g41q9md9rdcr3lkydi6f8zd6fza3h1q4-zstd-1.5.7-dev/include -I/nix/store/n2vnr7ycfk6midbzxcwd28qj3bgb50cz-icu4c-75.1-dev/include  -c -o src/event.o src/event.c915       > In file included from /nix/store/jviasb44hibgh09829gbmbssbz2jjnhz-curl-8.17.0-dev/include/curl/curl.h:3333,916       >                  from /nix/store/jviasb44hibgh09829gbmbssbz2jjnhz-curl-8.17.0-dev/include/curl/multi.h:51,917       >                  from src/event.h:4,918       >                  from src/event.c:6:919       > /nix/store/jviasb44hibgh09829gbmbssbz2jjnhz-curl-8.17.0-dev/include/curl/multi.h:429:23: error: expected identifier or '(' before '__extension__'920       >   429 | CURL_EXTERN CURLMcode curl_multi_setopt(CURLM *multi_handle,921       >       |                       ^~~~~~~~~~~~~~~~~922       > /nix/store/jviasb44hibgh09829gbmbssbz2jjnhz-curl-8.17.0-dev/include/curl/multi.h:429:23: error: expected identifier or '(' before ')' token923       >   429 | CURL_EXTERN CURLMcode curl_multi_setopt(CURLM *multi_handle,924       >       |                       ^~~~~~~~~~~~~~~~~925       > make: *** [<builtin>: src/event.o] Error 1926       For full logs, run:927         nix log /nix/store/7iq4z475k625nsn9wc9nf4vxa7x1f1qd-pg_net-0.19.5.drv928error: Cannot build '/nix/store/7iq4z475k625nsn9wc9nf4vxa7x1f1qd-pg_net-0.19.5.drv'.929       Reason: builder failed with exit code 1.930       Output paths:931         /nix/store/mx90q334pqf6iwkyb9vk1wzl5nhmqmiv-pg_net-0.19.5