nixbot

builds

cancelled checks.aarch64-linux.ext-pgsodium build #132 · raw · eval 30.5 s · 2.0 GiB allocated · ·

1these 343 derivations will be built:2  /nix/store/09yw6by1xkgwvadzkn03bvaxw955v632-pg_partman.drv3  /nix/store/0cmixqwsz3vb82j49j1mhvyk8crg4dcw-wrappers-0.6.0.drv4  /nix/store/f4fxzxll7q3m5cy6rib758j63zcky8dk-supabase_vault-0.2.8.drv5  /nix/store/zyzrb73x0fw62dyxqdz0znqnzvgqa7g6-supabase_vault-0.3.1.drv6  /nix/store/0dxji73cc07dbqk8nny6y5mkf5qr6kl8-supabase_vault.drv7  /nix/store/fl27cr5qdrq44nk61x5yjlqxsrc8mg3n-pgsodium-3.0.4.drv8  /nix/store/jl20dg8fxlmlv84f7cda9xa6mq8y46sr-pgsodium-3.1.7.drv9  /nix/store/l6md1p6ahq43yili977j4021ky05la94-pgsodium-3.1.8.drv10  /nix/store/pvz0jf5drhdz4jj5k592kxbdgk4lm52r-pgsodium-3.1.6.drv11  /nix/store/zdz6b4s43i332x3xlvjivc7p4csihzba-pgsodium-3.1.5.drv12  /nix/store/0h7mnh8was4m19z53z0dmakrp0c9271q-pgsodium.drv13  /nix/store/0i6b8yy32fc4mgfm75w94gw9ja033kw5-wrappers-0.5.5.drv14  /nix/store/qbrypyj5k7h0pffxxshbyym24h89f2y1-gdal-3.8.5.drv15  /nix/store/l9h30apsjb4s39av0lwsad1vv59rdkv6-cgal-6.0.2.drv16  /nix/store/s3myd88a11h86h3h8cvhgd1im0zk6i65-sfcgal-2.2.0.drv17  /nix/store/h1vl8vpk154yppn5lcqms2680igi0mmj-postgis-3.3.2.drv18  /nix/store/2ylkw9crapb58vd5g0vj602jfyb1p3r6-postgis.drv19  /nix/store/58cinn47vbvwr1wxdkspmvi9cj27b07h-safeupdate-1.4.drv20  /nix/store/6c0mnd757hvxppfyrsf4cb1wgnbd4111-safeupdate.drv21  /nix/store/ciwky5vscrx4c52kr30fm8j4idj8qgsn-pg_stat_monitor-2.1.drv22  /nix/store/7a02zvvkkkriis78wgz6n8nnkwm2gh22-pg_stat_monitor.drv23  /nix/store/9gh7fip2wf0wip8wnv1axd8ghar0x5fb-pgmq-1.5.1.drv24  /nix/store/k4swwy7459wf558rbrraclsr4sjccz0h-pgmq-1.4.4.drv25  /nix/store/8zsadvm8mv18kpy4qy724ps2jlbsik0w-pgmq.drv26  /nix/store/4wk9vb1q3kdnhj8hsq8pwgbp82glwg9w-timescaledb-2.9.1.drv27  /nix/store/9wzj3wh6sczzk849dmjwvmnkshggakxp-timescaledb.drv28  /nix/store/2nmg9sxx50xmndps3714hbvwjyd5rqv0-vector-0.8.2.drv29  /nix/store/94d6rmv5v8zdjsgzl3yrhpg7zq6zdjpx-vector-0.5.1.drv30  /nix/store/alajylsl9b90m65n0ps0mkbkw679x4sn-vector-0.6.2.drv31  /nix/store/jmilv9h5p0v4grgqnhfn22i7zl352ybh-vector-0.7.4.drv32  /nix/store/q3mdjvqpw4xbwcjy5y1ps1igxsjvx133-vector-0.7.0.drv33  /nix/store/v5dnr617av2jgk6kpddxbxxqjqgl5kzg-vector-0.8.0.drv34  /nix/store/z40s48rz55qgpw6g6wiqi68hkfas4h1l-vector-0.6.0.drv35  /nix/store/zygvf0wgqsyi96fangshfkwjiyylhvkz-vector-0.4.0.drv36  /nix/store/9zndhfzc45vrfn297g1hav7m6ba3rlzk-vector.drv37  /nix/store/0nln7k62ggiw9s5y0icr3hyribl5iazb-pg_graphql-1.2.3.drv38  /nix/store/63ifr5p2wzl7vygaj7pq847nwnrnxm3p-pg_graphql-1.5.0.drv39  /nix/store/6hfik9nnrihzb6dj53in06v6a4qmgsj3-pg_graphql-1.5.7.drv40  /nix/store/7pqhalqwaggagybgy24lm93c5b8d4isk-pg_graphql-1.4.2.drv41  /nix/store/ag5rlkqwfkwlgvxg1yhivjqfcaq2w14v-pg_graphql-1.5.1-mergeless.drv42  /nix/store/cgazfazb4ak4csd48khgjsa4vxmmddfb-pg_graphql-1.5.11.drv43  /nix/store/d78fjdz9zrccq7f563jz9fj1a45yrq5x-pg_graphql-1.1.0.drv44  /nix/store/dk0a0irlxsl04249qy2dnc6bm4wkk1lc-pg_graphql-1.6.1.drv45  /nix/store/dnwfmlfwyqnkzy2jyzf6h3q044wk6hbg-pg_graphql-1.5.9.drv46  /nix/store/f694g0m8chfk6z6yh787135bzcqwnli4-pg_graphql-1.5.4.drv47  /nix/store/fsgiwnrg38ssgf05vkmzc21v93a36qmd-pg_graphql-1.2.2.drv48  /nix/store/h9damb814a5fmzyc5wgcildkm32vy1bv-pg_graphql-1.6.2.drv49  /nix/store/iq0gzwfxzxkns0gpdkhjx1cc6s4q1i2q-pg_graphql-1.5.6.drv50  /nix/store/q66z8j5qs96rgahzmlrq4n41d2avywar-pg_graphql-1.0.2.drv51  /nix/store/v0mqjlj6j73wpc66h34djrv08j7q3l8w-pg_graphql-1.4.4.drv52  /nix/store/wnn3f47lz59i84mdzvmc1a7man89cmic-pg_graphql-1.2.0.drv53  /nix/store/yds474rgqgxjdw6zm0ylvpvvd4l0xmkl-pg_graphql-1.4.1.drv54  /nix/store/yhfqz2chz94q9k3rv8hgwcsyri02wlm8-pg_graphql-1.5.1.drv55  /nix/store/a4icbsgspmpi3nfs8vffp42sg9v7a25f-pg_graphql.drv56  /nix/store/a7qnf8v2hw96v6kdba9j02fljccy432g-pg_tle.drv57  /nix/store/c08rdgxba5n6zhyp78l8sd6fhnbc4a4c-pgsodium-3.1.7.drv58  /nix/store/hh2jpg5qdwgdwzi96qcay1a5ffhi0f4i-pgsodium-3.1.6.drv59  /nix/store/jwrjvb9m50v44sla4jpig83jab7zn17x-pgsodium-3.1.8.drv60  /nix/store/m1xdmpffkflwgdin5ljvfh72wxq5lxpx-pgsodium-3.1.5.drv61  /nix/store/wjhhlaiwzvm5m08my4d983icdmcpllzd-pgsodium-3.0.4.drv62  /nix/store/a9laaq557mna86dm87lq3211xy5h2zyl-pgsodium.drv63  /nix/store/ag6xlrckwkx594nhf6j3sq2ngwbryyz8-http.drv64  /nix/store/i0gq8yqxp5h7l782n2ki94b1d62m6zsg-plpgsql_check-2.2.drv65  /nix/store/q117a7mx5d5bzln8xg24fh1vfzq7bsz4-plpgsql_check-2.7.drv66  /nix/store/rj6qw8pwvr91cy6qyp8xibrw4arrpj9j-plpgsql_check-2.8.drv67  /nix/store/c782i897gj20c0r8bmphf8p6r5s5wdli-plpgsql_check.drv68  /nix/store/b139hl0gpc9icb6j6q28gl1chw7i9260-rum-1.3.drv69  /nix/store/csvzp35khfq15v5g275y14094s58v10k-rum.drv70  /nix/store/c2pcswnd4yfp02pas6a7grpm0fmk70wx-supabase_vault-0.3.1.drv71  /nix/store/jb3j93i6ljmvqkv5cnv3lh3d9zn4zcjz-supabase_vault-0.2.8.drv72  /nix/store/gc3nb7r1a8rbf6f8yf4zs2nnb65awkxq-supabase_vault.drv73  /nix/store/7inhp3jz4x6l1m2i6aa1w6bbb91r1hay-pgroonga-3.2.5.drv74  /nix/store/xim497rkcncpxb5vvyli3j4jnziyybgy-pgroonga-3.0.7.drv75  /nix/store/gdd3j67qcdibplv1d440a6gsix87s5xs-pgroonga.drv76  /nix/store/ihx5q75k74a4cqq4k9bwnl5yin262kq2-pgrouting-3.4.1.drv77  /nix/store/hf9dly2ryx969lw950ld454fqfa6c41r-pgrouting.drv78  /nix/store/8kjmsmcqakfh251gpi83kpszgvy3zgj2-pg_jsonschema-0.3.1.drv79  /nix/store/dllk76mn670xnq6146jk4lmj5hpxmp4c-pg_jsonschema-0.3.3.drv80  /nix/store/pqncxlsh0gj7xk3n4mwxqiyyzim9c7g7-pg_jsonschema-0.2.0.drv81  /nix/store/iljk5j7rhldnws1iwi3j8qjxnaalxqjv-pg_jsonschema.drv82  /nix/store/82vdx9lfkbv67j79qzi9yzvqrj043w52-wal2json-2.6.drv83  /nix/store/iz713zhjyn0lym6ls12i9vxca9cxf4hi-wal2json.drv84  /nix/store/zfhvj40marmxclav9a5ppx3dmq3xd3hh-pg_partman-5.3.1.drv85  /nix/store/jcxqgl4g37gj09v4km7dl525ym1kxla2-pg_partman.drv86  /nix/store/mc1n2fml7avin2lrpgrd5cx7wjdb4gcg-pg_hashids-1.3.0-cd0e1b31d52b394a0df64079406a14a4f7387cd6.drv87  /nix/store/jsqjxdn4qp571nvc40r8xx103s9qb7c9-pg_hashids.drv88  /nix/store/7lzcc5d36122752hpjb6lij6sc2ai2a0-plv8-3.1.5.drv89  /nix/store/87brzrl1nsm8z4my02aldnxd8fb0i69x-plv8-3.1.4.drv90  /nix/store/k6nh1vivj2dgh0jk2mpsiy4p5v6sjyzk-plv8.drv91  /nix/store/xjfjfch45p5g0snar9qpm4amblh2jya8-plan_filter-0.1.drv92  /nix/store/lhdnha0m1rqpv0cmivzv3s7znjmgxc14-plan_filter.drv93  /nix/store/0n0iaya9csx9by2pimrx1yglzw8dp4zs-pg_net-0.13.0.drv94  /nix/store/25f3j4f5ialq0qwpdpc7gya55q9i2mai-pg_net-0.11.0.drv95  /nix/store/5xdj291zxpgm4qhx0749x7j0wwlfilf4-pg_net-0.1.drv96  /nix/store/6nzc8mspw5i4qqlvgriv2l1439xlh68v-pg_net-0.10.0.drv97  /nix/store/7iq4z475k625nsn9wc9nf4vxa7x1f1qd-pg_net-0.19.5.drv98  /nix/store/cfrc2vk3cgabx1447j2n7s3zxraq6395-pg_net-0.14.0.drv99  /nix/store/iwq28h7yniccm9ra8q6dc0wma0l6hnqn-pg_net-0.6.drv100  /nix/store/nw3d144zhshkgx1z66g9g2wg5829w36n-pg_net-0.7.1.drv101  /nix/store/nwcnf7x9i2zdx48936w9ixsnxzhbab16-pg_net-0.20.0.drv102  /nix/store/rfdqkjkjdwz7ydrwlfn9cdy68zz9z6rf-pg_net-0.7.drv103  /nix/store/whvqb38akl195470ks3jads9kmq2i9gj-pg_net-0.8.0.drv104  /nix/store/zy29jzcj1bsz7760wbmlg78czaddsrni-pg_net-0.20.3.drv105  /nix/store/q7ak647qv213m4vc4fnr43i09azs1b0p-pg_net.drv106  /nix/store/s7vxni6a17dm43jdicq8ksfjsk2d7c0n-pgaudit.drv107  /nix/store/nwi7hxl3j1cxn7ylrkx8sbbg3sqld8ag-pgtap-1.3.3.drv108  /nix/store/sxzi0qg4ingw35zkbi2pk2vfgxbq5k2a-pgtap.drv109  /nix/store/wza7bzcbymwld5yd1bh5p859l0fgd9af-pg_cron-1.4.2.drv110  /nix/store/xcji3ff216yxrc2yf2yss6mza01w0ccm-pg_cron.drv111  /nix/store/21s45rg3i2jfhdarxmqf3dr79allgdgh-wrappers-0.4.5.drv112  /nix/store/56j6z0f3g50m72cj7ynr22p9fdml79q9-wrappers-0.5.3.drv113  /nix/store/9m4hgq2s9z1cy1508wymdcl2n1w3ky5h-wrappers-0.6.2.drv114  /nix/store/f3b53aqd65czxnbbash43yraza54ds7k-wrappers-0.4.3.drv115  /nix/store/fpcwzjw9wdhbljjpcjlbz4w6236qzl70-wrappers-0.3.0.drv116  /nix/store/hygnfcb7az5nw4c4aranasi27gnhzgan-wrappers-0.6.3.drv117  /nix/store/iimlppn24xgvgjvnm4xp8z9bxl4p4p1d-wrappers-0.4.1.drv118  /nix/store/l3ww3jfvj5l8bp25p66wrjziy8m0vi23-wrappers-0.5.0.drv119  /nix/store/ns9rs9anq0rsl3sh1rhxmqcsll7lkjd0-wrappers-0.5.6.drv120  /nix/store/nvjw377g2m07i1z93mngr72qhpjmafvy-wrappers-0.4.6.drv121  /nix/store/qzn17ml7z84zcmcw96j0z0f6m9j6y7qm-wrappers-0.5.4.drv122  /nix/store/xbhixx8nl4iifcfi17lpavbs9cxcg5ka-wrappers-0.6.1.drv123  /nix/store/y06jjr5k7hk7zs8gzilg4g50b184va6a-wrappers-0.4.2.drv124  /nix/store/y1qh08g7i9w1x2s10rq7ammigljy82kw-wrappers-0.4.4.drv125  /nix/store/z1yzqa9qzq4ri1f58lngsljs0abhgjz5-wrappers-0.5.7.drv126  /nix/store/xcq8s20l2ynk52356w6nqkdw7379h4g4-wrappers.drv127  /nix/store/3m1k34jx4kw90mcghzrp83c2dfhrwab8-pg_repack-1.5.1.drv128  /nix/store/c7dnz58z4jqy26qinfmray2nlvxx3442-pg_repack-1.4.8.drv129  /nix/store/iwgg2la44vzaaa2ja2xyaydck2jab651-pg_repack-1.5.2.drv130  /nix/store/xd0qgx5kfkw00jgxs1v9rm4ksfdjky95-pg_repack.drv131  /nix/store/fakh4z5ssr1vhknp3xv3ch232i3ph2ax-postgresql-and-plugins-15.19.drv132  /nix/store/4z7sbcap8vdzfs1smz81k2crr4sgm640-postgresql-and-plugins-15.19.drv133  /nix/store/q4qvxkwv7rl1jac9sf5aap56gjx0n5mb-system-path.drv134  /nix/store/9in45xg9fcahx70h7alf6jg08sin568q-dbus-1.drv135  /nix/store/jffmpfrihfl3k6lfgdc4ii4a62343h7x-X-Restart-Triggers-dbus.drv136  /nix/store/0jyfsa7sd5nhfiwbk0i0i0k7bbgigy6z-unit-dbus.service.drv137  /nix/store/0nn0jglvy3w5hd868rilks6acxx242hj-pg_net-0.19.5.drv138  /nix/store/0q3jswlrym436vq3yzd7nmxpfpc7zbw7-wrappers-0.5.6.drv139  /nix/store/0wbkhlgz00c1nhm74adar4kk6dbid1dq-pg_graphql-1.5.11.drv140  /nix/store/1k3nzf8206jy6jjwdb50jn8rij79dvvj-plan_filter-0.1.drv141  /nix/store/17zhj6r14i4xx0fmzclykpcnyicwhbga-plan_filter.drv142  /nix/store/18746y4c8pvpm3al2bydwcn29pgwkjij-pg_repack-1.4.8.drv143  /nix/store/1hza0wxglhyl1641a3yki78kp045s8x2-wrappers-0.5.7.drv144  /nix/store/1mkhz1wanb7sx61imr6wqda0cqnvnj8q-wal2json-2.6.drv145  /nix/store/1r4ihdrrxnxp1kc97akzkb6yf0rhj5fy-wal2json-2.6.drv146  /nix/store/spkggw5b21kbiq57p7fq00khhxxg9mpm-http-1.6.1.drv147  /nix/store/1s2y3lhnrwphps8mxwxhj6pli5p72pz8-http.drv148  /nix/store/m94894cysabrjwxvvsg00i2c4vxrwj44-pg_graphql-1.6.1.drv149  /nix/store/nsc639d0i1mzcdskxc5v8874w8f4zf8x-pg_graphql-1.6.2.drv150  /nix/store/w47195gn53xxlfnja6kkgpgj0pbxj66m-pg_graphql-1.5.9.drv151  /nix/store/2j0amjv943p6zmhzl3mx9z6jr1qcpn3i-pg_graphql.drv152  /nix/store/2wp2aqp71l4218m1z0aas6789yx18sv3-pgrouting-3.4.1.drv153  /nix/store/564f4p7z536irjy1x7a6i39nk3n3g2r2-pgrouting.drv154  /nix/store/7m924d2lj1z3y952h3rhjixfq3sygp4r-pg_tle.drv155  /nix/store/z008z9r9dipnvldyfh7pklhxwdav0faw-http-1.6.1.drv156  /nix/store/82hvrn43v2lmbsbj2cnaaps4iy6q9dqn-http.drv157  /nix/store/k4qjk97aggz30jlgv2hdqka8fy8z07pg-supabase_vault-0.3.1.drv158  /nix/store/z8jynkjsnrfphim33c02aci4n6i2s9la-supabase_vault-0.2.8.drv159  /nix/store/8ir53vjiqz9rhip8arbxd2b58d0j67w0-supabase_vault.drv160  /nix/store/vrks8v32hwif7cfllbj4kb4i2v9b48y8-hypopg.drv161  /nix/store/yxyw8y9hskg7m2sajbfkix9g2pibkl2w-index_advisor-0.2.0.drv162  /nix/store/9c27ix09f1z8w6a63dkm9idp2vsrixh1-index_advisor.drv163  /nix/store/9sv9z7i53r40xnrigr8aywi98izk30rb-wal2json.drv164  /nix/store/g3yy08xhp6kakigznjmymrvasv6xhzz4-rum-1.3.drv165  /nix/store/apcx516gwjdivwb00nzvgwwq26mp6kbp-rum.drv166  /nix/store/m5i71pkvgfbs9l7iwwnbj4hyz9dvj13m-pg_jsonschema-0.3.3.drv167  /nix/store/az9kzhbrx32y837x7nl7dfajllv3l3xn-pg_jsonschema.drv168  /nix/store/ynjdlqr0w8h7ici1xdnsr79mwnzmyyri-pgroonga-3.2.5.drv169  /nix/store/c7b5vgzvlwgra3bhwq5fjzl0cg8lxq53-pgroonga.drv170  /nix/store/axpz1dvivwnmwkkcs392nj9cp1zs4x4h-pg_repack-1.4.8.drv171  /nix/store/gpxphj5cc5qbfjvp1kckicqwibgb6870-pg_repack-1.5.0.drv172  /nix/store/nynlpdydjmjk2fk2fsjz9bws5n6pjjyv-pg_repack-1.5.1.drv173  /nix/store/sa036niivyjgc2rqi9xh890msxh349l9-pg_repack-1.5.2.drv174  /nix/store/f4jr9drjzv7wfj2rxqg6fxg4ki5xv8aq-pg_repack.drv175  /nix/store/3cgs2dl0nwcsnwa5j7vkkp9vnqrax686-wrappers-0.6.0.drv176  /nix/store/74dcpcc376carhrdcf8ka4zmkawz1yv6-wrappers-0.5.4.drv177  /nix/store/92vrj7bj8hswwppxa34pv4a5mcishcns-wrappers-0.4.4.drv178  /nix/store/96l1zwmvz2ffcdfraaalfc6lvhah4kbz-wrappers-0.5.5.drv179  /nix/store/adcv6z66z4kpsasjjh1mcxa915lbdppl-wrappers-0.4.5.drv180  /nix/store/b4n3d1kid5pcaqfl3fjnjmc425dgg1p1-wrappers-0.5.0.drv181  /nix/store/jcd2gw4vawwnh0pmxhl4pl3ll6adggx5-wrappers-0.6.2.drv182  /nix/store/vxwdlzq8s4jj92x0jpc4sl9drjywlalq-wrappers-0.6.3.drv183  /nix/store/xwhq66cqc0ms922bxlcgc1jwff6kqv8g-wrappers-0.5.3.drv184  /nix/store/y6kq63cxxc5v5jh87mv9wpbvk0p4ayfg-wrappers-0.6.1.drv185  /nix/store/zdyyj4cgmfdl46zb5ycwmwr6d30w6mbx-wrappers-0.4.6.drv186  /nix/store/fn58ja37h9fw7mszrd75faxdb0999f0i-wrappers.drv187  /nix/store/8yjdx0pjzbx41fx807nrw1js3y16kbz5-vector-0.5.1.drv188  /nix/store/9yiwshvqw6zii2gdbjn3whic00kdi2kk-vector-0.7.4.drv189  /nix/store/gd4y86918lqw8gzxg8nqrz8sy2dqq9fb-vector-0.7.0.drv190  /nix/store/gdgmh15k0z47wvlyk7n79hg9mm7jzisl-vector-0.6.2.drv191  /nix/store/hs3bxh6aa4yj96k9qp50af7qy1jchwk3-vector-0.6.0.drv192  /nix/store/j5mchw8xwd04x2c28fmf7pccna5x7y95-vector-0.8.2.drv193  /nix/store/qa8qkhza8bf74v69dzxgqvy2mjf799yl-vector-0.8.0.drv194  /nix/store/g5mv4minlqr25pj8gqhzcns6w7bwzaph-vector.drv195  /nix/store/lkbp0bzzg49y6z9h7ms156q0jsiq6qh4-safeupdate-1.4.drv196  /nix/store/icwncd52zxyvvybn79pvj2s9day934p8-safeupdate.drv197  /nix/store/j99v4y7ck8sk68hj9m9aw1avc2dkn4nh-pg_stat_monitor.drv198  /nix/store/9kmiqqmclsl8d77yd54al2d2wlwc6dp1-pgsodium-3.0.4.drv199  /nix/store/ckl9zg69wqkncwizrd6lln7h5492wwn6-pgsodium-3.1.6.drv200  /nix/store/lhi0y1xi9i9i1c8kg95nfhdw95j3dz3r-pgsodium-3.1.5.drv201  /nix/store/msmzmvngp6cx4yl0dwgzp3iv7bv796wg-pgsodium-3.1.8.drv202  /nix/store/zwypkv0vf8m8ybs536jq5wglvhfwdx8y-pgsodium-3.1.7.drv203  /nix/store/l68xzbdq736nzdnwvr9q3x29wcngcsj1-pgsodium.drv204  /nix/store/qk4j715gipc827yxrcwv0g9pviaqxkyy-pg_partman.drv205  /nix/store/46l7zbh5kkmyi58x419ar4kly30qvnhi-gdal-3.8.5.drv206  /nix/store/apd0c6nk3x333r1xj0sl2m3cr96pbizv-postgis-3.3.7.drv207  /nix/store/r12320b80inhy5aq434asc4sa8w6bn0g-postgis.drv208  /nix/store/36hfvpcvdxj64718i9mhil3db8835a6q-plpgsql_check-2.7.drv209  /nix/store/9lpr8r6zwzid07ihmr89rnxqcwv0yfja-plpgsql_check-2.8.drv210  /nix/store/rly88629k74w1nj10q0l6mg2jvd3nr1g-plpgsql_check.drv211  /nix/store/83ycsfk9ivb7sah3lq89d8hy5rxj5vpp-pg_net-0.20.3.drv212  /nix/store/a0ldx82cv1chkbdks86c8mjp8ps4lfgn-pg_net-0.20.0.drv213  /nix/store/b0270km6h57kbdxfkhagcpsilp239adm-pg_net-0.11.0.drv214  /nix/store/lbqp8bfrqa2xm82ma6wyq1gijyajh6kh-pg_net-0.13.0.drv215  /nix/store/rdglczxf0sk4hhwsppqw13zl43vf5wr0-pg_net-0.14.0.drv216  /nix/store/w7547z9slhcibw4s6cwkag6w1f49317s-pg_net-0.20.4.drv217  /nix/store/vvs47f973jig6lflvm7cidm6m20glpy5-pg_net.drv218  /nix/store/92dxzgq4qn1jl389a931z1n5n1a8s5ns-pg_hashids-1.3.0-cd0e1b31d52b394a0df64079406a14a4f7387cd6.drv219  /nix/store/x1kpz6n29pqn2xm06lprn5kwpr0pjhhx-pg_hashids.drv220  /nix/store/y1p5dlzmilwxqbf3a4c7hl6gp9p84wsl-pgmq-1.5.1.drv221  /nix/store/y5rgrfmhzrjr0j6zil7ksqdbcglh0s8i-pgmq.drv222  /nix/store/jk18akz00pd0nr1pixnq9550lnvycgar-pg_cron-1.6.4.drv223  /nix/store/ybhpqdys29q375m5pxxn2w3cbzgf3mxg-pg_cron.drv224  /nix/store/mpyn776iqdn7h94vlp5yxn83a0y4lchc-pgtap-1.3.3.drv225  /nix/store/psjbrnijdnpqyc9s718av7nwmyk0fays-pgtap-1.3.1.drv226  /nix/store/zf19xpsa8jj4bmx09awww0z16cm79z4g-pgtap.drv227  /nix/store/2fndab8axk4hz4s30ijaxnpa1bc9z1dc-postgresql-and-plugins-17_22.drv228  /nix/store/2h15dgac1417g71pjrb4aqcz8yabiv21-plpgsql_check-2.7.drv229  /nix/store/2i3blwmkdwv0753xgc4pb1rm16gk4jmv-wrappers-0.5.6.drv230  /nix/store/3bfr1qggn2db554518zgs8fpzyagvfrb-pg_jsonschema-0.3.3.drv231  /nix/store/2x6xkwfx99zhzhdbmhbrnifqf63l8ica-pg_jsonschema.drv232  /nix/store/381ghgpkv0l9lnv0f1v2jxfg04cspiih-rum-1.3.drv233  /nix/store/3dxfnbp09hx3zc5q8mmvb54v0nb1lrid-plpgsql_check-2.8.drv234  /nix/store/48mqx57r48j330b49mc32k7bvy6445c2-wal2json.drv235  /nix/store/4dv0hiafadp1s6dx9i8qfwajgh422j5n-pg_graphql-1.6.1.drv236  /nix/store/5ls8sxw33v0sm4agddi4xzky3nvhg3g7-index_advisor-0.2.0.drv237  /nix/store/83syfrxa296qd37cig3f07glk8hn533v-pg_stat_monitor.drv238  /nix/store/8szfd9ycs8amd9k5vlvg6prcijxwqr3j-hypopg.drv239  /nix/store/sww4kz29ir2aly4abpn3hb8zfqy4ak06-pg_cron-1.6.4.drv240  /nix/store/9w316phdvwdjv5875fpg98qwdi7hxzv5-pg_cron.drv241  /nix/store/f2nm4421r3k58c32661m7na2f1q95dbh-pgtap-1.3.1.drv242  /nix/store/k7h19a5nads14nh23z55wp7vpifpqdcg-pgtap-1.3.3.drv243  /nix/store/b3wykhrc5d96h1ddr0n8jc0vm6lda047-pgtap.drv244  /nix/store/msp1w36fm572jxlq4yj3ilwksxa0qpag-safeupdate-1.4.drv245  /nix/store/fl0xvi8swv20jz0vkfsm12znd6mp9naq-safeupdate.drv246  /nix/store/hnandxbj17d43iq41vk9jgn2mk94s7fg-index_advisor.drv247  /nix/store/5sxmls2c3rj1id1jy8cp90d7aga5vs9y-pg_graphql-1.5.9.drv248  /nix/store/6f7pk59bx81p58zx4lxc0kpr0a4pskc3-pg_graphql-1.5.11.drv249  /nix/store/kxm7a9483vsp4n6zn93isjb5z31l42fd-pg_graphql-1.6.2.drv250  /nix/store/k2r44m3w1mwab1ipx8m72764yyhxr38v-pg_graphql.drv251  /nix/store/k4lajdzpb6zgp35ib3yfg5hk7p7kj1z3-rum.drv252  /nix/store/8p8fsl25zwlaqwhknw8myg0lfhi6rhsg-wrappers-0.6.0.drv253  /nix/store/a9l3bgzraqwg33ax5gcmbqwrkrrxxnag-wrappers-0.4.5.drv254  /nix/store/fh5b65jxgdyzwrs2g7y12ffnk1yhxczn-wrappers-0.5.7.drv255  /nix/store/h81r7798azz2nz8s3pxp1drpa02ma2m8-wrappers-0.5.4.drv256  /nix/store/hlpygbdz705888l5vwvvnz96901jdbkn-wrappers-0.5.5.drv257  /nix/store/kcan9i952k07b3pm1fnq4s0f7pfn7yx9-wrappers-0.5.3.drv258  /nix/store/pvzl31ydc0nhwqmrw9agqqbmk4v4ycr8-wrappers-0.6.3.drv259  /nix/store/q0lgs5nhw27p302wa3gp300l19ad95f0-wrappers-0.4.4.drv260  /nix/store/rfn5rhjy53sq47kjz5qfawd9pz9a38l1-wrappers-0.5.0.drv261  /nix/store/sg3hglpfqxg0bdxvkn36jnvpd752brga-wrappers-0.4.6.drv262  /nix/store/sn2m8z01kbz72vbl839b4qdhql2lf67m-wrappers-0.6.1.drv263  /nix/store/w5gnd7pybydask3lizsy3lirm83jxx56-wrappers-0.6.2.drv264  /nix/store/kplnvybrmx8df99qr3hsafbkky7hfg3v-wrappers.drv265  /nix/store/ibl9nbmh9mbqgqqfkrq7vgqzbsxj392q-pgmq-1.5.1.drv266  /nix/store/kv8jjb4gkylvk18qlsxl5lp9k29b1d31-pgmq.drv267  /nix/store/hnhqkd9jnn7w4z0z0jacwjwg9x016gyl-pg_repack-1.5.0.drv268  /nix/store/rhyhx66rvbmsmh7i4xf5dqi3pr058hjr-pg_repack-1.5.1.drv269  /nix/store/x14ai73x9yl5ckncl830rpbqxpjvvbg5-pg_repack-1.5.2.drv270  /nix/store/m6b5d5vphi1v49cpgr7ff07zvzfri21p-pg_repack.drv271  /nix/store/q8n9c44w9m7lggw81a93q8rvr4jgmslx-plan_filter-0.1.drv272  /nix/store/n1y2c26wz7wmff6xrz6ggk6zvsgma4bk-plan_filter.drv273  /nix/store/8byjp94z4bcpvgpc2s8ga2rqg9c3xc55-pgrouting-3.4.1.drv274  /nix/store/qs7fc4p2b8g3zc4cd29vi1wck7acipz9-pgrouting.drv275  /nix/store/rqv928k6h7v2jlfgznn4wi7km7zvm5qk-pg_tle.drv276  /nix/store/v635079aqf2hhpg4xnhm2226g7khvdav-plpgsql_check.drv277  /nix/store/84hgdiz6hjkzk0cm5bd3vqsbx45n9zkh-vector-0.8.0.drv278  /nix/store/92n1zijp3izg793lrskmws7kyjz1xg5h-vector-0.6.2.drv279  /nix/store/bxnxr2z670m9ri1dc66149krs7h60dnc-vector-0.7.0.drv280  /nix/store/nyx1ahbyki15bmvygqzj2s1nnbmbi8ig-vector-0.7.4.drv281  /nix/store/s72y0nj96pwds84md5hz9x09cidw3azz-vector-0.6.0.drv282  /nix/store/wy228ccg72w2cv5rbhynqgmbxx7dqlws-vector-0.5.1.drv283  /nix/store/za0ss4y8awhkng526g581wdnh0azibcf-vector-0.8.2.drv284  /nix/store/x3iqn55b29mih079vypw11gf008gj74l-vector.drv285  /nix/store/6601flp9bdqz93g493ma3hhb95ia16fh-pgroonga-3.2.5.drv286  /nix/store/xkmdckj5hdcfgqlyjn2qq5vdv6s09h5a-pgroonga.drv287  /nix/store/al6g5cvx86v4ljmh3sg6hmlsl3ab3bwf-pg_net-0.20.3.drv288  /nix/store/b1pyvgjyn940h95bbnsp15qmb0qli5gd-pg_net-0.20.0.drv289  /nix/store/cl8ikglrq6jdd2cp01jad7n483mvqj8g-pg_net-0.11.0.drv290  /nix/store/g6nfp5n056kw2jvfzldzxrrrxfpfcka0-pg_net-0.13.0.drv291  /nix/store/xwiwd8fzjgv67zb2ji446a8vxjj3s7bs-pg_net-0.14.0.drv292  /nix/store/yf5z0qi17vprkjz68rqyp804sx929g9n-pg_net-0.19.5.drv293  /nix/store/y02vszvrhs7b6kn8llgwzdmnmhqiymzk-pg_net.drv294  /nix/store/k684vf2v1w6afbwv98r05j1f5hg9gw2f-pg_hashids-1.3.0-cd0e1b31d52b394a0df64079406a14a4f7387cd6.drv295  /nix/store/yi643dw2hzxidf2jf635pk0da5c4bs96-pg_hashids.drv296  /nix/store/mxhjb2qfqd8l49wakfpw5qiws2v1bcnn-gdal-3.8.5.drv297  /nix/store/mrfs1y0f5l367m93gpss7lp0jg6nz3bf-postgis-3.3.7.drv298  /nix/store/yskfmp4z518h4ff0mli70gsirhsli1ns-postgis.drv299  /nix/store/nj44phx30461wf1ac6n8fg8cc58agpgv-postgresql-and-plugins-17.11.drv300  /nix/store/rn61yq57k8lhdkx7al266vkbandycwv7-postgresql-and-plugins-17.11.drv301  /nix/store/czird9kid1f479i75r0fcy4ivzd3zzs8-system-path.drv302  /nix/store/i0ygxsqq6na1vsqmbklzxrj1xy5ypk6x-dbus-1.drv303  /nix/store/xnzsv2ymk0qx1fdsm8ssls8mlq8852wc-X-Restart-Triggers-dbus.drv304  /nix/store/5q0f5sx5mas5cc56azv1g9pm53yfrmgc-unit-dbus.service.drv305  /nix/store/a03cbyqm7arwjx83nc7jiwxkbbifg33w-user-units.drv306  /nix/store/acfna74pf7f063994dvxzqkrrhi623c4-unit-dbus.service.drv307  /nix/store/rjsqz027b1xj9q5dymzvs3wbqn2dv53m-postgresql-init.drv308  /nix/store/n0j0873l4a8mlkz6x1bffr3skhaarc7q-unit-postgresql.service.drv309  /nix/store/wmsihsmjyk0h8yjj86lpmijxpzqwk8gg-postgresql-migrate.drv310  /nix/store/pml1z1qw471w7nshf5dxp826pysqs3fz-unit-postgresql-migrate.service.drv311  /nix/store/vrslgxqykax3yi5mlrpiq0v1rq1ilnic-system-units.drv312  /nix/store/p6pnncmb31ibp4zxf61fbkkb0fmq4xai-etc.drv313  /nix/store/x6cijf4csfmd0dc8sqmiajj5dwi4h3dg-activate.drv314  /nix/store/cgyqy4j1g2s9zbh87ddwhr7wn9rssarl-nixos-system-server-test.drv315  /nix/store/i3fy4azgna3zl2za0k3pwx70f2sk6hk8-receipt.drv316  /nix/store/w85w5162f9zdpi7g98sjlk186hrrm57p-postgresql-and-plugins-17_22.drv317  /nix/store/amy1ji0k53n9qihnqys9hvlc60bncr1y-system-path.drv318  /nix/store/7ynly7nv4iq2wvhmmg6p100h3wr2dpxd-dbus-1.drv319  /nix/store/v749g53p5djbqg3y7kfvdsw5g535j0js-X-Restart-Triggers-dbus.drv320  /nix/store/n7wg70ga6zm8b0prwd4np0azpi732zji-unit-dbus.service.drv321  /nix/store/bmn9rg4vrb07wyj1ls41afzdzcmhdqcm-user-units.drv322  /nix/store/jika4rfg3aj00vq2nfqx2i6nild4nvd5-unit-dbus.service.drv323  /nix/store/8r4vw45si1w8qby225b0amhay9ybj6c5-postgresql-orioledb-init.drv324  /nix/store/pgysndf7sfj9ifxk4sy1w8qfx2ln1ws6-unit-postgresql.service.drv325  /nix/store/9i9flpkzn6d3cvhin3s644150jhvcazf-supabase-orioledb-db-init.drv326  /nix/store/s4qicdb2kbzvf3lf6m8xidm4lndgs2yl-unit-supabase-db-init.service.drv327  /nix/store/dgm1f7y3gvjqjfv7r4gfa7pjffgzr4nj-system-units.drv328  /nix/store/sc9b344gbckg6fqywin6bhhs882d6mxa-etc.drv329  /nix/store/k4pazrfsvz1hsx7l4d0jsxvan5b3dq49-activate.drv330  /nix/store/m7z7bg6jaainvrfsikwclppim5yf6kn3-nixos-system-server-test.drv331  /nix/store/70bg25srcrfnwivfph4bhslzhigdgpxw-unit-dbus.service.drv332  /nix/store/cpy2j0c5ribiykpjaig0axzryxzh1g69-user-units.drv333  /nix/store/qbfmigmm8fk4v5nhvb8h71hmhmdaky0g-supabase-db-init.drv334  /nix/store/ggfylf6a7iwk3pn3r08m30684z8rrq5l-unit-supabase-db-init.service.drv335  /nix/store/qsr1582sizlpmavcla4x0gbp3q52g4pd-unit-postgresql.service.drv336  /nix/store/ydkqsx664pp5ndcfl70c84mvxgixix01-system-units.drv337  /nix/store/y3dck3diii9z9x0w771pz541gjd0zwh3-etc.drv338  /nix/store/srl146pjpar66ijj6l2zw99pmy6wpkl9-activate.drv339  /nix/store/sjl12wxd1wb23d9hzlzyqrq731lbrgpb-nixos-system-server-test.drv340  /nix/store/qv2lxny9548lwqjzpi75n12qpyc0fm56-closure-info.drv341  /nix/store/8vx14rz8lihgxgq3s0daqnbhbvnsf97x-run-nixos-vm.drv342  /nix/store/63q2a748lli2nxvrk228r5l81997jmzh-nixos-vm.drv343  /nix/store/f5ag6q383ylinjj19xamcwyc9j44nghl-nixos-test-driver-pgsodium.drv344  /nix/store/gys1fd1aqlqfzpdsbnk6lm0izbh22bgl-vm-test-run-pgsodium.drv345building '/nix/store/a7qnf8v2hw96v6kdba9j02fljccy432g-pg_tle.drv' on 'ssh-ng://nixbot-remote-build@78.232.36.247'346building '/nix/store/a7qnf8v2hw96v6kdba9j02fljccy432g-pg_tle.drv'347pg_tle> created 22 symlinks in user environment348pg_tle> +++++ ls -A /nix/store/40caz847j51dm8m5s0vizmwc3bww9z26-pg_tle/lib/pg_tle-1.0.1.so /nix/store/40caz847j51dm8m5s0vizmwc3bww9z26-pg_tle/lib/pg_tle-1.0.4.so /nix/store/40caz847j51dm8m5s0vizmwc3bww9z26-pg_tle/lib/pg_tle-1.3.0.so /nix/store/40caz847j51dm8m5s0vizmwc3bww9z26-pg_tle/lib/pg_tle-1.4.0.so /nix/store/40caz847j51dm8m5s0vizmwc3bww9z26-pg_tle/lib/pg_tle.so349pg_tle> +++++ wc -l350pg_tle> ++++ test 5 = 5351building '/nix/store/2i3blwmkdwv0753xgc4pb1rm16gk4jmv-wrappers-0.5.6.drv' on 'ssh-ng://nixbot-remote-build@78.232.36.247'352building '/nix/store/2i3blwmkdwv0753xgc4pb1rm16gk4jmv-wrappers-0.5.6.drv'353wrappers-0.5.6> Running phase: unpackPhase354wrappers-0.5.6> unpacking source archive /nix/store/97rbcnlci3nc6cgx49mygpbn6hdh17a8-source355wrappers-0.5.6> source root is source356wrappers-0.5.6> Executing cargoSetupPostUnpackHook357building '/nix/store/k2r44m3w1mwab1ipx8m72764yyhxr38v-pg_graphql.drv' on 'ssh-ng://nixbot-remote-build@78.232.36.247'358building '/nix/store/k2r44m3w1mwab1ipx8m72764yyhxr38v-pg_graphql.drv'359pg_graphql> created 12 symlinks in user environment360pg_graphql> Processing /nix/store/88zzqwircwf072i707p30jvhpqlj88x1-pg_graphql/share/postgresql/extension/pg_graphql--1.5.11.sql361pg_graphql> Processing /nix/store/88zzqwircwf072i707p30jvhpqlj88x1-pg_graphql/share/postgresql/extension/pg_graphql--1.6.1.sql362pg_graphql> Processing /nix/store/88zzqwircwf072i707p30jvhpqlj88x1-pg_graphql/share/postgresql/extension/pg_graphql--1.6.2.sql363pg_graphql> +++++ wc -l364pg_graphql> +++++ ls -A /nix/store/88zzqwircwf072i707p30jvhpqlj88x1-pg_graphql/lib/pg_graphql-1.5.11.so /nix/store/88zzqwircwf072i707p30jvhpqlj88x1-pg_graphql/lib/pg_graphql-1.5.9.so /nix/store/88zzqwircwf072i707p30jvhpqlj88x1-pg_graphql/lib/pg_graphql-1.6.1.so /nix/store/88zzqwircwf072i707p30jvhpqlj88x1-pg_graphql/lib/pg_graphql-1.6.2.so /nix/store/88zzqwircwf072i707p30jvhpqlj88x1-pg_graphql/lib/pg_graphql.so365pg_graphql> ++++ test 5 = 5366wrappers-0.5.6> Finished cargoSetupPostUnpackHook367wrappers-0.5.6> Running phase: patchPhase368wrappers-0.5.6> Executing cargoSetupPostPatchHook369wrappers-0.5.6> Validating consistency between /build/source/Cargo.lock and /build/cargo-vendor-dir/Cargo.lock370wrappers-0.5.6> Finished cargoSetupPostPatchHook371wrappers-0.5.6> Running phase: updateAutotoolsGnuConfigScriptsPhase372wrappers-0.5.6> Running phase: configurePhase373wrappers-0.5.6> {"success":"true"}374wrappers-0.5.6> Running phase: buildPhase375wrappers-0.5.6> Executing cargo-pgrx buildPhase376wrappers-0.5.6>    Validating /nix/store/9q4p23a2y63xn8safzzn6lbn07bnkshs-postgresql-17.11/bin/pg_config377wrappers-0.5.6>  Initializing data directory at /build/tmp.4VUbarFPiQ/data-17378wrappers-0.5.6> waiting for server to start....2026-10-06 14:23:37.811 GMT [74] LOG:  starting PostgreSQL 17.11 on aarch64-unknown-linux-gnu, compiled by gcc (GCC) 15.2.0, 64-bit379wrappers-0.5.6> 2026-10-06 14:23:37.814 GMT [74] LOG:  listening on Unix socket "/build/tmp.AXKORqa2rx/.s.PGSQL.5432"380wrappers-0.5.6> 2026-10-06 14:23:37.829 GMT [77] LOG:  database system was shut down at 2026-10-06 14:23:37 GMT381wrappers-0.5.6> 2026-10-06 14:23:37.835 GMT [74] LOG:  database system is ready to accept connections382wrappers-0.5.6>  done383wrappers-0.5.6> server started384wrappers-0.5.6> createuser: error: connection to server at "localhost" (127.0.0.1), port 5432 failed: Connection refused385wrappers-0.5.6> 	Is the server running on that host and accepting TCP/IP connections?386wrappers-0.5.6> waiting for server to shut down....2026-10-06 14:23:37.895 GMT [74] LOG:  received fast shutdown request387wrappers-0.5.6> 2026-10-06 14:23:37.898 GMT [74] LOG:  aborting any active transactions388wrappers-0.5.6> 2026-10-06 14:23:37.901 GMT [74] LOG:  background worker "logical replication launcher" (PID 80) exited with exit code 1389wrappers-0.5.6> 2026-10-06 14:23:37.901 GMT [75] LOG:  shutting down390wrappers-0.5.6> 2026-10-06 14:23:37.904 GMT [75] LOG:  checkpoint starting: shutdown immediate391wrappers-0.5.6> 2026-10-06 14:23:37.931 GMT [75] LOG:  checkpoint complete: wrote 3 buffers (0.0%); 0 WAL file(s) added, 0 removed, 0 recycled; write=0.010 s, sync=0.002 s, total=0.030 s; sync files=2, longest=0.001 s, average=0.001 s; distance=0 kB, estimate=0 kB; lsn=0/14EC338, redo lsn=0/14EC338392wrappers-0.5.6> 2026-10-06 14:23:37.935 GMT [74] LOG:  database system is shut down393wrappers-0.5.6>  done394wrappers-0.5.6> server stopped395wrappers-0.5.6> /build/source/wrappers /build/source396wrappers-0.5.6>        Using PgConfig("pg17") and `pg_config` from /nix/store/9q4p23a2y63xn8safzzn6lbn07bnkshs-postgresql-17.11/bin/pg_config397wrappers-0.5.6>     Building extension with features helloworld_fdw all_fdws pg17398wrappers-0.5.6>      Running command "/nix/store/75b8m9zabmvypzim2d4lca20y5bymiqj-cargo-1.87.0-aarch64-unknown-linux-gnu/bin/cargo" "build" "--lib" "--release" "--features" "helloworld_fdw all_fdws pg17" "--no-default-features" "--message-format=json-render-diagnostics" "--frozen" "-j" "2"399wrappers-0.5.6>    Compiling proc-macro2 v1.0.95400wrappers-0.5.6>    Compiling unicode-ident v1.0.18401wrappers-0.5.6>    Compiling libc v0.2.172402wrappers-0.5.6>    Compiling quote v1.0.40403wrappers-0.5.6>    Compiling syn v2.0.101404wrappers-0.5.6>    Compiling cfg-if v1.0.0405wrappers-0.5.6>    Compiling serde v1.0.219406wrappers-0.5.6>    Compiling autocfg v1.4.0407wrappers-0.5.6>    Compiling version_check v0.9.5408wrappers-0.5.6>    Compiling shlex v1.3.0409wrappers-0.5.6>    Compiling jobserver v0.1.33410building '/nix/store/0n0iaya9csx9by2pimrx1yglzw8dp4zs-pg_net-0.13.0.drv' on 'ssh-ng://nixbot-remote-build@78.232.36.247'411wrappers-0.5.6>    Compiling cc v1.2.24412building '/nix/store/0n0iaya9csx9by2pimrx1yglzw8dp4zs-pg_net-0.13.0.drv'413pg_net-0.13.0> Running phase: unpackPhase414pg_net-0.13.0> unpacking source archive /nix/store/bxdzbzjn4yi7ch55dlcgzk6npzx2p4jz-source415pg_net-0.13.0> source root is source416pg_net-0.13.0> Running phase: patchPhase417pg_net-0.13.0> Running phase: updateAutotoolsGnuConfigScriptsPhase418pg_net-0.13.0> Running phase: configurePhase419pg_net-0.13.0> no configure script, doing nothing420pg_net-0.13.0> Running phase: buildPhase421pg_net-0.13.0> gcc -Wall -Wmissing-prototypes -Wpointer-arith -Wdeclaration-after-statement -Werror=vla -Wendif-labels -Wmissing-format-attribute -Wimplicit-fallthrough=3 -Wcast-function-type -Wformat-security -fno-strict-aliasing -fwrapv -fexcess-precision=standard -Wno-deprecated-non-prototype -Wno-format-truncation -Wno-stringop-truncation -g -O2 -std=gnu17 -std=c11 -Werror -Wno-declaration-after-statement -fPIC  -DEXTVERSION=\"0.13.0\" -I. -I./ -I/nix/store/48l45fvi99n90x6p9i4cs1lmzby6cb73-postgresql-15.19/include/server -I/nix/store/48l45fvi99n90x6p9i4cs1lmzby6cb73-postgresql-15.19/include/internal -D_GNU_SOURCE  -I/nix/store/p17klc3qq4nl9ihfwqfpi8cnqvcf92xz-libxml2-2.15.1-dev/include/libxml2 -I/nix/store/mglbi4dy4kpx7v1dcgf6iincp5x38hsc-lz4-1.10.0-dev/include -I/nix/store/g41q9md9rdcr3lkydi6f8zd6fza3h1q4-zstd-1.5.7-dev/include -I/nix/store/n2vnr7ycfk6midbzxcwd28qj3bgb50cz-icu4c-75.1-dev/include  -c -o src/worker.o src/worker.c422pg_net-0.13.0> gcc -Wall -Wmissing-prototypes -Wpointer-arith -Wdeclaration-after-statement -Werror=vla -Wendif-labels -Wmissing-format-attribute -Wimplicit-fallthrough=3 -Wcast-function-type -Wformat-security -fno-strict-aliasing -fwrapv -fexcess-precision=standard -Wno-deprecated-non-prototype -Wno-format-truncation -Wno-stringop-truncation -g -O2 -std=gnu17 -std=c11 -Werror -Wno-declaration-after-statement -fPIC  -DEXTVERSION=\"0.13.0\" -I. -I./ -I/nix/store/48l45fvi99n90x6p9i4cs1lmzby6cb73-postgresql-15.19/include/server -I/nix/store/48l45fvi99n90x6p9i4cs1lmzby6cb73-postgresql-15.19/include/internal -D_GNU_SOURCE  -I/nix/store/p17klc3qq4nl9ihfwqfpi8cnqvcf92xz-libxml2-2.15.1-dev/include/libxml2 -I/nix/store/mglbi4dy4kpx7v1dcgf6iincp5x38hsc-lz4-1.10.0-dev/include -I/nix/store/g41q9md9rdcr3lkydi6f8zd6fza3h1q4-zstd-1.5.7-dev/include -I/nix/store/n2vnr7ycfk6midbzxcwd28qj3bgb50cz-icu4c-75.1-dev/include  -c -o src/util.o src/util.c423pg_net-0.13.0> gcc -Wall -Wmissing-prototypes -Wpointer-arith -Wdeclaration-after-statement -Werror=vla -Wendif-labels -Wmissing-format-attribute -Wimplicit-fallthrough=3 -Wcast-function-type -Wformat-security -fno-strict-aliasing -fwrapv -fexcess-precision=standard -Wno-deprecated-non-prototype -Wno-format-truncation -Wno-stringop-truncation -g -O2 -std=gnu17 -std=c11 -Werror -Wno-declaration-after-statement -fPIC  -DEXTVERSION=\"0.13.0\" -I. -I./ -I/nix/store/48l45fvi99n90x6p9i4cs1lmzby6cb73-postgresql-15.19/include/server -I/nix/store/48l45fvi99n90x6p9i4cs1lmzby6cb73-postgresql-15.19/include/internal -D_GNU_SOURCE  -I/nix/store/p17klc3qq4nl9ihfwqfpi8cnqvcf92xz-libxml2-2.15.1-dev/include/libxml2 -I/nix/store/mglbi4dy4kpx7v1dcgf6iincp5x38hsc-lz4-1.10.0-dev/include -I/nix/store/g41q9md9rdcr3lkydi6f8zd6fza3h1q4-zstd-1.5.7-dev/include -I/nix/store/n2vnr7ycfk6midbzxcwd28qj3bgb50cz-icu4c-75.1-dev/include  -c -o src/core.o src/core.c424pg_net-0.13.0> In file included from src/core.c:23:425pg_net-0.13.0> In function 'init_curl_handle',426pg_net-0.13.0>     inlined from 'consume_request_queue' at src/core.c:273:5:427pg_net-0.13.0> src/util.h:6:11: warning: call to 'Wcurl_easy_setopt_err_long' declared with attribute warning: curl_easy_setopt expects a long argument [-Wattribute-warning]428pg_net-0.13.0>     6 |       if (curl_easy_setopt(hdl, opt, prm) != CURLE_OK) \429pg_net-0.13.0>       |           ^~~~~~~~~~~~~~~~430pg_net-0.13.0> src/core.c:94:7: note: in expansion of macro 'CURL_EZ_SETOPT'431pg_net-0.13.0>    94 |       CURL_EZ_SETOPT(curl_ez_handle, CURLOPT_POST, 1);432pg_net-0.13.0>       |       ^~~~~~~~~~~~~~433pg_net-0.13.0> src/util.h:6:11: warning: call to 'Wcurl_easy_setopt_err_long' declared with attribute warning: curl_easy_setopt expects a long argument [-Wattribute-warning]434pg_net-0.13.0>     6 |       if (curl_easy_setopt(hdl, opt, prm) != CURLE_OK) \435pg_net-0.13.0>       |           ^~~~~~~~~~~~~~~~436pg_net-0.13.0> src/core.c:95:7: note: in expansion of macro 'CURL_EZ_SETOPT'437pg_net-0.13.0>    95 |       CURL_EZ_SETOPT(curl_ez_handle, CURLOPT_POSTFIELDSIZE, 0);438pg_net-0.13.0>       |       ^~~~~~~~~~~~~~439pg_net-0.13.0> src/util.h:6:11: warning: call to 'Wcurl_easy_setopt_err_long' declared with attribute warning: curl_easy_setopt expects a long argument [-Wattribute-warning]440pg_net-0.13.0>     6 |       if (curl_easy_setopt(hdl, opt, prm) != CURLE_OK) \441pg_net-0.13.0>       |           ^~~~~~~~~~~~~~~~442pg_net-0.13.0> src/core.c:108:3: note: in expansion of macro 'CURL_EZ_SETOPT'443pg_net-0.13.0>   108 |   CURL_EZ_SETOPT(curl_ez_handle, CURLOPT_TIMEOUT_MS, timeout_milliseconds);444pg_net-0.13.0>       |   ^~~~~~~~~~~~~~445pg_net-0.13.0> src/util.h:6:11: warning: call to 'Wcurl_easy_setopt_err_long' declared with attribute warning: curl_easy_setopt expects a long argument [-Wattribute-warning]446pg_net-0.13.0>     6 |       if (curl_easy_setopt(hdl, opt, prm) != CURLE_OK) \447pg_net-0.13.0>       |           ^~~~~~~~~~~~~~~~448pg_net-0.13.0> src/core.c:110:3: note: in expansion of macro 'CURL_EZ_SETOPT'449pg_net-0.13.0>   110 |   CURL_EZ_SETOPT(curl_ez_handle, CURLOPT_FOLLOWLOCATION, true);450pg_net-0.13.0>       |   ^~~~~~~~~~~~~~451pg_net-0.13.0> gcc -Wall -Wmissing-prototypes -Wpointer-arith -Wdeclaration-after-statement -Werror=vla -Wendif-labels -Wmissing-format-attribute -Wimplicit-fallthrough=3 -Wcast-function-type -Wformat-security -fno-strict-aliasing -fwrapv -fexcess-precision=standard -Wno-deprecated-non-prototype -Wno-format-truncation -Wno-stringop-truncation -g -O2 -std=gnu17 -std=c11 -Werror -Wno-declaration-after-statement -fPIC  -DEXTVERSION=\"0.13.0\" -I. -I./ -I/nix/store/48l45fvi99n90x6p9i4cs1lmzby6cb73-postgresql-15.19/include/server -I/nix/store/48l45fvi99n90x6p9i4cs1lmzby6cb73-postgresql-15.19/include/internal -D_GNU_SOURCE  -I/nix/store/p17klc3qq4nl9ihfwqfpi8cnqvcf92xz-libxml2-2.15.1-dev/include/libxml2 -I/nix/store/mglbi4dy4kpx7v1dcgf6iincp5x38hsc-lz4-1.10.0-dev/include -I/nix/store/g41q9md9rdcr3lkydi6f8zd6fza3h1q4-zstd-1.5.7-dev/include -I/nix/store/n2vnr7ycfk6midbzxcwd28qj3bgb50cz-icu4c-75.1-dev/include  -c -o src/event.o src/event.c452pg_net-0.13.0> In file included from /nix/store/jviasb44hibgh09829gbmbssbz2jjnhz-curl-8.17.0-dev/include/curl/curl.h:3333,453pg_net-0.13.0>                  from /nix/store/jviasb44hibgh09829gbmbssbz2jjnhz-curl-8.17.0-dev/include/curl/multi.h:51,454pg_net-0.13.0>                  from src/event.h:4,455pg_net-0.13.0>                  from src/event.c:6:456pg_net-0.13.0> /nix/store/jviasb44hibgh09829gbmbssbz2jjnhz-curl-8.17.0-dev/include/curl/multi.h:429:23: error: expected identifier or '(' before '__extension__'457pg_net-0.13.0>   429 | CURL_EXTERN CURLMcode curl_multi_setopt(CURLM *multi_handle,458pg_net-0.13.0>       |                       ^~~~~~~~~~~~~~~~~459pg_net-0.13.0> /nix/store/jviasb44hibgh09829gbmbssbz2jjnhz-curl-8.17.0-dev/include/curl/multi.h:429:23: error: expected identifier or '(' before ')' token460pg_net-0.13.0>   429 | CURL_EXTERN CURLMcode curl_multi_setopt(CURLM *multi_handle,461pg_net-0.13.0>       |                       ^~~~~~~~~~~~~~~~~462pg_net-0.13.0> make: *** [<builtin>: src/event.o] Error 1463error: build of '/nix/store/0n0iaya9csx9by2pimrx1yglzw8dp4zs-pg_net-0.13.0.drv' on 'ssh-ng://nixbot-remote-build@78.232.36.247' failed: Cannot build '/nix/store/0n0iaya9csx9by2pimrx1yglzw8dp4zs-pg_net-0.13.0.drv'.464       Reason: builder failed with exit code 2.465       Output paths:466         /nix/store/14dkr1mhbrh869r2k75r03ngw6q7c4ma-pg_net-0.13.0467       Last 25 log lines:468       >       |       ^~~~~~~~~~~~~~469       > src/util.h:6:11: warning: call to 'Wcurl_easy_setopt_err_long' declared with attribute warning: curl_easy_setopt expects a long argument [-Wattribute-warning]470       >     6 |       if (curl_easy_setopt(hdl, opt, prm) != CURLE_OK) \471       >       |           ^~~~~~~~~~~~~~~~472       > src/core.c:108:3: note: in expansion of macro 'CURL_EZ_SETOPT'473       >   108 |   CURL_EZ_SETOPT(curl_ez_handle, CURLOPT_TIMEOUT_MS, timeout_milliseconds);474       >       |   ^~~~~~~~~~~~~~475       > src/util.h:6:11: warning: call to 'Wcurl_easy_setopt_err_long' declared with attribute warning: curl_easy_setopt expects a long argument [-Wattribute-warning]476       >     6 |       if (curl_easy_setopt(hdl, opt, prm) != CURLE_OK) \477       >       |           ^~~~~~~~~~~~~~~~478       > src/core.c:110:3: note: in expansion of macro 'CURL_EZ_SETOPT'479       >   110 |   CURL_EZ_SETOPT(curl_ez_handle, CURLOPT_FOLLOWLOCATION, true);480       >       |   ^~~~~~~~~~~~~~481       > gcc -Wall -Wmissing-prototypes -Wpointer-arith -Wdeclaration-after-statement -Werror=vla -Wendif-labels -Wmissing-format-attribute -Wimplicit-fallthrough=3 -Wcast-function-type -Wformat-security -fno-strict-aliasing -fwrapv -fexcess-precision=standard -Wno-deprecated-non-prototype -Wno-format-truncation -Wno-stringop-truncation -g -O2 -std=gnu17 -std=c11 -Werror -Wno-declaration-after-statement -fPIC  -DEXTVERSION=\"0.13.0\" -I. -I./ -I/nix/store/48l45fvi99n90x6p9i4cs1lmzby6cb73-postgresql-15.19/include/server -I/nix/store/48l45fvi99n90x6p9i4cs1lmzby6cb73-postgresql-15.19/include/internal -D_GNU_SOURCE  -I/nix/store/p17klc3qq4nl9ihfwqfpi8cnqvcf92xz-libxml2-2.15.1-dev/include/libxml2 -I/nix/store/mglbi4dy4kpx7v1dcgf6iincp5x38hsc-lz4-1.10.0-dev/include -I/nix/store/g41q9md9rdcr3lkydi6f8zd6fza3h1q4-zstd-1.5.7-dev/include -I/nix/store/n2vnr7ycfk6midbzxcwd28qj3bgb50cz-icu4c-75.1-dev/include  -c -o src/event.o src/event.c482       > In file included from /nix/store/jviasb44hibgh09829gbmbssbz2jjnhz-curl-8.17.0-dev/include/curl/curl.h:3333,483       >                  from /nix/store/jviasb44hibgh09829gbmbssbz2jjnhz-curl-8.17.0-dev/include/curl/multi.h:51,484       >                  from src/event.h:4,485       >                  from src/event.c:6:486       > /nix/store/jviasb44hibgh09829gbmbssbz2jjnhz-curl-8.17.0-dev/include/curl/multi.h:429:23: error: expected identifier or '(' before '__extension__'487       >   429 | CURL_EXTERN CURLMcode curl_multi_setopt(CURLM *multi_handle,488       >       |                       ^~~~~~~~~~~~~~~~~489       > /nix/store/jviasb44hibgh09829gbmbssbz2jjnhz-curl-8.17.0-dev/include/curl/multi.h:429:23: error: expected identifier or '(' before ')' token490       >   429 | CURL_EXTERN CURLMcode curl_multi_setopt(CURLM *multi_handle,491       >       |                       ^~~~~~~~~~~~~~~~~492       > make: *** [<builtin>: src/event.o] Error 1493       For full logs, run:494         nix log /nix/store/0n0iaya9csx9by2pimrx1yglzw8dp4zs-pg_net-0.13.0.drv495error: Cannot build '/nix/store/0n0iaya9csx9by2pimrx1yglzw8dp4zs-pg_net-0.13.0.drv'.496       Reason: builder failed with exit code 1.497       Output paths:498         /nix/store/14dkr1mhbrh869r2k75r03ngw6q7c4ma-pg_net-0.13.0499wrappers-0.5.6>    Compiling memchr v2.7.4500wrappers-0.5.6>    Compiling serde_derive v1.0.219501wrappers-0.5.6>    Compiling bytes v1.10.1502wrappers-0.5.6>    Compiling zeroize v1.8.1503wrappers-0.5.6>    Compiling once_cell v1.21.3504wrappers-0.5.6>    Compiling pin-project-lite v0.2.16505wrappers-0.5.6>    Compiling libm v0.2.15506wrappers-0.5.6>    Compiling allocator-api2 v0.2.21507wrappers-0.5.6>    Compiling num-traits v0.2.19508wrappers-0.5.6>    Compiling futures-core v0.3.31509wrappers-0.5.6>    Compiling equivalent v1.0.2510wrappers-0.5.6>    Compiling foldhash v0.1.5511wrappers-0.5.6>    Compiling hashbrown v0.15.3512wrappers-0.5.6>    Compiling getrandom v0.2.16513wrappers-0.5.6>    Compiling smallvec v1.15.0514wrappers-0.5.6>    Compiling log v0.4.27515wrappers-0.5.6>    Compiling subtle v2.6.1516wrappers-0.5.6>    Compiling typenum v1.18.0517wrappers-0.5.6>    Compiling futures-io v0.3.31518wrappers-0.5.6>    Compiling lock_api v0.4.12519wrappers-0.5.6>    Compiling parking_lot_core v0.9.10520wrappers-0.5.6>    Compiling slab v0.4.9521wrappers-0.5.6>    Compiling itoa v1.0.15522wrappers-0.5.6>    Compiling scopeguard v1.2.0523wrappers-0.5.6>    Compiling anyhow v1.0.98524wrappers-0.5.6>    Compiling parking_lot v0.12.3525wrappers-0.5.6>    Compiling generic-array v0.14.7526wrappers-0.5.6>    Compiling tokio-macros v2.5.0527wrappers-0.5.6>    Compiling signal-hook-registry v1.4.5528wrappers-0.5.6>    Compiling mio v1.0.4529wrappers-0.5.6>    Compiling socket2 v0.6.0530wrappers-0.5.6>    Compiling pin-utils v0.1.0531wrappers-0.5.6>    Compiling futures-sink v0.3.31532wrappers-0.5.6>    Compiling futures-channel v0.3.31533wrappers-0.5.6>    Compiling tokio v1.47.1534wrappers-0.5.6>    Compiling futures-macro v0.3.31535wrappers-0.5.6>    Compiling futures-task v0.3.31536wrappers-0.5.6>    Compiling futures-util v0.3.31537wrappers-0.5.6>    Compiling const-oid v0.9.6538wrappers-0.5.6>    Compiling indexmap v2.9.0539wrappers-0.5.6>    Compiling rand_core v0.6.4540wrappers-0.5.6>    Compiling synstructure v0.13.2541wrappers-0.5.6>    Compiling ryu v1.0.20542wrappers-0.5.6>    Compiling zerofrom-derive v0.1.6543wrappers-0.5.6>    Compiling crypto-common v0.1.6544wrappers-0.5.6>    Compiling bitflags v2.9.1545wrappers-0.5.6>    Compiling yoke-derive v0.8.0546wrappers-0.5.6>    Compiling num-integer v0.1.46547wrappers-0.5.6>    Compiling block-buffer v0.10.4548wrappers-0.5.6>    Compiling fnv v1.0.7549wrappers-0.5.6>    Compiling digest v0.10.7550wrappers-0.5.6>    Compiling zerocopy v0.8.25551wrappers-0.5.6>    Compiling zerovec-derive v0.11.1552wrappers-0.5.6>    Compiling getrandom v0.3.3553wrappers-0.5.6>    Compiling tracing-core v0.1.33554wrappers-0.5.6>    Compiling tracing-attributes v0.1.28555wrappers-0.5.6>    Compiling tokio-util v0.7.15556wrappers-0.5.6>    Compiling tracing v0.1.41557wrappers-0.5.6>    Compiling displaydoc v0.2.5558wrappers-0.5.6>    Compiling regex-syntax v0.8.5559wrappers-0.5.6>    Compiling pkg-config v0.3.32560wrappers-0.5.6>    Compiling either v1.15.0561wrappers-0.5.6>    Compiling percent-encoding v2.3.1562wrappers-0.5.6>    Compiling http v1.3.1563wrappers-0.5.6>    Compiling aho-corasick v1.1.3564wrappers-0.5.6>    Compiling icu_properties_data v2.0.1565wrappers-0.5.6>    Compiling serde_json v1.0.140566wrappers-0.5.6>    Compiling icu_normalizer_data v2.0.0567wrappers-0.5.6>    Compiling regex-automata v0.4.9568wrappers-0.5.6>    Compiling http-body v1.0.1569wrappers-0.5.6>    Compiling base64ct v1.7.3570wrappers-0.5.6>    Compiling openssl-probe v0.1.6571wrappers-0.5.6>    Compiling ring v0.17.14572wrappers-0.5.6>    Compiling cpufeatures v0.2.17573wrappers-0.5.6>    Compiling regex v1.11.1574wrappers-0.5.6>    Compiling hmac v0.12.1575wrappers-0.5.6>    Compiling httparse v1.10.1576wrappers-0.5.6>    Compiling try-lock v0.2.5577wrappers-0.5.6>    Compiling tower-service v0.3.3578wrappers-0.5.6>    Compiling thiserror v1.0.69579wrappers-0.5.6>    Compiling want v0.3.1580wrappers-0.5.6>    Compiling http-body-util v0.1.3581wrappers-0.5.6>    Compiling http v0.2.12582wrappers-0.5.6>    Compiling zerofrom v0.1.6583wrappers-0.5.6>    Compiling socket2 v0.5.10584wrappers-0.5.6>    Compiling stable_deref_trait v1.2.0585wrappers-0.5.6>    Compiling untrusted v0.9.0586wrappers-0.5.6>    Compiling base64 v0.22.1587wrappers-0.5.6>    Compiling atomic-waker v1.1.2588wrappers-0.5.6>    Compiling httpdate v1.0.3589wrappers-0.5.6>    Compiling yoke v0.8.0590wrappers-0.5.6>    Compiling sha2 v0.10.9591wrappers-0.5.6>    Compiling thiserror-impl v1.0.69592wrappers-0.5.6>    Compiling cmake v0.1.54593wrappers-0.5.6>    Compiling semver v1.0.26594wrappers-0.5.6>    Compiling fs_extra v1.3.0595wrappers-0.5.6>    Compiling dunce v1.0.5596wrappers-0.5.6>    Compiling aws-lc-sys v0.29.0597wrappers-0.5.6>    Compiling rustls-pki-types v1.12.0598wrappers-0.5.6>    Compiling crc32fast v1.4.2599wrappers-0.5.6>    Compiling zerovec v0.11.2600wrappers-0.5.6>    Compiling http-body v0.4.6601wrappers-0.5.6>    Compiling form_urlencoded v1.2.1602wrappers-0.5.6>    Compiling ppv-lite86 v0.2.21603wrappers-0.5.6>    Compiling iana-time-zone v0.1.63604wrappers-0.5.6>    Compiling chrono v0.4.41605wrappers-0.5.6>    Compiling heck v0.5.0606wrappers-0.5.6>    Compiling aws-lc-rs v1.13.1607wrappers-0.5.6>    Compiling crossbeam-utils v0.8.21608wrappers-0.5.6>    Compiling vcpkg v0.2.15609wrappers-0.5.6>    Compiling ipnet v2.11.0610wrappers-0.5.6>    Compiling tinystr v0.8.1611wrappers-0.5.6>    Compiling litemap v0.8.0612wrappers-0.5.6>    Compiling writeable v0.6.1613wrappers-0.5.6>    Compiling base64 v0.21.7614wrappers-0.5.6>    Compiling powerfmt v0.2.0615wrappers-0.5.6>    Compiling deranged v0.4.0616wrappers-0.5.6>    Compiling icu_locale_core v2.0.0617wrappers-0.5.6>    Compiling potential_utf v0.1.2618wrappers-0.5.6>    Compiling zerotrie v0.2.2619wrappers-0.5.6>    Compiling h2 v0.4.12620wrappers-0.5.6>    Compiling num_threads v0.1.7621wrappers-0.5.6>    Compiling hex v0.4.3622wrappers-0.5.6>    Compiling rustls v0.23.31623wrappers-0.5.6>    Compiling num-conv v0.1.0624wrappers-0.5.6>    Compiling time-core v0.1.4625wrappers-0.5.6>    Compiling static_assertions v1.1.0626wrappers-0.5.6>    Compiling time v0.3.41627building '/nix/store/g6nfp5n056kw2jvfzldzxrrrxfpfcka0-pg_net-0.13.0.drv' on 'ssh-ng://nixbot-remote-build@78.232.36.247'628building '/nix/store/g6nfp5n056kw2jvfzldzxrrrxfpfcka0-pg_net-0.13.0.drv'629pg_net-0.13.0> Running phase: unpackPhase630pg_net-0.13.0> unpacking source archive /nix/store/bxdzbzjn4yi7ch55dlcgzk6npzx2p4jz-source631pg_net-0.13.0> source root is source632pg_net-0.13.0> Running phase: patchPhase633pg_net-0.13.0> Running phase: updateAutotoolsGnuConfigScriptsPhase634pg_net-0.13.0> Running phase: configurePhase635pg_net-0.13.0> no configure script, doing nothing636pg_net-0.13.0> Running phase: buildPhase637pg_net-0.13.0> gcc -Wall -Wmissing-prototypes -Wpointer-arith -Wdeclaration-after-statement -Werror=vla -Wendif-labels -Wmissing-format-attribute -Wimplicit-fallthrough=3 -Wcast-function-type -Wshadow=compatible-local -Wformat-security -fno-strict-aliasing -fwrapv -fexcess-precision=standard -Wno-format-truncation -Wno-stringop-truncation -g -O2 -std=c11 -Werror -Wno-declaration-after-statement -fPIC -fvisibility=hidden  -DEXTVERSION=\"0.13.0\" -I. -I./ -I/nix/store/9q4p23a2y63xn8safzzn6lbn07bnkshs-postgresql-17.11/include/server -I/nix/store/9q4p23a2y63xn8safzzn6lbn07bnkshs-postgresql-17.11/include/internal -D_GNU_SOURCE  -I/nix/store/p17klc3qq4nl9ihfwqfpi8cnqvcf92xz-libxml2-2.15.1-dev/include/libxml2 -I/nix/store/mglbi4dy4kpx7v1dcgf6iincp5x38hsc-lz4-1.10.0-dev/include -I/nix/store/g41q9md9rdcr3lkydi6f8zd6fza3h1q4-zstd-1.5.7-dev/include -I/nix/store/n2vnr7ycfk6midbzxcwd28qj3bgb50cz-icu4c-75.1-dev/include  -c -o src/worker.o src/worker.c638pg_net-0.13.0> gcc -Wall -Wmissing-prototypes -Wpointer-arith -Wdeclaration-after-statement -Werror=vla -Wendif-labels -Wmissing-format-attribute -Wimplicit-fallthrough=3 -Wcast-function-type -Wshadow=compatible-local -Wformat-security -fno-strict-aliasing -fwrapv -fexcess-precision=standard -Wno-format-truncation -Wno-stringop-truncation -g -O2 -std=c11 -Werror -Wno-declaration-after-statement -fPIC -fvisibility=hidden  -DEXTVERSION=\"0.13.0\" -I. -I./ -I/nix/store/9q4p23a2y63xn8safzzn6lbn07bnkshs-postgresql-17.11/include/server -I/nix/store/9q4p23a2y63xn8safzzn6lbn07bnkshs-postgresql-17.11/include/internal -D_GNU_SOURCE  -I/nix/store/p17klc3qq4nl9ihfwqfpi8cnqvcf92xz-libxml2-2.15.1-dev/include/libxml2 -I/nix/store/mglbi4dy4kpx7v1dcgf6iincp5x38hsc-lz4-1.10.0-dev/include -I/nix/store/g41q9md9rdcr3lkydi6f8zd6fza3h1q4-zstd-1.5.7-dev/include -I/nix/store/n2vnr7ycfk6midbzxcwd28qj3bgb50cz-icu4c-75.1-dev/include  -c -o src/util.o src/util.c639pg_net-0.13.0> gcc -Wall -Wmissing-prototypes -Wpointer-arith -Wdeclaration-after-statement -Werror=vla -Wendif-labels -Wmissing-format-attribute -Wimplicit-fallthrough=3 -Wcast-function-type -Wshadow=compatible-local -Wformat-security -fno-strict-aliasing -fwrapv -fexcess-precision=standard -Wno-format-truncation -Wno-stringop-truncation -g -O2 -std=c11 -Werror -Wno-declaration-after-statement -fPIC -fvisibility=hidden  -DEXTVERSION=\"0.13.0\" -I. -I./ -I/nix/store/9q4p23a2y63xn8safzzn6lbn07bnkshs-postgresql-17.11/include/server -I/nix/store/9q4p23a2y63xn8safzzn6lbn07bnkshs-postgresql-17.11/include/internal -D_GNU_SOURCE  -I/nix/store/p17klc3qq4nl9ihfwqfpi8cnqvcf92xz-libxml2-2.15.1-dev/include/libxml2 -I/nix/store/mglbi4dy4kpx7v1dcgf6iincp5x38hsc-lz4-1.10.0-dev/include -I/nix/store/g41q9md9rdcr3lkydi6f8zd6fza3h1q4-zstd-1.5.7-dev/include -I/nix/store/n2vnr7ycfk6midbzxcwd28qj3bgb50cz-icu4c-75.1-dev/include  -c -o src/core.o src/core.c640pg_net-0.13.0> In file included from src/core.c:23:641pg_net-0.13.0> In function 'init_curl_handle',642pg_net-0.13.0>     inlined from 'consume_request_queue' at src/core.c:273:5:643pg_net-0.13.0> src/util.h:6:11: warning: call to 'Wcurl_easy_setopt_err_long' declared with attribute warning: curl_easy_setopt expects a long argument [-Wattribute-warning]644pg_net-0.13.0>     6 |       if (curl_easy_setopt(hdl, opt, prm) != CURLE_OK) \645pg_net-0.13.0>       |           ^~~~~~~~~~~~~~~~646pg_net-0.13.0> src/core.c:94:7: note: in expansion of macro 'CURL_EZ_SETOPT'647pg_net-0.13.0>    94 |       CURL_EZ_SETOPT(curl_ez_handle, CURLOPT_POST, 1);648pg_net-0.13.0>       |       ^~~~~~~~~~~~~~649pg_net-0.13.0> src/util.h:6:11: warning: call to 'Wcurl_easy_setopt_err_long' declared with attribute warning: curl_easy_setopt expects a long argument [-Wattribute-warning]650pg_net-0.13.0>     6 |       if (curl_easy_setopt(hdl, opt, prm) != CURLE_OK) \651pg_net-0.13.0>       |           ^~~~~~~~~~~~~~~~652pg_net-0.13.0> src/core.c:95:7: note: in expansion of macro 'CURL_EZ_SETOPT'653pg_net-0.13.0>    95 |       CURL_EZ_SETOPT(curl_ez_handle, CURLOPT_POSTFIELDSIZE, 0);654pg_net-0.13.0>       |       ^~~~~~~~~~~~~~655pg_net-0.13.0> src/util.h:6:11: warning: call to 'Wcurl_easy_setopt_err_long' declared with attribute warning: curl_easy_setopt expects a long argument [-Wattribute-warning]656pg_net-0.13.0>     6 |       if (curl_easy_setopt(hdl, opt, prm) != CURLE_OK) \657pg_net-0.13.0>       |           ^~~~~~~~~~~~~~~~658pg_net-0.13.0> src/core.c:108:3: note: in expansion of macro 'CURL_EZ_SETOPT'659pg_net-0.13.0>   108 |   CURL_EZ_SETOPT(curl_ez_handle, CURLOPT_TIMEOUT_MS, timeout_milliseconds);660pg_net-0.13.0>       |   ^~~~~~~~~~~~~~661pg_net-0.13.0> src/util.h:6:11: warning: call to 'Wcurl_easy_setopt_err_long' declared with attribute warning: curl_easy_setopt expects a long argument [-Wattribute-warning]662pg_net-0.13.0>     6 |       if (curl_easy_setopt(hdl, opt, prm) != CURLE_OK) \663pg_net-0.13.0>       |           ^~~~~~~~~~~~~~~~664pg_net-0.13.0> src/core.c:110:3: note: in expansion of macro 'CURL_EZ_SETOPT'665pg_net-0.13.0>   110 |   CURL_EZ_SETOPT(curl_ez_handle, CURLOPT_FOLLOWLOCATION, true);666pg_net-0.13.0>       |   ^~~~~~~~~~~~~~667pg_net-0.13.0> gcc -Wall -Wmissing-prototypes -Wpointer-arith -Wdeclaration-after-statement -Werror=vla -Wendif-labels -Wmissing-format-attribute -Wimplicit-fallthrough=3 -Wcast-function-type -Wshadow=compatible-local -Wformat-security -fno-strict-aliasing -fwrapv -fexcess-precision=standard -Wno-format-truncation -Wno-stringop-truncation -g -O2 -std=c11 -Werror -Wno-declaration-after-statement -fPIC -fvisibility=hidden  -DEXTVERSION=\"0.13.0\" -I. -I./ -I/nix/store/9q4p23a2y63xn8safzzn6lbn07bnkshs-postgresql-17.11/include/server -I/nix/store/9q4p23a2y63xn8safzzn6lbn07bnkshs-postgresql-17.11/include/internal -D_GNU_SOURCE  -I/nix/store/p17klc3qq4nl9ihfwqfpi8cnqvcf92xz-libxml2-2.15.1-dev/include/libxml2 -I/nix/store/mglbi4dy4kpx7v1dcgf6iincp5x38hsc-lz4-1.10.0-dev/include -I/nix/store/g41q9md9rdcr3lkydi6f8zd6fza3h1q4-zstd-1.5.7-dev/include -I/nix/store/n2vnr7ycfk6midbzxcwd28qj3bgb50cz-icu4c-75.1-dev/include  -c -o src/event.o src/event.c668pg_net-0.13.0> In file included from /nix/store/jviasb44hibgh09829gbmbssbz2jjnhz-curl-8.17.0-dev/include/curl/curl.h:3333,669pg_net-0.13.0>                  from /nix/store/jviasb44hibgh09829gbmbssbz2jjnhz-curl-8.17.0-dev/include/curl/multi.h:51,670pg_net-0.13.0>                  from src/event.h:4,671pg_net-0.13.0>                  from src/event.c:6:672pg_net-0.13.0> /nix/store/jviasb44hibgh09829gbmbssbz2jjnhz-curl-8.17.0-dev/include/curl/multi.h:429:23: error: expected identifier or '(' before '__extension__'673pg_net-0.13.0>   429 | CURL_EXTERN CURLMcode curl_multi_setopt(CURLM *multi_handle,674pg_net-0.13.0>       |                       ^~~~~~~~~~~~~~~~~675pg_net-0.13.0> /nix/store/jviasb44hibgh09829gbmbssbz2jjnhz-curl-8.17.0-dev/include/curl/multi.h:429:23: error: expected identifier or '(' before ')' token676pg_net-0.13.0>   429 | CURL_EXTERN CURLMcode curl_multi_setopt(CURLM *multi_handle,677pg_net-0.13.0>       |                       ^~~~~~~~~~~~~~~~~678pg_net-0.13.0> make: *** [<builtin>: src/event.o] Error 1679error: build of '/nix/store/g6nfp5n056kw2jvfzldzxrrrxfpfcka0-pg_net-0.13.0.drv' on 'ssh-ng://nixbot-remote-build@78.232.36.247' failed: Cannot build '/nix/store/g6nfp5n056kw2jvfzldzxrrrxfpfcka0-pg_net-0.13.0.drv'.680       Reason: builder failed with exit code 2.681       Output paths:682         /nix/store/0z6qc5i8vhckm5s9j7br24f5kfxsgds5-pg_net-0.13.0683       Last 25 log lines:684       >       |       ^~~~~~~~~~~~~~685       > src/util.h:6:11: warning: call to 'Wcurl_easy_setopt_err_long' declared with attribute warning: curl_easy_setopt expects a long argument [-Wattribute-warning]686       >     6 |       if (curl_easy_setopt(hdl, opt, prm) != CURLE_OK) \687       >       |           ^~~~~~~~~~~~~~~~688       > src/core.c:108:3: note: in expansion of macro 'CURL_EZ_SETOPT'689       >   108 |   CURL_EZ_SETOPT(curl_ez_handle, CURLOPT_TIMEOUT_MS, timeout_milliseconds);690       >       |   ^~~~~~~~~~~~~~691       > src/util.h:6:11: warning: call to 'Wcurl_easy_setopt_err_long' declared with attribute warning: curl_easy_setopt expects a long argument [-Wattribute-warning]692       >     6 |       if (curl_easy_setopt(hdl, opt, prm) != CURLE_OK) \693       >       |           ^~~~~~~~~~~~~~~~694       > src/core.c:110:3: note: in expansion of macro 'CURL_EZ_SETOPT'695       >   110 |   CURL_EZ_SETOPT(curl_ez_handle, CURLOPT_FOLLOWLOCATION, true);696       >       |   ^~~~~~~~~~~~~~697       > gcc -Wall -Wmissing-prototypes -Wpointer-arith -Wdeclaration-after-statement -Werror=vla -Wendif-labels -Wmissing-format-attribute -Wimplicit-fallthrough=3 -Wcast-function-type -Wshadow=compatible-local -Wformat-security -fno-strict-aliasing -fwrapv -fexcess-precision=standard -Wno-format-truncation -Wno-stringop-truncation -g -O2 -std=c11 -Werror -Wno-declaration-after-statement -fPIC -fvisibility=hidden  -DEXTVERSION=\"0.13.0\" -I. -I./ -I/nix/store/9q4p23a2y63xn8safzzn6lbn07bnkshs-postgresql-17.11/include/server -I/nix/store/9q4p23a2y63xn8safzzn6lbn07bnkshs-postgresql-17.11/include/internal -D_GNU_SOURCE  -I/nix/store/p17klc3qq4nl9ihfwqfpi8cnqvcf92xz-libxml2-2.15.1-dev/include/libxml2 -I/nix/store/mglbi4dy4kpx7v1dcgf6iincp5x38hsc-lz4-1.10.0-dev/include -I/nix/store/g41q9md9rdcr3lkydi6f8zd6fza3h1q4-zstd-1.5.7-dev/include -I/nix/store/n2vnr7ycfk6midbzxcwd28qj3bgb50cz-icu4c-75.1-dev/include  -c -o src/event.o src/event.c698       > In file included from /nix/store/jviasb44hibgh09829gbmbssbz2jjnhz-curl-8.17.0-dev/include/curl/curl.h:3333,699       >                  from /nix/store/jviasb44hibgh09829gbmbssbz2jjnhz-curl-8.17.0-dev/include/curl/multi.h:51,700       >                  from src/event.h:4,701       >                  from src/event.c:6:702       > /nix/store/jviasb44hibgh09829gbmbssbz2jjnhz-curl-8.17.0-dev/include/curl/multi.h:429:23: error: expected identifier or '(' before '__extension__'703       >   429 | CURL_EXTERN CURLMcode curl_multi_setopt(CURLM *multi_handle,704       >       |                       ^~~~~~~~~~~~~~~~~705       > /nix/store/jviasb44hibgh09829gbmbssbz2jjnhz-curl-8.17.0-dev/include/curl/multi.h:429:23: error: expected identifier or '(' before ')' token706       >   429 | CURL_EXTERN CURLMcode curl_multi_setopt(CURLM *multi_handle,707       >       |                       ^~~~~~~~~~~~~~~~~708       > make: *** [<builtin>: src/event.o] Error 1709       For full logs, run:710         nix log /nix/store/g6nfp5n056kw2jvfzldzxrrrxfpfcka0-pg_net-0.13.0.drv711error: Cannot build '/nix/store/g6nfp5n056kw2jvfzldzxrrrxfpfcka0-pg_net-0.13.0.drv'.712       Reason: builder failed with exit code 1.713       Output paths:714         /nix/store/0z6qc5i8vhckm5s9j7br24f5kfxsgds5-pg_net-0.13.0715wrappers-0.5.6>    Compiling hyper v1.6.0716building '/nix/store/hygnfcb7az5nw4c4aranasi27gnhzgan-wrappers-0.6.3.drv' on 'ssh-ng://nixbot-remote-build@78.232.36.247'