nixbot

builds

cancelled checks.aarch64-linux.ext-pgjwt build #132 · raw · eval 31.7 s · 2.2 GiB allocated · ·

1these 343 derivations will be built:2  /nix/store/09yw6by1xkgwvadzkn03bvaxw955v632-pg_partman.drv3  /nix/store/0cmixqwsz3vb82j49j1mhvyk8crg4dcw-wrappers-0.6.0.drv4  /nix/store/f4fxzxll7q3m5cy6rib758j63zcky8dk-supabase_vault-0.2.8.drv5  /nix/store/zyzrb73x0fw62dyxqdz0znqnzvgqa7g6-supabase_vault-0.3.1.drv6  /nix/store/0dxji73cc07dbqk8nny6y5mkf5qr6kl8-supabase_vault.drv7  /nix/store/fl27cr5qdrq44nk61x5yjlqxsrc8mg3n-pgsodium-3.0.4.drv8  /nix/store/jl20dg8fxlmlv84f7cda9xa6mq8y46sr-pgsodium-3.1.7.drv9  /nix/store/l6md1p6ahq43yili977j4021ky05la94-pgsodium-3.1.8.drv10  /nix/store/pvz0jf5drhdz4jj5k592kxbdgk4lm52r-pgsodium-3.1.6.drv11  /nix/store/zdz6b4s43i332x3xlvjivc7p4csihzba-pgsodium-3.1.5.drv12  /nix/store/0h7mnh8was4m19z53z0dmakrp0c9271q-pgsodium.drv13  /nix/store/0i6b8yy32fc4mgfm75w94gw9ja033kw5-wrappers-0.5.5.drv14  /nix/store/qbrypyj5k7h0pffxxshbyym24h89f2y1-gdal-3.8.5.drv15  /nix/store/l9h30apsjb4s39av0lwsad1vv59rdkv6-cgal-6.0.2.drv16  /nix/store/s3myd88a11h86h3h8cvhgd1im0zk6i65-sfcgal-2.2.0.drv17  /nix/store/h1vl8vpk154yppn5lcqms2680igi0mmj-postgis-3.3.2.drv18  /nix/store/2ylkw9crapb58vd5g0vj602jfyb1p3r6-postgis.drv19  /nix/store/58cinn47vbvwr1wxdkspmvi9cj27b07h-safeupdate-1.4.drv20  /nix/store/6c0mnd757hvxppfyrsf4cb1wgnbd4111-safeupdate.drv21  /nix/store/ciwky5vscrx4c52kr30fm8j4idj8qgsn-pg_stat_monitor-2.1.drv22  /nix/store/7a02zvvkkkriis78wgz6n8nnkwm2gh22-pg_stat_monitor.drv23  /nix/store/9gh7fip2wf0wip8wnv1axd8ghar0x5fb-pgmq-1.5.1.drv24  /nix/store/k4swwy7459wf558rbrraclsr4sjccz0h-pgmq-1.4.4.drv25  /nix/store/8zsadvm8mv18kpy4qy724ps2jlbsik0w-pgmq.drv26  /nix/store/4wk9vb1q3kdnhj8hsq8pwgbp82glwg9w-timescaledb-2.9.1.drv27  /nix/store/9wzj3wh6sczzk849dmjwvmnkshggakxp-timescaledb.drv28  /nix/store/2nmg9sxx50xmndps3714hbvwjyd5rqv0-vector-0.8.2.drv29  /nix/store/94d6rmv5v8zdjsgzl3yrhpg7zq6zdjpx-vector-0.5.1.drv30  /nix/store/alajylsl9b90m65n0ps0mkbkw679x4sn-vector-0.6.2.drv31  /nix/store/jmilv9h5p0v4grgqnhfn22i7zl352ybh-vector-0.7.4.drv32  /nix/store/q3mdjvqpw4xbwcjy5y1ps1igxsjvx133-vector-0.7.0.drv33  /nix/store/v5dnr617av2jgk6kpddxbxxqjqgl5kzg-vector-0.8.0.drv34  /nix/store/z40s48rz55qgpw6g6wiqi68hkfas4h1l-vector-0.6.0.drv35  /nix/store/zygvf0wgqsyi96fangshfkwjiyylhvkz-vector-0.4.0.drv36  /nix/store/9zndhfzc45vrfn297g1hav7m6ba3rlzk-vector.drv37  /nix/store/0nln7k62ggiw9s5y0icr3hyribl5iazb-pg_graphql-1.2.3.drv38  /nix/store/63ifr5p2wzl7vygaj7pq847nwnrnxm3p-pg_graphql-1.5.0.drv39  /nix/store/6hfik9nnrihzb6dj53in06v6a4qmgsj3-pg_graphql-1.5.7.drv40  /nix/store/7pqhalqwaggagybgy24lm93c5b8d4isk-pg_graphql-1.4.2.drv41  /nix/store/ag5rlkqwfkwlgvxg1yhivjqfcaq2w14v-pg_graphql-1.5.1-mergeless.drv42  /nix/store/cgazfazb4ak4csd48khgjsa4vxmmddfb-pg_graphql-1.5.11.drv43  /nix/store/d78fjdz9zrccq7f563jz9fj1a45yrq5x-pg_graphql-1.1.0.drv44  /nix/store/dk0a0irlxsl04249qy2dnc6bm4wkk1lc-pg_graphql-1.6.1.drv45  /nix/store/dnwfmlfwyqnkzy2jyzf6h3q044wk6hbg-pg_graphql-1.5.9.drv46  /nix/store/f694g0m8chfk6z6yh787135bzcqwnli4-pg_graphql-1.5.4.drv47  /nix/store/fsgiwnrg38ssgf05vkmzc21v93a36qmd-pg_graphql-1.2.2.drv48  /nix/store/h9damb814a5fmzyc5wgcildkm32vy1bv-pg_graphql-1.6.2.drv49  /nix/store/iq0gzwfxzxkns0gpdkhjx1cc6s4q1i2q-pg_graphql-1.5.6.drv50  /nix/store/q66z8j5qs96rgahzmlrq4n41d2avywar-pg_graphql-1.0.2.drv51  /nix/store/v0mqjlj6j73wpc66h34djrv08j7q3l8w-pg_graphql-1.4.4.drv52  /nix/store/wnn3f47lz59i84mdzvmc1a7man89cmic-pg_graphql-1.2.0.drv53  /nix/store/yds474rgqgxjdw6zm0ylvpvvd4l0xmkl-pg_graphql-1.4.1.drv54  /nix/store/yhfqz2chz94q9k3rv8hgwcsyri02wlm8-pg_graphql-1.5.1.drv55  /nix/store/a4icbsgspmpi3nfs8vffp42sg9v7a25f-pg_graphql.drv56  /nix/store/a7qnf8v2hw96v6kdba9j02fljccy432g-pg_tle.drv57  /nix/store/c08rdgxba5n6zhyp78l8sd6fhnbc4a4c-pgsodium-3.1.7.drv58  /nix/store/hh2jpg5qdwgdwzi96qcay1a5ffhi0f4i-pgsodium-3.1.6.drv59  /nix/store/jwrjvb9m50v44sla4jpig83jab7zn17x-pgsodium-3.1.8.drv60  /nix/store/m1xdmpffkflwgdin5ljvfh72wxq5lxpx-pgsodium-3.1.5.drv61  /nix/store/wjhhlaiwzvm5m08my4d983icdmcpllzd-pgsodium-3.0.4.drv62  /nix/store/a9laaq557mna86dm87lq3211xy5h2zyl-pgsodium.drv63  /nix/store/ag6xlrckwkx594nhf6j3sq2ngwbryyz8-http.drv64  /nix/store/i0gq8yqxp5h7l782n2ki94b1d62m6zsg-plpgsql_check-2.2.drv65  /nix/store/q117a7mx5d5bzln8xg24fh1vfzq7bsz4-plpgsql_check-2.7.drv66  /nix/store/rj6qw8pwvr91cy6qyp8xibrw4arrpj9j-plpgsql_check-2.8.drv67  /nix/store/c782i897gj20c0r8bmphf8p6r5s5wdli-plpgsql_check.drv68  /nix/store/b139hl0gpc9icb6j6q28gl1chw7i9260-rum-1.3.drv69  /nix/store/csvzp35khfq15v5g275y14094s58v10k-rum.drv70  /nix/store/c2pcswnd4yfp02pas6a7grpm0fmk70wx-supabase_vault-0.3.1.drv71  /nix/store/jb3j93i6ljmvqkv5cnv3lh3d9zn4zcjz-supabase_vault-0.2.8.drv72  /nix/store/gc3nb7r1a8rbf6f8yf4zs2nnb65awkxq-supabase_vault.drv73  /nix/store/7inhp3jz4x6l1m2i6aa1w6bbb91r1hay-pgroonga-3.2.5.drv74  /nix/store/xim497rkcncpxb5vvyli3j4jnziyybgy-pgroonga-3.0.7.drv75  /nix/store/gdd3j67qcdibplv1d440a6gsix87s5xs-pgroonga.drv76  /nix/store/ihx5q75k74a4cqq4k9bwnl5yin262kq2-pgrouting-3.4.1.drv77  /nix/store/hf9dly2ryx969lw950ld454fqfa6c41r-pgrouting.drv78  /nix/store/8kjmsmcqakfh251gpi83kpszgvy3zgj2-pg_jsonschema-0.3.1.drv79  /nix/store/dllk76mn670xnq6146jk4lmj5hpxmp4c-pg_jsonschema-0.3.3.drv80  /nix/store/pqncxlsh0gj7xk3n4mwxqiyyzim9c7g7-pg_jsonschema-0.2.0.drv81  /nix/store/iljk5j7rhldnws1iwi3j8qjxnaalxqjv-pg_jsonschema.drv82  /nix/store/82vdx9lfkbv67j79qzi9yzvqrj043w52-wal2json-2.6.drv83  /nix/store/iz713zhjyn0lym6ls12i9vxca9cxf4hi-wal2json.drv84  /nix/store/zfhvj40marmxclav9a5ppx3dmq3xd3hh-pg_partman-5.3.1.drv85  /nix/store/jcxqgl4g37gj09v4km7dl525ym1kxla2-pg_partman.drv86  /nix/store/mc1n2fml7avin2lrpgrd5cx7wjdb4gcg-pg_hashids-1.3.0-cd0e1b31d52b394a0df64079406a14a4f7387cd6.drv87  /nix/store/jsqjxdn4qp571nvc40r8xx103s9qb7c9-pg_hashids.drv88  /nix/store/7lzcc5d36122752hpjb6lij6sc2ai2a0-plv8-3.1.5.drv89  /nix/store/87brzrl1nsm8z4my02aldnxd8fb0i69x-plv8-3.1.4.drv90  /nix/store/k6nh1vivj2dgh0jk2mpsiy4p5v6sjyzk-plv8.drv91  /nix/store/xjfjfch45p5g0snar9qpm4amblh2jya8-plan_filter-0.1.drv92  /nix/store/lhdnha0m1rqpv0cmivzv3s7znjmgxc14-plan_filter.drv93  /nix/store/0n0iaya9csx9by2pimrx1yglzw8dp4zs-pg_net-0.13.0.drv94  /nix/store/25f3j4f5ialq0qwpdpc7gya55q9i2mai-pg_net-0.11.0.drv95  /nix/store/5xdj291zxpgm4qhx0749x7j0wwlfilf4-pg_net-0.1.drv96  /nix/store/6nzc8mspw5i4qqlvgriv2l1439xlh68v-pg_net-0.10.0.drv97  /nix/store/7iq4z475k625nsn9wc9nf4vxa7x1f1qd-pg_net-0.19.5.drv98  /nix/store/cfrc2vk3cgabx1447j2n7s3zxraq6395-pg_net-0.14.0.drv99  /nix/store/iwq28h7yniccm9ra8q6dc0wma0l6hnqn-pg_net-0.6.drv100  /nix/store/nw3d144zhshkgx1z66g9g2wg5829w36n-pg_net-0.7.1.drv101  /nix/store/nwcnf7x9i2zdx48936w9ixsnxzhbab16-pg_net-0.20.0.drv102  /nix/store/rfdqkjkjdwz7ydrwlfn9cdy68zz9z6rf-pg_net-0.7.drv103  /nix/store/whvqb38akl195470ks3jads9kmq2i9gj-pg_net-0.8.0.drv104  /nix/store/zy29jzcj1bsz7760wbmlg78czaddsrni-pg_net-0.20.3.drv105  /nix/store/q7ak647qv213m4vc4fnr43i09azs1b0p-pg_net.drv106  /nix/store/s7vxni6a17dm43jdicq8ksfjsk2d7c0n-pgaudit.drv107  /nix/store/nwi7hxl3j1cxn7ylrkx8sbbg3sqld8ag-pgtap-1.3.3.drv108  /nix/store/sxzi0qg4ingw35zkbi2pk2vfgxbq5k2a-pgtap.drv109  /nix/store/wza7bzcbymwld5yd1bh5p859l0fgd9af-pg_cron-1.4.2.drv110  /nix/store/xcji3ff216yxrc2yf2yss6mza01w0ccm-pg_cron.drv111  /nix/store/21s45rg3i2jfhdarxmqf3dr79allgdgh-wrappers-0.4.5.drv112  /nix/store/56j6z0f3g50m72cj7ynr22p9fdml79q9-wrappers-0.5.3.drv113  /nix/store/9m4hgq2s9z1cy1508wymdcl2n1w3ky5h-wrappers-0.6.2.drv114  /nix/store/f3b53aqd65czxnbbash43yraza54ds7k-wrappers-0.4.3.drv115  /nix/store/fpcwzjw9wdhbljjpcjlbz4w6236qzl70-wrappers-0.3.0.drv116  /nix/store/hygnfcb7az5nw4c4aranasi27gnhzgan-wrappers-0.6.3.drv117  /nix/store/iimlppn24xgvgjvnm4xp8z9bxl4p4p1d-wrappers-0.4.1.drv118  /nix/store/l3ww3jfvj5l8bp25p66wrjziy8m0vi23-wrappers-0.5.0.drv119  /nix/store/ns9rs9anq0rsl3sh1rhxmqcsll7lkjd0-wrappers-0.5.6.drv120  /nix/store/nvjw377g2m07i1z93mngr72qhpjmafvy-wrappers-0.4.6.drv121  /nix/store/qzn17ml7z84zcmcw96j0z0f6m9j6y7qm-wrappers-0.5.4.drv122  /nix/store/xbhixx8nl4iifcfi17lpavbs9cxcg5ka-wrappers-0.6.1.drv123  /nix/store/y06jjr5k7hk7zs8gzilg4g50b184va6a-wrappers-0.4.2.drv124  /nix/store/y1qh08g7i9w1x2s10rq7ammigljy82kw-wrappers-0.4.4.drv125  /nix/store/z1yzqa9qzq4ri1f58lngsljs0abhgjz5-wrappers-0.5.7.drv126  /nix/store/xcq8s20l2ynk52356w6nqkdw7379h4g4-wrappers.drv127  /nix/store/3m1k34jx4kw90mcghzrp83c2dfhrwab8-pg_repack-1.5.1.drv128  /nix/store/c7dnz58z4jqy26qinfmray2nlvxx3442-pg_repack-1.4.8.drv129  /nix/store/iwgg2la44vzaaa2ja2xyaydck2jab651-pg_repack-1.5.2.drv130  /nix/store/xd0qgx5kfkw00jgxs1v9rm4ksfdjky95-pg_repack.drv131  /nix/store/fakh4z5ssr1vhknp3xv3ch232i3ph2ax-postgresql-and-plugins-15.19.drv132  /nix/store/4z7sbcap8vdzfs1smz81k2crr4sgm640-postgresql-and-plugins-15.19.drv133  /nix/store/q4qvxkwv7rl1jac9sf5aap56gjx0n5mb-system-path.drv134  /nix/store/9in45xg9fcahx70h7alf6jg08sin568q-dbus-1.drv135  /nix/store/jffmpfrihfl3k6lfgdc4ii4a62343h7x-X-Restart-Triggers-dbus.drv136  /nix/store/0jyfsa7sd5nhfiwbk0i0i0k7bbgigy6z-unit-dbus.service.drv137  /nix/store/0nn0jglvy3w5hd868rilks6acxx242hj-pg_net-0.19.5.drv138  /nix/store/0q3jswlrym436vq3yzd7nmxpfpc7zbw7-wrappers-0.5.6.drv139  /nix/store/0wbkhlgz00c1nhm74adar4kk6dbid1dq-pg_graphql-1.5.11.drv140  /nix/store/1k3nzf8206jy6jjwdb50jn8rij79dvvj-plan_filter-0.1.drv141  /nix/store/17zhj6r14i4xx0fmzclykpcnyicwhbga-plan_filter.drv142  /nix/store/18746y4c8pvpm3al2bydwcn29pgwkjij-pg_repack-1.4.8.drv143  /nix/store/spkggw5b21kbiq57p7fq00khhxxg9mpm-http-1.6.1.drv144  /nix/store/1s2y3lhnrwphps8mxwxhj6pli5p72pz8-http.drv145  /nix/store/3bfr1qggn2db554518zgs8fpzyagvfrb-pg_jsonschema-0.3.3.drv146  /nix/store/2x6xkwfx99zhzhdbmhbrnifqf63l8ica-pg_jsonschema.drv147  /nix/store/1r4ihdrrxnxp1kc97akzkb6yf0rhj5fy-wal2json-2.6.drv148  /nix/store/48mqx57r48j330b49mc32k7bvy6445c2-wal2json.drv149  /nix/store/83syfrxa296qd37cig3f07glk8hn533v-pg_stat_monitor.drv150  /nix/store/8szfd9ycs8amd9k5vlvg6prcijxwqr3j-hypopg.drv151  /nix/store/sww4kz29ir2aly4abpn3hb8zfqy4ak06-pg_cron-1.6.4.drv152  /nix/store/9w316phdvwdjv5875fpg98qwdi7hxzv5-pg_cron.drv153  /nix/store/f2nm4421r3k58c32661m7na2f1q95dbh-pgtap-1.3.1.drv154  /nix/store/k7h19a5nads14nh23z55wp7vpifpqdcg-pgtap-1.3.3.drv155  /nix/store/b3wykhrc5d96h1ddr0n8jc0vm6lda047-pgtap.drv156  /nix/store/msp1w36fm572jxlq4yj3ilwksxa0qpag-safeupdate-1.4.drv157  /nix/store/fl0xvi8swv20jz0vkfsm12znd6mp9naq-safeupdate.drv158  /nix/store/5ls8sxw33v0sm4agddi4xzky3nvhg3g7-index_advisor-0.2.0.drv159  /nix/store/hnandxbj17d43iq41vk9jgn2mk94s7fg-index_advisor.drv160  /nix/store/4dv0hiafadp1s6dx9i8qfwajgh422j5n-pg_graphql-1.6.1.drv161  /nix/store/5sxmls2c3rj1id1jy8cp90d7aga5vs9y-pg_graphql-1.5.9.drv162  /nix/store/6f7pk59bx81p58zx4lxc0kpr0a4pskc3-pg_graphql-1.5.11.drv163  /nix/store/kxm7a9483vsp4n6zn93isjb5z31l42fd-pg_graphql-1.6.2.drv164  /nix/store/k2r44m3w1mwab1ipx8m72764yyhxr38v-pg_graphql.drv165  /nix/store/381ghgpkv0l9lnv0f1v2jxfg04cspiih-rum-1.3.drv166  /nix/store/k4lajdzpb6zgp35ib3yfg5hk7p7kj1z3-rum.drv167  /nix/store/2i3blwmkdwv0753xgc4pb1rm16gk4jmv-wrappers-0.5.6.drv168  /nix/store/8p8fsl25zwlaqwhknw8myg0lfhi6rhsg-wrappers-0.6.0.drv169  /nix/store/a9l3bgzraqwg33ax5gcmbqwrkrrxxnag-wrappers-0.4.5.drv170  /nix/store/fh5b65jxgdyzwrs2g7y12ffnk1yhxczn-wrappers-0.5.7.drv171  /nix/store/h81r7798azz2nz8s3pxp1drpa02ma2m8-wrappers-0.5.4.drv172  /nix/store/hlpygbdz705888l5vwvvnz96901jdbkn-wrappers-0.5.5.drv173  /nix/store/kcan9i952k07b3pm1fnq4s0f7pfn7yx9-wrappers-0.5.3.drv174  /nix/store/pvzl31ydc0nhwqmrw9agqqbmk4v4ycr8-wrappers-0.6.3.drv175  /nix/store/q0lgs5nhw27p302wa3gp300l19ad95f0-wrappers-0.4.4.drv176  /nix/store/rfn5rhjy53sq47kjz5qfawd9pz9a38l1-wrappers-0.5.0.drv177  /nix/store/sg3hglpfqxg0bdxvkn36jnvpd752brga-wrappers-0.4.6.drv178  /nix/store/sn2m8z01kbz72vbl839b4qdhql2lf67m-wrappers-0.6.1.drv179  /nix/store/w5gnd7pybydask3lizsy3lirm83jxx56-wrappers-0.6.2.drv180  /nix/store/kplnvybrmx8df99qr3hsafbkky7hfg3v-wrappers.drv181  /nix/store/ibl9nbmh9mbqgqqfkrq7vgqzbsxj392q-pgmq-1.5.1.drv182  /nix/store/kv8jjb4gkylvk18qlsxl5lp9k29b1d31-pgmq.drv183  /nix/store/hnhqkd9jnn7w4z0z0jacwjwg9x016gyl-pg_repack-1.5.0.drv184  /nix/store/rhyhx66rvbmsmh7i4xf5dqi3pr058hjr-pg_repack-1.5.1.drv185  /nix/store/x14ai73x9yl5ckncl830rpbqxpjvvbg5-pg_repack-1.5.2.drv186  /nix/store/m6b5d5vphi1v49cpgr7ff07zvzfri21p-pg_repack.drv187  /nix/store/q8n9c44w9m7lggw81a93q8rvr4jgmslx-plan_filter-0.1.drv188  /nix/store/n1y2c26wz7wmff6xrz6ggk6zvsgma4bk-plan_filter.drv189  /nix/store/8byjp94z4bcpvgpc2s8ga2rqg9c3xc55-pgrouting-3.4.1.drv190  /nix/store/qs7fc4p2b8g3zc4cd29vi1wck7acipz9-pgrouting.drv191  /nix/store/rqv928k6h7v2jlfgznn4wi7km7zvm5qk-pg_tle.drv192  /nix/store/2h15dgac1417g71pjrb4aqcz8yabiv21-plpgsql_check-2.7.drv193  /nix/store/3dxfnbp09hx3zc5q8mmvb54v0nb1lrid-plpgsql_check-2.8.drv194  /nix/store/v635079aqf2hhpg4xnhm2226g7khvdav-plpgsql_check.drv195  /nix/store/84hgdiz6hjkzk0cm5bd3vqsbx45n9zkh-vector-0.8.0.drv196  /nix/store/92n1zijp3izg793lrskmws7kyjz1xg5h-vector-0.6.2.drv197  /nix/store/bxnxr2z670m9ri1dc66149krs7h60dnc-vector-0.7.0.drv198  /nix/store/nyx1ahbyki15bmvygqzj2s1nnbmbi8ig-vector-0.7.4.drv199  /nix/store/s72y0nj96pwds84md5hz9x09cidw3azz-vector-0.6.0.drv200  /nix/store/wy228ccg72w2cv5rbhynqgmbxx7dqlws-vector-0.5.1.drv201  /nix/store/za0ss4y8awhkng526g581wdnh0azibcf-vector-0.8.2.drv202  /nix/store/x3iqn55b29mih079vypw11gf008gj74l-vector.drv203  /nix/store/6601flp9bdqz93g493ma3hhb95ia16fh-pgroonga-3.2.5.drv204  /nix/store/xkmdckj5hdcfgqlyjn2qq5vdv6s09h5a-pgroonga.drv205  /nix/store/al6g5cvx86v4ljmh3sg6hmlsl3ab3bwf-pg_net-0.20.3.drv206  /nix/store/b1pyvgjyn940h95bbnsp15qmb0qli5gd-pg_net-0.20.0.drv207  /nix/store/cl8ikglrq6jdd2cp01jad7n483mvqj8g-pg_net-0.11.0.drv208  /nix/store/g6nfp5n056kw2jvfzldzxrrrxfpfcka0-pg_net-0.13.0.drv209  /nix/store/xwiwd8fzjgv67zb2ji446a8vxjj3s7bs-pg_net-0.14.0.drv210  /nix/store/yf5z0qi17vprkjz68rqyp804sx929g9n-pg_net-0.19.5.drv211  /nix/store/y02vszvrhs7b6kn8llgwzdmnmhqiymzk-pg_net.drv212  /nix/store/k684vf2v1w6afbwv98r05j1f5hg9gw2f-pg_hashids-1.3.0-cd0e1b31d52b394a0df64079406a14a4f7387cd6.drv213  /nix/store/yi643dw2hzxidf2jf635pk0da5c4bs96-pg_hashids.drv214  /nix/store/mxhjb2qfqd8l49wakfpw5qiws2v1bcnn-gdal-3.8.5.drv215  /nix/store/mrfs1y0f5l367m93gpss7lp0jg6nz3bf-postgis-3.3.7.drv216  /nix/store/yskfmp4z518h4ff0mli70gsirhsli1ns-postgis.drv217  /nix/store/nj44phx30461wf1ac6n8fg8cc58agpgv-postgresql-and-plugins-17.11.drv218  /nix/store/rn61yq57k8lhdkx7al266vkbandycwv7-postgresql-and-plugins-17.11.drv219  /nix/store/czird9kid1f479i75r0fcy4ivzd3zzs8-system-path.drv220  /nix/store/i0ygxsqq6na1vsqmbklzxrj1xy5ypk6x-dbus-1.drv221  /nix/store/xnzsv2ymk0qx1fdsm8ssls8mlq8852wc-X-Restart-Triggers-dbus.drv222  /nix/store/5q0f5sx5mas5cc56azv1g9pm53yfrmgc-unit-dbus.service.drv223  /nix/store/a03cbyqm7arwjx83nc7jiwxkbbifg33w-user-units.drv224  /nix/store/acfna74pf7f063994dvxzqkrrhi623c4-unit-dbus.service.drv225  /nix/store/rjsqz027b1xj9q5dymzvs3wbqn2dv53m-postgresql-init.drv226  /nix/store/n0j0873l4a8mlkz6x1bffr3skhaarc7q-unit-postgresql.service.drv227  /nix/store/wmsihsmjyk0h8yjj86lpmijxpzqwk8gg-postgresql-migrate.drv228  /nix/store/pml1z1qw471w7nshf5dxp826pysqs3fz-unit-postgresql-migrate.service.drv229  /nix/store/vrslgxqykax3yi5mlrpiq0v1rq1ilnic-system-units.drv230  /nix/store/p6pnncmb31ibp4zxf61fbkkb0fmq4xai-etc.drv231  /nix/store/x6cijf4csfmd0dc8sqmiajj5dwi4h3dg-activate.drv232  /nix/store/cgyqy4j1g2s9zbh87ddwhr7wn9rssarl-nixos-system-server-test.drv233  /nix/store/m94894cysabrjwxvvsg00i2c4vxrwj44-pg_graphql-1.6.1.drv234  /nix/store/nsc639d0i1mzcdskxc5v8874w8f4zf8x-pg_graphql-1.6.2.drv235  /nix/store/w47195gn53xxlfnja6kkgpgj0pbxj66m-pg_graphql-1.5.9.drv236  /nix/store/2j0amjv943p6zmhzl3mx9z6jr1qcpn3i-pg_graphql.drv237  /nix/store/2wp2aqp71l4218m1z0aas6789yx18sv3-pgrouting-3.4.1.drv238  /nix/store/564f4p7z536irjy1x7a6i39nk3n3g2r2-pgrouting.drv239  /nix/store/7m924d2lj1z3y952h3rhjixfq3sygp4r-pg_tle.drv240  /nix/store/z008z9r9dipnvldyfh7pklhxwdav0faw-http-1.6.1.drv241  /nix/store/82hvrn43v2lmbsbj2cnaaps4iy6q9dqn-http.drv242  /nix/store/k4qjk97aggz30jlgv2hdqka8fy8z07pg-supabase_vault-0.3.1.drv243  /nix/store/z8jynkjsnrfphim33c02aci4n6i2s9la-supabase_vault-0.2.8.drv244  /nix/store/8ir53vjiqz9rhip8arbxd2b58d0j67w0-supabase_vault.drv245  /nix/store/vrks8v32hwif7cfllbj4kb4i2v9b48y8-hypopg.drv246  /nix/store/yxyw8y9hskg7m2sajbfkix9g2pibkl2w-index_advisor-0.2.0.drv247  /nix/store/9c27ix09f1z8w6a63dkm9idp2vsrixh1-index_advisor.drv248  /nix/store/1mkhz1wanb7sx61imr6wqda0cqnvnj8q-wal2json-2.6.drv249  /nix/store/9sv9z7i53r40xnrigr8aywi98izk30rb-wal2json.drv250  /nix/store/g3yy08xhp6kakigznjmymrvasv6xhzz4-rum-1.3.drv251  /nix/store/apcx516gwjdivwb00nzvgwwq26mp6kbp-rum.drv252  /nix/store/m5i71pkvgfbs9l7iwwnbj4hyz9dvj13m-pg_jsonschema-0.3.3.drv253  /nix/store/az9kzhbrx32y837x7nl7dfajllv3l3xn-pg_jsonschema.drv254  /nix/store/ynjdlqr0w8h7ici1xdnsr79mwnzmyyri-pgroonga-3.2.5.drv255  /nix/store/c7b5vgzvlwgra3bhwq5fjzl0cg8lxq53-pgroonga.drv256  /nix/store/axpz1dvivwnmwkkcs392nj9cp1zs4x4h-pg_repack-1.4.8.drv257  /nix/store/gpxphj5cc5qbfjvp1kckicqwibgb6870-pg_repack-1.5.0.drv258  /nix/store/nynlpdydjmjk2fk2fsjz9bws5n6pjjyv-pg_repack-1.5.1.drv259  /nix/store/sa036niivyjgc2rqi9xh890msxh349l9-pg_repack-1.5.2.drv260  /nix/store/f4jr9drjzv7wfj2rxqg6fxg4ki5xv8aq-pg_repack.drv261  /nix/store/1hza0wxglhyl1641a3yki78kp045s8x2-wrappers-0.5.7.drv262  /nix/store/3cgs2dl0nwcsnwa5j7vkkp9vnqrax686-wrappers-0.6.0.drv263  /nix/store/74dcpcc376carhrdcf8ka4zmkawz1yv6-wrappers-0.5.4.drv264  /nix/store/92vrj7bj8hswwppxa34pv4a5mcishcns-wrappers-0.4.4.drv265  /nix/store/96l1zwmvz2ffcdfraaalfc6lvhah4kbz-wrappers-0.5.5.drv266  /nix/store/adcv6z66z4kpsasjjh1mcxa915lbdppl-wrappers-0.4.5.drv267  /nix/store/b4n3d1kid5pcaqfl3fjnjmc425dgg1p1-wrappers-0.5.0.drv268  /nix/store/jcd2gw4vawwnh0pmxhl4pl3ll6adggx5-wrappers-0.6.2.drv269  /nix/store/vxwdlzq8s4jj92x0jpc4sl9drjywlalq-wrappers-0.6.3.drv270  /nix/store/xwhq66cqc0ms922bxlcgc1jwff6kqv8g-wrappers-0.5.3.drv271  /nix/store/y6kq63cxxc5v5jh87mv9wpbvk0p4ayfg-wrappers-0.6.1.drv272  /nix/store/zdyyj4cgmfdl46zb5ycwmwr6d30w6mbx-wrappers-0.4.6.drv273  /nix/store/fn58ja37h9fw7mszrd75faxdb0999f0i-wrappers.drv274  /nix/store/8yjdx0pjzbx41fx807nrw1js3y16kbz5-vector-0.5.1.drv275  /nix/store/9yiwshvqw6zii2gdbjn3whic00kdi2kk-vector-0.7.4.drv276  /nix/store/gd4y86918lqw8gzxg8nqrz8sy2dqq9fb-vector-0.7.0.drv277  /nix/store/gdgmh15k0z47wvlyk7n79hg9mm7jzisl-vector-0.6.2.drv278  /nix/store/hs3bxh6aa4yj96k9qp50af7qy1jchwk3-vector-0.6.0.drv279  /nix/store/j5mchw8xwd04x2c28fmf7pccna5x7y95-vector-0.8.2.drv280  /nix/store/qa8qkhza8bf74v69dzxgqvy2mjf799yl-vector-0.8.0.drv281  /nix/store/g5mv4minlqr25pj8gqhzcns6w7bwzaph-vector.drv282  /nix/store/lkbp0bzzg49y6z9h7ms156q0jsiq6qh4-safeupdate-1.4.drv283  /nix/store/icwncd52zxyvvybn79pvj2s9day934p8-safeupdate.drv284  /nix/store/j99v4y7ck8sk68hj9m9aw1avc2dkn4nh-pg_stat_monitor.drv285  /nix/store/9kmiqqmclsl8d77yd54al2d2wlwc6dp1-pgsodium-3.0.4.drv286  /nix/store/ckl9zg69wqkncwizrd6lln7h5492wwn6-pgsodium-3.1.6.drv287  /nix/store/lhi0y1xi9i9i1c8kg95nfhdw95j3dz3r-pgsodium-3.1.5.drv288  /nix/store/msmzmvngp6cx4yl0dwgzp3iv7bv796wg-pgsodium-3.1.8.drv289  /nix/store/zwypkv0vf8m8ybs536jq5wglvhfwdx8y-pgsodium-3.1.7.drv290  /nix/store/l68xzbdq736nzdnwvr9q3x29wcngcsj1-pgsodium.drv291  /nix/store/qk4j715gipc827yxrcwv0g9pviaqxkyy-pg_partman.drv292  /nix/store/46l7zbh5kkmyi58x419ar4kly30qvnhi-gdal-3.8.5.drv293  /nix/store/apd0c6nk3x333r1xj0sl2m3cr96pbizv-postgis-3.3.7.drv294  /nix/store/r12320b80inhy5aq434asc4sa8w6bn0g-postgis.drv295  /nix/store/36hfvpcvdxj64718i9mhil3db8835a6q-plpgsql_check-2.7.drv296  /nix/store/9lpr8r6zwzid07ihmr89rnxqcwv0yfja-plpgsql_check-2.8.drv297  /nix/store/rly88629k74w1nj10q0l6mg2jvd3nr1g-plpgsql_check.drv298  /nix/store/83ycsfk9ivb7sah3lq89d8hy5rxj5vpp-pg_net-0.20.3.drv299  /nix/store/a0ldx82cv1chkbdks86c8mjp8ps4lfgn-pg_net-0.20.0.drv300  /nix/store/b0270km6h57kbdxfkhagcpsilp239adm-pg_net-0.11.0.drv301  /nix/store/lbqp8bfrqa2xm82ma6wyq1gijyajh6kh-pg_net-0.13.0.drv302  /nix/store/rdglczxf0sk4hhwsppqw13zl43vf5wr0-pg_net-0.14.0.drv303  /nix/store/w7547z9slhcibw4s6cwkag6w1f49317s-pg_net-0.20.4.drv304  /nix/store/vvs47f973jig6lflvm7cidm6m20glpy5-pg_net.drv305  /nix/store/92dxzgq4qn1jl389a931z1n5n1a8s5ns-pg_hashids-1.3.0-cd0e1b31d52b394a0df64079406a14a4f7387cd6.drv306  /nix/store/x1kpz6n29pqn2xm06lprn5kwpr0pjhhx-pg_hashids.drv307  /nix/store/y1p5dlzmilwxqbf3a4c7hl6gp9p84wsl-pgmq-1.5.1.drv308  /nix/store/y5rgrfmhzrjr0j6zil7ksqdbcglh0s8i-pgmq.drv309  /nix/store/jk18akz00pd0nr1pixnq9550lnvycgar-pg_cron-1.6.4.drv310  /nix/store/ybhpqdys29q375m5pxxn2w3cbzgf3mxg-pg_cron.drv311  /nix/store/mpyn776iqdn7h94vlp5yxn83a0y4lchc-pgtap-1.3.3.drv312  /nix/store/psjbrnijdnpqyc9s718av7nwmyk0fays-pgtap-1.3.1.drv313  /nix/store/zf19xpsa8jj4bmx09awww0z16cm79z4g-pgtap.drv314  /nix/store/2fndab8axk4hz4s30ijaxnpa1bc9z1dc-postgresql-and-plugins-17_22.drv315  /nix/store/i3fy4azgna3zl2za0k3pwx70f2sk6hk8-receipt.drv316  /nix/store/w85w5162f9zdpi7g98sjlk186hrrm57p-postgresql-and-plugins-17_22.drv317  /nix/store/amy1ji0k53n9qihnqys9hvlc60bncr1y-system-path.drv318  /nix/store/7ynly7nv4iq2wvhmmg6p100h3wr2dpxd-dbus-1.drv319  /nix/store/v749g53p5djbqg3y7kfvdsw5g535j0js-X-Restart-Triggers-dbus.drv320  /nix/store/n7wg70ga6zm8b0prwd4np0azpi732zji-unit-dbus.service.drv321  /nix/store/bmn9rg4vrb07wyj1ls41afzdzcmhdqcm-user-units.drv322  /nix/store/jika4rfg3aj00vq2nfqx2i6nild4nvd5-unit-dbus.service.drv323  /nix/store/8r4vw45si1w8qby225b0amhay9ybj6c5-postgresql-orioledb-init.drv324  /nix/store/pgysndf7sfj9ifxk4sy1w8qfx2ln1ws6-unit-postgresql.service.drv325  /nix/store/9i9flpkzn6d3cvhin3s644150jhvcazf-supabase-orioledb-db-init.drv326  /nix/store/s4qicdb2kbzvf3lf6m8xidm4lndgs2yl-unit-supabase-db-init.service.drv327  /nix/store/dgm1f7y3gvjqjfv7r4gfa7pjffgzr4nj-system-units.drv328  /nix/store/sc9b344gbckg6fqywin6bhhs882d6mxa-etc.drv329  /nix/store/k4pazrfsvz1hsx7l4d0jsxvan5b3dq49-activate.drv330  /nix/store/m7z7bg6jaainvrfsikwclppim5yf6kn3-nixos-system-server-test.drv331  /nix/store/70bg25srcrfnwivfph4bhslzhigdgpxw-unit-dbus.service.drv332  /nix/store/cpy2j0c5ribiykpjaig0axzryxzh1g69-user-units.drv333  /nix/store/qbfmigmm8fk4v5nhvb8h71hmhmdaky0g-supabase-db-init.drv334  /nix/store/ggfylf6a7iwk3pn3r08m30684z8rrq5l-unit-supabase-db-init.service.drv335  /nix/store/qsr1582sizlpmavcla4x0gbp3q52g4pd-unit-postgresql.service.drv336  /nix/store/ydkqsx664pp5ndcfl70c84mvxgixix01-system-units.drv337  /nix/store/y3dck3diii9z9x0w771pz541gjd0zwh3-etc.drv338  /nix/store/srl146pjpar66ijj6l2zw99pmy6wpkl9-activate.drv339  /nix/store/sjl12wxd1wb23d9hzlzyqrq731lbrgpb-nixos-system-server-test.drv340  /nix/store/qv2lxny9548lwqjzpi75n12qpyc0fm56-closure-info.drv341  /nix/store/8vx14rz8lihgxgq3s0daqnbhbvnsf97x-run-nixos-vm.drv342  /nix/store/63q2a748lli2nxvrk228r5l81997jmzh-nixos-vm.drv343  /nix/store/cjrvrpx1x6caxz9w0780v3694wi5mvhv-nixos-test-driver-pgjwt.drv344  /nix/store/1dzbh7x3p5afhvnk9jc407jyncj4x19m-vm-test-run-pgjwt.drv345building '/nix/store/zyzrb73x0fw62dyxqdz0znqnzvgqa7g6-supabase_vault-0.3.1.drv' on 'ssh-ng://nixbot-remote-build@78.232.36.247'346building '/nix/store/zyzrb73x0fw62dyxqdz0znqnzvgqa7g6-supabase_vault-0.3.1.drv'347supabase_vault-0.3.1> Running phase: unpackPhase348supabase_vault-0.3.1> unpacking source archive /nix/store/nsmrvbpdymlb57mhf4v51b8il24r1v3g-source349supabase_vault-0.3.1> source root is source350supabase_vault-0.3.1> Running phase: patchPhase351supabase_vault-0.3.1> Running phase: updateAutotoolsGnuConfigScriptsPhase352supabase_vault-0.3.1> Running phase: configurePhase353supabase_vault-0.3.1> no configure script, doing nothing354supabase_vault-0.3.1> Running phase: buildPhase355supabase_vault-0.3.1> build flags: SHELL=/nix/store/q1lr86rzsxxbbqdz8m6bcv94saaz8wlv-bash-5.3p3/bin/bash356supabase_vault-0.3.1> gcc -Wall -Wmissing-prototypes -Wpointer-arith -Wdeclaration-after-statement -Werror=vla -Wendif-labels -Wmissing-format-attribute -Wimplicit-fallthrough=3 -Wcast-function-type -Wshadow=compatible-local -Wformat-security -fno-strict-aliasing -fwrapv -fexcess-precision=standard -Wno-format-truncation -Wno-stringop-truncation -g -O2 -std=c99 -Werror -Wno-declaration-after-statement -fPIC -fvisibility=hidden  -DEXTVERSION=\"0.3.1\" -I. -I./ -I/nix/store/9q4p23a2y63xn8safzzn6lbn07bnkshs-postgresql-17.11/include/server -I/nix/store/9q4p23a2y63xn8safzzn6lbn07bnkshs-postgresql-17.11/include/internal -D_GNU_SOURCE  -I/nix/store/p17klc3qq4nl9ihfwqfpi8cnqvcf92xz-libxml2-2.15.1-dev/include/libxml2 -I/nix/store/mglbi4dy4kpx7v1dcgf6iincp5x38hsc-lz4-1.10.0-dev/include -I/nix/store/g41q9md9rdcr3lkydi6f8zd6fza3h1q4-zstd-1.5.7-dev/include -I/nix/store/n2vnr7ycfk6midbzxcwd28qj3bgb50cz-icu4c-75.1-dev/include  -c -o src/crypto_aead_det_xchacha20.o src/crypto_aead_det_xchacha20.c357supabase_vault-0.3.1> gcc -Wall -Wmissing-prototypes -Wpointer-arith -Wdeclaration-after-statement -Werror=vla -Wendif-labels -Wmissing-format-attribute -Wimplicit-fallthrough=3 -Wcast-function-type -Wshadow=compatible-local -Wformat-security -fno-strict-aliasing -fwrapv -fexcess-precision=standard -Wno-format-truncation -Wno-stringop-truncation -g -O2 -std=c99 -Werror -Wno-declaration-after-statement -fPIC -fvisibility=hidden  -DEXTVERSION=\"0.3.1\" -I. -I./ -I/nix/store/9q4p23a2y63xn8safzzn6lbn07bnkshs-postgresql-17.11/include/server -I/nix/store/9q4p23a2y63xn8safzzn6lbn07bnkshs-postgresql-17.11/include/internal -D_GNU_SOURCE  -I/nix/store/p17klc3qq4nl9ihfwqfpi8cnqvcf92xz-libxml2-2.15.1-dev/include/libxml2 -I/nix/store/mglbi4dy4kpx7v1dcgf6iincp5x38hsc-lz4-1.10.0-dev/include -I/nix/store/g41q9md9rdcr3lkydi6f8zd6fza3h1q4-zstd-1.5.7-dev/include -I/nix/store/n2vnr7ycfk6midbzxcwd28qj3bgb50cz-icu4c-75.1-dev/include  -c -o src/pgsodium.o src/pgsodium.c358supabase_vault-0.3.1> gcc -Wall -Wmissing-prototypes -Wpointer-arith -Wdeclaration-after-statement -Werror=vla -Wendif-labels -Wmissing-format-attribute -Wimplicit-fallthrough=3 -Wcast-function-type -Wshadow=compatible-local -Wformat-security -fno-strict-aliasing -fwrapv -fexcess-precision=standard -Wno-format-truncation -Wno-stringop-truncation -g -O2 -std=c99 -Werror -Wno-declaration-after-statement -fPIC -fvisibility=hidden  -DEXTVERSION=\"0.3.1\" -I. -I./ -I/nix/store/9q4p23a2y63xn8safzzn6lbn07bnkshs-postgresql-17.11/include/server -I/nix/store/9q4p23a2y63xn8safzzn6lbn07bnkshs-postgresql-17.11/include/internal -D_GNU_SOURCE  -I/nix/store/p17klc3qq4nl9ihfwqfpi8cnqvcf92xz-libxml2-2.15.1-dev/include/libxml2 -I/nix/store/mglbi4dy4kpx7v1dcgf6iincp5x38hsc-lz4-1.10.0-dev/include -I/nix/store/g41q9md9rdcr3lkydi6f8zd6fza3h1q4-zstd-1.5.7-dev/include -I/nix/store/n2vnr7ycfk6midbzxcwd28qj3bgb50cz-icu4c-75.1-dev/include  -c -o src/supabase_vault.o src/supabase_vault.c359supabase_vault-0.3.1> gcc -Wall -Wmissing-prototypes -Wpointer-arith -Wdeclaration-after-statement -Werror=vla -Wendif-labels -Wmissing-format-attribute -Wimplicit-fallthrough=3 -Wcast-function-type -Wshadow=compatible-local -Wformat-security -fno-strict-aliasing -fwrapv -fexcess-precision=standard -Wno-format-truncation -Wno-stringop-truncation -g -O2 -std=c99 -Werror -Wno-declaration-after-statement -fPIC -fvisibility=hidden -shared -o supabase_vault.so src/crypto_aead_det_xchacha20.o src/pgsodium.o src/supabase_vault.o -L/nix/store/07zklik5dwl2sfqym1gwbrrkfby7lrjn-postgresql-17.11-lib/lib    -L/nix/store/wfk1mrpj1r5f7iyihjnh0jjixr900z7y-libxml2-2.15.1/lib -L/nix/store/62b24z1igfh6ws654fhsgnm3fm7j1z3c-lz4-1.10.0-lib/lib -L/nix/store/fqy9nkaahib56gcy0r77qjk7n03cvnfs-zstd-1.5.7/lib -Wl,--as-needed -Wl,-rpath,'/nix/store/07zklik5dwl2sfqym1gwbrrkfby7lrjn-postgresql-17.11-lib/lib',--enable-new-dtags -fvisibility=hidden -lsodium 360supabase_vault-0.3.1> sed "s/@VAULT_VERSION@/0.3.1/g" supabase_vault.control.in > supabase_vault.control361supabase_vault-0.3.1> Running phase: installPhase362supabase_vault-0.3.1> Running phase: fixupPhase363supabase_vault-0.3.1> shrinking RPATHs of ELF executables and libraries in /nix/store/vh7163lw3pq2xsv78m93ss9wr4s9ah5l-supabase_vault-0.3.1364supabase_vault-0.3.1> shrinking /nix/store/vh7163lw3pq2xsv78m93ss9wr4s9ah5l-supabase_vault-0.3.1/lib/supabase_vault-0.3.1.so365supabase_vault-0.3.1> checking for references to /build/ in /nix/store/vh7163lw3pq2xsv78m93ss9wr4s9ah5l-supabase_vault-0.3.1...366supabase_vault-0.3.1> patching script interpreter paths in /nix/store/vh7163lw3pq2xsv78m93ss9wr4s9ah5l-supabase_vault-0.3.1367supabase_vault-0.3.1> stripping (with command strip and flags -S -p) in  /nix/store/vh7163lw3pq2xsv78m93ss9wr4s9ah5l-supabase_vault-0.3.1/lib368building '/nix/store/spkggw5b21kbiq57p7fq00khhxxg9mpm-http-1.6.1.drv' on 'ssh-ng://nixbot-remote-build@78.232.36.247'369building '/nix/store/spkggw5b21kbiq57p7fq00khhxxg9mpm-http-1.6.1.drv'370http-1.6.1> Running phase: unpackPhase371http-1.6.1> unpacking source archive /nix/store/cpxghg5cw7n5fhigvx3yc8vyis8way3s-source372http-1.6.1> source root is source373http-1.6.1> Running phase: patchPhase374http-1.6.1> Running phase: updateAutotoolsGnuConfigScriptsPhase375http-1.6.1> Running phase: configurePhase376http-1.6.1> no configure script, doing nothing377http-1.6.1> Running phase: buildPhase378http-1.6.1> build flags: SHELL=/nix/store/q1lr86rzsxxbbqdz8m6bcv94saaz8wlv-bash-5.3p3/bin/bash379http-1.6.1> gcc -Wall -Wmissing-prototypes -Wpointer-arith -Wdeclaration-after-statement -Werror=vla -Wendif-labels -Wmissing-format-attribute -Wimplicit-fallthrough=3 -Wcast-function-type -Wshadow=compatible-local -Wformat-security -fno-strict-aliasing -fwrapv -fexcess-precision=standard -Wno-format-truncation -Wno-stringop-truncation -g -O2 -fPIC -fvisibility=hidden -I. -I./ -I/nix/store/9q4p23a2y63xn8safzzn6lbn07bnkshs-postgresql-17.11/include/server -I/nix/store/9q4p23a2y63xn8safzzn6lbn07bnkshs-postgresql-17.11/include/internal -D_GNU_SOURCE  -I/nix/store/p17klc3qq4nl9ihfwqfpi8cnqvcf92xz-libxml2-2.15.1-dev/include/libxml2 -I/nix/store/mglbi4dy4kpx7v1dcgf6iincp5x38hsc-lz4-1.10.0-dev/include -I/nix/store/g41q9md9rdcr3lkydi6f8zd6fza3h1q4-zstd-1.5.7-dev/include -I/nix/store/n2vnr7ycfk6midbzxcwd28qj3bgb50cz-icu4c-75.1-dev/include  -c -o http.o http.c380http-1.6.1> gcc -Wall -Wmissing-prototypes -Wpointer-arith -Wdeclaration-after-statement -Werror=vla -Wendif-labels -Wmissing-format-attribute -Wimplicit-fallthrough=3 -Wcast-function-type -Wshadow=compatible-local -Wformat-security -fno-strict-aliasing -fwrapv -fexcess-precision=standard -Wno-format-truncation -Wno-stringop-truncation -g -O2 -fPIC -fvisibility=hidden -shared -o http.so http.o -L/nix/store/07zklik5dwl2sfqym1gwbrrkfby7lrjn-postgresql-17.11-lib/lib    -L/nix/store/wfk1mrpj1r5f7iyihjnh0jjixr900z7y-libxml2-2.15.1/lib -L/nix/store/62b24z1igfh6ws654fhsgnm3fm7j1z3c-lz4-1.10.0-lib/lib -L/nix/store/fqy9nkaahib56gcy0r77qjk7n03cvnfs-zstd-1.5.7/lib -Wl,--as-needed -Wl,-rpath,'/nix/store/07zklik5dwl2sfqym1gwbrrkfby7lrjn-postgresql-17.11-lib/lib',--enable-new-dtags -fvisibility=hidden -L/nix/store/dlzv7s6ggdqpi2l90g9wqsj7rh26pb0r-curl-8.17.0/lib -lcurl381http-1.6.1> Running phase: installPhase382http-1.6.1> Running phase: fixupPhase383http-1.6.1> shrinking RPATHs of ELF executables and libraries in /nix/store/5ljxaqlsd7pfsbxys61l0sd2saxmww8p-http-1.6.1384http-1.6.1> shrinking /nix/store/5ljxaqlsd7pfsbxys61l0sd2saxmww8p-http-1.6.1/lib/http-1.6.so385http-1.6.1> checking for references to /build/ in /nix/store/5ljxaqlsd7pfsbxys61l0sd2saxmww8p-http-1.6.1...386http-1.6.1> patching script interpreter paths in /nix/store/5ljxaqlsd7pfsbxys61l0sd2saxmww8p-http-1.6.1387http-1.6.1> stripping (with command strip and flags -S -p) in  /nix/store/5ljxaqlsd7pfsbxys61l0sd2saxmww8p-http-1.6.1/lib388building '/nix/store/5sxmls2c3rj1id1jy8cp90d7aga5vs9y-pg_graphql-1.5.9.drv' on 'ssh-ng://nixbot-remote-build@78.232.36.247'389building '/nix/store/5sxmls2c3rj1id1jy8cp90d7aga5vs9y-pg_graphql-1.5.9.drv'390pg_graphql-1.5.9> Running phase: unpackPhase391pg_graphql-1.5.9> unpacking source archive /nix/store/35k52w6qmay5vi6qhfy8cpfz0bwldvr5-source392pg_graphql-1.5.9> source root is source393pg_graphql-1.5.9> Executing cargoSetupPostUnpackHook394pg_graphql-1.5.9> Finished cargoSetupPostUnpackHook395pg_graphql-1.5.9> Running phase: patchPhase396pg_graphql-1.5.9> Executing cargoSetupPostPatchHook397pg_graphql-1.5.9> Validating consistency between /build/source/Cargo.lock and /build/cargo-vendor-dir/Cargo.lock398pg_graphql-1.5.9> Finished cargoSetupPostPatchHook399pg_graphql-1.5.9> Running phase: updateAutotoolsGnuConfigScriptsPhase400pg_graphql-1.5.9> Running phase: configurePhase401pg_graphql-1.5.9> Running phase: buildPhase402pg_graphql-1.5.9> Executing cargo-pgrx buildPhase403pg_graphql-1.5.9>    Validating /nix/store/9q4p23a2y63xn8safzzn6lbn07bnkshs-postgresql-17.11/bin/pg_config404pg_graphql-1.5.9>  Initializing data directory at /build/tmp.PchgWFrZVA/data-17405pg_graphql-1.5.9> waiting for server to start....2026-10-06 14:14:34.848 GMT [73] LOG:  starting PostgreSQL 17.11 on aarch64-unknown-linux-gnu, compiled by gcc (GCC) 15.2.0, 64-bit406pg_graphql-1.5.9> 2026-10-06 14:14:34.851 GMT [73] LOG:  listening on Unix socket "/build/tmp.Hwyp96vMa8/.s.PGSQL.5432"407pg_graphql-1.5.9> 2026-10-06 14:14:34.859 GMT [76] LOG:  database system was shut down at 2026-10-06 14:14:34 GMT408pg_graphql-1.5.9> 2026-10-06 14:14:34.864 GMT [73] LOG:  database system is ready to accept connections409pg_graphql-1.5.9>  done410pg_graphql-1.5.9> server started411pg_graphql-1.5.9> createuser: error: connection to server at "localhost" (127.0.0.1), port 5432 failed: Connection refused412pg_graphql-1.5.9> 	Is the server running on that host and accepting TCP/IP connections?413pg_graphql-1.5.9> waiting for server to shut down....2026-10-06 14:14:34.932 GMT [73] LOG:  received fast shutdown request414pg_graphql-1.5.9> 2026-10-06 14:14:35.011 GMT [73] LOG:  aborting any active transactions415pg_graphql-1.5.9> 2026-10-06 14:14:35.013 GMT [73] LOG:  background worker "logical replication launcher" (PID 79) exited with exit code 1416pg_graphql-1.5.9> 2026-10-06 14:14:35.014 GMT [74] LOG:  shutting down417pg_graphql-1.5.9> 2026-10-06 14:14:35.017 GMT [74] LOG:  checkpoint starting: shutdown immediate418pg_graphql-1.5.9> 2026-10-06 14:14:35.035 GMT [74] LOG:  checkpoint complete: wrote 3 buffers (0.0%); 0 WAL file(s) added, 0 removed, 0 recycled; write=0.005 s, sync=0.002 s, total=0.021 s; sync files=2, longest=0.001 s, average=0.001 s; distance=0 kB, estimate=0 kB; lsn=0/14EC338, redo lsn=0/14EC338419pg_graphql-1.5.9> 2026-10-06 14:14:35.040 GMT [73] LOG:  database system is shut down420pg_graphql-1.5.9>  done421pg_graphql-1.5.9> server stopped422pg_graphql-1.5.9>        Using PgConfig("pg17") and `pg_config` from /nix/store/9q4p23a2y63xn8safzzn6lbn07bnkshs-postgresql-17.11/bin/pg_config423pg_graphql-1.5.9>     Building extension with features  pg17424pg_graphql-1.5.9>      Running command "/nix/store/hxlcfmjxs6akpyya3k1d4qk1ghbw11ij-rust-default-1.81.0/bin/cargo" "build" "--lib" "--release" "--features" " pg17" "--no-default-features" "--message-format=json-render-diagnostics" "--frozen" "-j" "2"425pg_graphql-1.5.9>    Compiling proc-macro2 v1.0.79426pg_graphql-1.5.9>    Compiling unicode-ident v1.0.12427pg_graphql-1.5.9>    Compiling libc v0.2.153428pg_graphql-1.5.9>    Compiling thiserror v1.0.58429pg_graphql-1.5.9>    Compiling memchr v2.7.2430pg_graphql-1.5.9>    Compiling quote v1.0.36431pg_graphql-1.5.9>    Compiling serde v1.0.197432pg_graphql-1.5.9>    Compiling syn v2.0.58433pg_graphql-1.5.9>    Compiling hashbrown v0.14.3434pg_graphql-1.5.9>    Compiling equivalent v1.0.1435pg_graphql-1.5.9>    Compiling eyre v0.6.12436pg_graphql-1.5.9>    Compiling indexmap v2.2.6437pg_graphql-1.5.9>    Compiling glob v0.3.1438pg_graphql-1.5.9>    Compiling serde_json v1.0.115439pg_graphql-1.5.9>    Compiling tinyvec_macros v0.1.1440pg_graphql-1.5.9>    Compiling tinyvec v1.6.0441pg_graphql-1.5.9>    Compiling clang-sys v1.7.0442pg_graphql-1.5.9>    Compiling cfg-if v1.0.0443pg_graphql-1.5.9>    Compiling indenter v0.3.3444pg_graphql-1.5.9>    Compiling is_ci v1.2.0445pg_graphql-1.5.9>    Compiling once_cell v1.19.0446pg_graphql-1.5.9>    Compiling winnow v0.6.5447pg_graphql-1.5.9>    Compiling anyhow v1.0.82448pg_graphql-1.5.9>    Compiling thiserror-impl v1.0.58449pg_graphql-1.5.9>    Compiling serde_derive v1.0.197450pg_graphql-1.5.9>    Compiling unicode-normalization v0.1.23451pg_graphql-1.5.9>    Compiling is-terminal v0.4.13452pg_graphql-1.5.9>    Compiling minimal-lexical v0.2.1453pg_graphql-1.5.9>    Compiling owo-colors v4.1.0454pg_graphql-1.5.9>    Compiling regex-syntax v0.8.3455pg_graphql-1.5.9>    Compiling percent-encoding v2.3.1456pg_graphql-1.5.9>    Compiling unicode-bidi v0.3.15457pg_graphql-1.5.9>    Compiling ucd-trie v0.1.6458pg_graphql-1.5.9>    Compiling cc v1.0.92459pg_graphql-1.5.9>    Compiling serde_spanned v0.6.5460pg_graphql-1.5.9>    Compiling toml_datetime v0.6.5461pg_graphql-1.5.9>    Compiling toml_edit v0.22.9462pg_graphql-1.5.9>    Compiling pest v2.7.9463pg_graphql-1.5.9>    Compiling toml v0.8.12464pg_graphql-1.5.9>    Compiling idna v0.5.0465pg_graphql-1.5.9>    Compiling form_urlencoded v1.2.1466pg_graphql-1.5.9>    Compiling regex-automata v0.4.6467pg_graphql-1.5.9>    Compiling libloading v0.8.3468pg_graphql-1.5.9>    Compiling nom v7.1.3469pg_graphql-1.5.9>    Compiling supports-color v2.1.0470pg_graphql-1.5.9>    Compiling supports-color v3.0.1471pg_graphql-1.5.9>    Compiling syn v1.0.109472pg_graphql-1.5.9>    Compiling bindgen v0.70.1473pg_graphql-1.5.9>    Compiling unicode-width v0.1.14474pg_graphql-1.5.9>    Compiling yansi-term v0.1.2475pg_graphql-1.5.9>    Compiling ryu v1.0.17476pg_graphql-1.5.9>    Compiling itoa v1.0.11477pg_graphql-1.5.9>    Compiling either v1.10.0478pg_graphql-1.5.9>    Compiling itertools v0.12.1479pg_graphql-1.5.9>    Compiling annotate-snippets v0.9.2480pg_graphql-1.5.9>    Compiling pathsearch v0.2.0481pg_graphql-1.5.9>    Compiling cexpr v0.6.0482pg_graphql-1.5.9>    Compiling regex v1.10.4483pg_graphql-1.5.9>    Compiling url v2.5.0484pg_graphql-1.5.9>    Compiling cargo_toml v0.19.2485pg_graphql-1.5.9>    Compiling semver-parser v0.10.2486pg_graphql-1.5.9>    Compiling shlex v1.3.0487pg_graphql-1.5.9>    Compiling same-file v1.0.6488pg_graphql-1.5.9>    Compiling bitflags v2.5.0489pg_graphql-1.5.9>    Compiling home v0.5.9490pg_graphql-1.5.9>    Compiling rustc-hash v1.1.0491pg_graphql-1.5.9>    Compiling pgrx-pg-config v0.12.6492pg_graphql-1.5.9>    Compiling walkdir v2.5.0493pg_graphql-1.5.9>    Compiling semver v0.11.0494pg_graphql-1.5.9>    Compiling getrandom v0.2.14495pg_graphql-1.5.9>    Compiling ident_case v1.0.1496pg_graphql-1.5.9>    Compiling byteorder v1.5.0497pg_graphql-1.5.9>    Compiling fnv v1.0.7498pg_graphql-1.5.9>    Compiling strsim v0.10.0499pg_graphql-1.5.9>    Compiling fixedbitset v0.4.2500pg_graphql-1.5.9>    Compiling unicode-segmentation v1.11.0501pg_graphql-1.5.9>    Compiling convert_case v0.6.0502pg_graphql-1.5.9>    Compiling petgraph v0.6.4503pg_graphql-1.5.9>    Compiling darling_core v0.14.4504pg_graphql-1.5.9>    Compiling rustc_version v0.3.3505pg_graphql-1.5.9>    Compiling pgrx-bindgen v0.12.6506pg_graphql-1.5.9>    Compiling cee-scape v0.2.0507pg_graphql-1.5.9>    Compiling radium v0.7.0508pg_graphql-1.5.9>    Compiling unescape v0.1.0509pg_graphql-1.5.9>    Compiling pgrx-pg-sys v0.12.6510pg_graphql-1.5.9>    Compiling pgrx-sql-entity-graph v0.12.6511pg_graphql-1.5.9>    Compiling atomic-traits v0.3.0512pg_graphql-1.5.9>    Compiling darling_macro v0.14.4513pg_graphql-1.5.9>    Compiling void v1.0.2514pg_graphql-1.5.9>    Compiling heapless v0.8.0515pg_graphql-1.5.9>    Compiling tap v1.0.1516pg_graphql-1.5.9>    Compiling wyz v0.5.1517pg_graphql-1.5.9>    Compiling unreachable v1.0.0518pg_graphql-1.5.9>    Compiling darling v0.14.4519pg_graphql-1.5.9>    Compiling pgrx-macros v0.12.6520pg_graphql-1.5.9>    Compiling hash32 v0.3.1521pg_graphql-1.5.9>    Compiling rand_core v0.6.4522pg_graphql-1.5.9>    Compiling enum-map-derive v0.17.0523pg_graphql-1.5.9>    Compiling ascii v0.9.3524pg_graphql-1.5.9>    Compiling funty v2.0.0525pg_graphql-1.5.9>    Compiling stable_deref_trait v1.2.0526pg_graphql-1.5.9>    Compiling sptr v0.3.2527pg_graphql-1.5.9>    Compiling half v1.8.3528pg_graphql-1.5.9>    Compiling ppv-lite86 v0.2.17529pg_graphql-1.5.9>    Compiling combine v3.8.1530pg_graphql-1.5.9>    Compiling rand_chacha v0.3.1531pg_graphql-1.5.9>    Compiling serde_cbor v0.11.2532pg_graphql-1.5.9>    Compiling bitvec v1.0.1533pg_graphql-1.5.9>    Compiling enum-map v2.7.3534pg_graphql-1.5.9>    Compiling cached_proc_macro v0.18.1535pg_graphql-1.5.9>    Compiling uuid v1.8.0536pg_graphql-1.5.9>    Compiling instant v0.1.12537pg_graphql-1.5.9>    Compiling seahash v4.1.0538pg_graphql-1.5.9>    Compiling cached_proc_macro_types v0.1.1539pg_graphql-1.5.9>    Compiling cached v0.46.1540pg_graphql-1.5.9>    Compiling rand v0.8.5541pg_graphql-1.5.9>    Compiling graphql-parser v0.4.0542pg_graphql-1.5.9>    Compiling itertools v0.10.5543pg_graphql-1.5.9>    Compiling bimap v0.6.3544pg_graphql-1.5.9>    Compiling lazy_static v1.4.0545pg_graphql-1.5.9>    Compiling base64 v0.13.1546pg_graphql-1.5.9>    Compiling pgrx v0.12.6547building '/nix/store/dk0a0irlxsl04249qy2dnc6bm4wkk1lc-pg_graphql-1.6.1.drv' on 'ssh-ng://nixbot-remote-build@78.232.36.247'548building '/nix/store/dk0a0irlxsl04249qy2dnc6bm4wkk1lc-pg_graphql-1.6.1.drv'549pg_graphql-1.6.1> Running phase: unpackPhase550pg_graphql-1.6.1> unpacking source archive /nix/store/dkddz4rv98rzjsvrcvwg300h6nxbcg54-source551pg_graphql-1.6.1> source root is source552pg_graphql-1.6.1> Executing cargoSetupPostUnpackHook553pg_graphql-1.6.1> Finished cargoSetupPostUnpackHook554pg_graphql-1.6.1> Running phase: patchPhase555pg_graphql-1.6.1> Executing cargoSetupPostPatchHook556pg_graphql-1.6.1> Validating consistency between /build/source/Cargo.lock and /build/cargo-vendor-dir/Cargo.lock557pg_graphql-1.6.1> Finished cargoSetupPostPatchHook558pg_graphql-1.6.1> Running phase: updateAutotoolsGnuConfigScriptsPhase559pg_graphql-1.6.1> Running phase: configurePhase560pg_graphql-1.6.1> Running phase: buildPhase561pg_graphql-1.6.1> Executing cargo-pgrx buildPhase562pg_graphql-1.6.1>    Validating /nix/store/48l45fvi99n90x6p9i4cs1lmzby6cb73-postgresql-15.19/bin/pg_config563pg_graphql-1.6.1>  Initializing data directory at /build/tmp.Yx0qZrnJrC/data-15564pg_graphql-1.6.1> waiting for server to start....2026-10-06 14:18:01.518 GMT [72] LOG:  starting PostgreSQL 15.19 on aarch64-unknown-linux-gnu, compiled by gcc (GCC) 15.2.0, 64-bit565pg_graphql-1.6.1> 2026-10-06 14:18:01.520 GMT [72] LOG:  listening on Unix socket "/build/tmp.OG34AItyUr/.s.PGSQL.5432"566pg_graphql-1.6.1> 2026-10-06 14:18:01.529 GMT [75] LOG:  database system was shut down at 2026-10-06 14:18:01 GMT567pg_graphql-1.6.1> 2026-10-06 14:18:01.535 GMT [72] LOG:  database system is ready to accept connections568pg_graphql-1.6.1>  done569pg_graphql-1.6.1> server started570pg_graphql-1.6.1> createuser: error: connection to server at "localhost" (127.0.0.1), port 5432 failed: Connection refused571pg_graphql-1.6.1> 	Is the server running on that host and accepting TCP/IP connections?572pg_graphql-1.6.1> waiting for server to shut down....2026-10-06 14:18:01.601 GMT [72] LOG:  received fast shutdown request573pg_graphql-1.6.1> 2026-10-06 14:18:01.605 GMT [72] LOG:  aborting any active transactions574pg_graphql-1.6.1> 2026-10-06 14:18:01.607 GMT [72] LOG:  background worker "logical replication launcher" (PID 78) exited with exit code 1575pg_graphql-1.6.1> 2026-10-06 14:18:01.607 GMT [73] LOG:  shutting down576pg_graphql-1.6.1> 2026-10-06 14:18:01.616 GMT [73] LOG:  checkpoint starting: shutdown immediate577pg_graphql-1.6.1> 2026-10-06 14:18:01.631 GMT [73] LOG:  checkpoint complete: wrote 3 buffers (0.0%); 0 WAL file(s) added, 0 removed, 0 recycled; write=0.004 s, sync=0.003 s, total=0.025 s; sync files=2, longest=0.002 s, average=0.002 s; distance=0 kB, estimate=0 kB578pg_graphql-1.6.1> 2026-10-06 14:18:01.635 GMT [72] LOG:  database system is shut down579pg_graphql-1.6.1>  done580pg_graphql-1.6.1> server stopped581pg_graphql-1.6.1>        Using PgConfig("pg15") and `pg_config` from /nix/store/48l45fvi99n90x6p9i4cs1lmzby6cb73-postgresql-15.19/bin/pg_config582pg_graphql-1.6.1>     Building extension with features  pg15583pg_graphql-1.6.1>      Running command "/nix/store/8aa27y4zp6s8cv6f6chng7cv416ngp5c-cargo-1.88.0-aarch64-unknown-linux-gnu/bin/cargo" "build" "--lib" "--release" "--features" " pg15" "--no-default-features" "--message-format=json-render-diagnostics" "--frozen" "-j" "2"584pg_graphql-1.6.1>    Compiling proc-macro2 v1.0.101585pg_graphql-1.6.1>    Compiling unicode-ident v1.0.16586pg_graphql-1.6.1>    Compiling libc v0.2.175587pg_graphql-1.6.1>    Compiling stable_deref_trait v1.2.0588pg_graphql-1.6.1>    Compiling litemap v0.7.4589pg_graphql-1.6.1>    Compiling writeable v0.5.5590pg_graphql-1.6.1>    Compiling quote v1.0.40591pg_graphql-1.5.9>    Compiling pg_graphql v1.5.9 (/build/source)592pg_graphql-1.6.1>    Compiling syn v2.0.98593pg_graphql-1.6.1>    Compiling memchr v2.7.4594pg_graphql-1.6.1>    Compiling serde v1.0.219595pg_graphql-1.6.1>    Compiling thiserror v2.0.16596pg_graphql-1.6.1>    Compiling eyre v0.6.12597pg_graphql-1.6.1>    Compiling icu_locid_transform_data v1.5.0598pg_graphql-1.6.1>    Compiling icu_properties_data v1.5.0599pg_graphql-1.6.1>    Compiling smallvec v1.13.2600pg_graphql-1.6.1>    Compiling serde_json v1.0.138601pg_graphql-1.6.1>    Compiling shlex v1.3.0602pg_graphql-1.6.1>    Compiling utf16_iter v1.0.5603pg_graphql-1.6.1>    Compiling glob v0.3.2604pg_graphql-1.6.1>    Compiling utf8_iter v1.0.4605pg_graphql-1.6.1>    Compiling icu_normalizer_data v1.5.0606pg_graphql-1.6.1>    Compiling write16 v1.0.0607pg_graphql-1.6.1>    Compiling clang-sys v1.8.1608pg_graphql-1.6.1>    Compiling synstructure v0.13.1609pg_graphql-1.6.1>    Compiling anyhow v1.0.95610pg_graphql-1.6.1>    Compiling once_cell v1.21.3611pg_graphql-1.6.1>    Compiling indenter v0.3.3612pg_graphql-1.6.1>    Compiling winnow v0.7.13613pg_graphql-1.6.1>    Compiling zerofrom-derive v0.1.5614pg_graphql-1.6.1>    Compiling yoke-derive v0.7.5615pg_graphql-1.6.1>    Compiling zerovec-derive v0.10.3616pg_graphql-1.6.1>    Compiling zerofrom v0.1.5617pg_graphql-1.6.1>    Compiling yoke v0.7.5618pg_graphql-1.6.1>    Compiling serde_derive v1.0.219619pg_graphql-1.6.1>    Compiling zerovec v0.10.4620pg_graphql-1.6.1>    Compiling displaydoc v0.2.5621pg_graphql-1.6.1>    Compiling tinystr v0.7.6622pg_graphql-1.6.1>    Compiling icu_locid v1.5.0623pg_graphql-1.6.1>    Compiling icu_provider_macros v1.5.0624pg_graphql-1.6.1>    Compiling icu_provider v1.5.0625pg_graphql-1.6.1>    Compiling icu_locid_transform v1.5.0626pg_graphql-1.6.1>    Compiling icu_collections v1.5.0627pg_graphql-1.6.1>    Compiling thiserror-impl v2.0.16628pg_graphql-1.6.1>    Compiling icu_properties v1.5.1629pg_graphql-1.6.1>    Compiling toml_datetime v0.7.0630pg_graphql-1.6.1>    Compiling icu_normalizer v1.5.0631pg_graphql-1.6.1>    Compiling idna_adapter v1.2.0632pg_graphql-1.6.1>    Compiling serde_spanned v1.0.0633pg_graphql-1.6.1>    Compiling toml_parser v1.0.2634pg_graphql-1.6.1>    Compiling cc v1.2.11635pg_graphql-1.6.1>    Compiling aho-corasick v1.1.3636pg_graphql-1.6.1>    Compiling regex-syntax v0.8.5637pg_graphql-1.6.1>    Compiling toml_writer v1.0.2638pg_graphql-1.6.1>    Compiling is_ci v1.2.0639pg_graphql-1.6.1>    Compiling owo-colors v4.2.2640pg_graphql-1.6.1>    Compiling percent-encoding v2.3.1641pg_graphql-1.6.1>    Compiling minimal-lexical v0.2.1642pg_graphql-1.6.1>    Compiling cfg-if v1.0.0643pg_graphql-1.6.1>    Compiling libloading v0.8.6644pg_graphql-1.6.1>    Compiling nom v7.1.3645pg_graphql-1.6.1>    Compiling regex-automata v0.4.9646pg_graphql-1.6.1>    Compiling form_urlencoded v1.2.1647pg_graphql-1.6.1>    Compiling supports-color v3.0.2648pg_graphql-1.6.1>    Compiling toml v0.9.5649pg_graphql-1.6.1>    Compiling idna v1.0.3650pg_graphql-1.6.1>    Compiling itoa v1.0.14651pg_graphql-1.6.1>    Compiling unicode-width v0.2.1652pg_graphql-1.6.1>    Compiling allocator-api2 v0.2.21653pg_graphql-1.6.1>    Compiling ryu v1.0.19654pg_graphql-1.6.1>    Compiling either v1.13.0655pg_graphql-1.6.1>    Compiling getrandom v0.3.1656pg_graphql-1.6.1>    Compiling equivalent v1.0.1657pg_graphql-1.6.1>    Compiling syn v1.0.109658pg_graphql-1.6.1>    Compiling foldhash v0.1.5659pg_graphql-1.6.1>    Compiling bindgen v0.71.1660pg_graphql-1.6.1>    Compiling anstyle v1.0.10661pg_graphql-1.6.1>    Compiling annotate-snippets v0.11.5662pg_graphql-1.6.1>    Compiling hashbrown v0.15.2663pg_graphql-1.6.1>    Compiling itertools v0.13.0664pg_graphql-1.6.1>    Compiling url v2.5.4665pg_graphql-1.6.1>    Compiling pathsearch v0.2.0666pg_graphql-1.6.1>    Compiling regex v1.11.1667pg_graphql-1.6.1>    Compiling cargo_toml v0.22.3668pg_graphql-1.6.1>    Compiling cexpr v0.6.0669pg_graphql-1.6.1>    Compiling same-file v1.0.6670pg_graphql-1.6.1>    Compiling rustc-hash v2.1.1671pg_graphql-1.6.1>    Compiling bitflags v2.9.3672pg_graphql-1.6.1>    Compiling walkdir v2.5.0673pg_graphql-1.6.1>    Compiling pgrx-pg-config v0.16.1674pg_graphql-1.6.1>    Compiling indexmap v2.7.1675pg_graphql-1.6.1>    Compiling strsim v0.10.0676pg_graphql-1.6.1>    Compiling zerocopy v0.8.14677pg_graphql-1.6.1>    Compiling unicode-segmentation v1.12.0678pg_graphql-1.6.1>    Compiling fixedbitset v0.5.7679pg_graphql-1.6.1>    Compiling ident_case v1.0.1680pg_graphql-1.6.1>    Compiling fnv v1.0.7681pg_graphql-1.6.1>    Compiling darling_core v0.14.4682pg_graphql-1.6.1>    Compiling petgraph v0.8.2683pg_graphql-1.6.1>    Compiling convert_case v0.8.0684pg_graphql-1.6.1>    Compiling pgrx-bindgen v0.16.1685pg_graphql-1.6.1>    Compiling cee-scape v0.2.0686pg_graphql-1.6.1>    Compiling zerocopy-derive v0.7.35687pg_graphql-1.6.1>    Compiling byteorder v1.5.0688pg_graphql-1.6.1>    Compiling radium v0.7.0689pg_graphql-1.6.1>    Compiling unescape v0.1.0690pg_graphql-1.6.1>    Compiling thiserror v1.0.69691pg_graphql-1.6.1>    Compiling pgrx-sql-entity-graph v0.16.1692pg_graphql-1.5.9>     Finished `release` profile [optimized] target(s) in 4m 30s693pg_graphql-1.5.9>   Installing extension694pg_graphql-1.5.9>      Copying control file to /nix/store/n3yzx2pdglamrghxhz5s1mjrc4x3lhv2-pg_graphql-1.5.9/nix/store/9q4p23a2y63xn8safzzn6lbn07bnkshs-postgresql-17.11/share/postgresql/extension/pg_graphql.control695pg_graphql-1.5.9>      Copying shared library to /nix/store/n3yzx2pdglamrghxhz5s1mjrc4x3lhv2-pg_graphql-1.5.9/nix/store/07zklik5dwl2sfqym1gwbrrkfby7lrjn-postgresql-17.11-lib/lib/pg_graphql.so696pg_graphql-1.5.9>   Discovered 5 SQL entities: 0 schemas (0 unique), 1 functions, 0 types, 0 enums, 4 sqls, 0 ords, 0 hashes, 0 aggregates, 0 triggers697pg_graphql-1.5.9>   Rebuilding pgrx_embed, in debug mode, for SQL generation with features  pg17698pg_graphql-1.5.9>    Compiling proc-macro2 v1.0.79699pg_graphql-1.5.9>    Compiling unicode-ident v1.0.12700pg_graphql-1.5.9>    Compiling thiserror v1.0.58701pg_graphql-1.5.9>    Compiling libc v0.2.153702pg_graphql-1.6.1>    Compiling zerocopy v0.7.35703pg_graphql-1.5.9>    Compiling quote v1.0.36704pg_graphql-1.5.9>    Compiling syn v2.0.58705pg_graphql-1.5.9>    Compiling cfg-if v1.0.0706pg_graphql-1.5.9>    Compiling equivalent v1.0.1707pg_graphql-1.5.9>    Compiling memchr v2.7.2708pg_graphql-1.6.1>    Compiling pgrx-pg-sys v0.16.1709pg_graphql-1.5.9>    Compiling serde v1.0.197710pg_graphql-1.5.9>    Compiling hashbrown v0.14.3711pg_graphql-1.5.9>    Compiling indexmap v2.2.6712pg_graphql-1.5.9>    Compiling eyre v0.6.12713pg_graphql-1.5.9>    Compiling once_cell v1.19.0714pg_graphql-1.5.9>    Compiling glob v0.3.1715pg_graphql-1.6.1>    Compiling darling_macro v0.14.4716pg_graphql-1.5.9>    Compiling tinyvec_macros v0.1.1717pg_graphql-1.5.9>    Compiling indenter v0.3.3718pg_graphql-1.6.1>    Compiling thiserror-impl v1.0.69719pg_graphql-1.5.9>    Compiling tinyvec v1.6.0720pg_graphql-1.5.9>    Compiling clang-sys v1.7.0721pg_graphql-1.6.1>    Compiling tap v1.0.1722pg_graphql-1.5.9>    Compiling is_ci v1.2.0723pg_graphql-1.5.9>    Compiling anyhow v1.0.82724pg_graphql-1.5.9>    Compiling serde_json v1.0.115725pg_graphql-1.5.9>    Compiling winnow v0.6.5726pg_graphql-1.5.9>    Compiling thiserror-impl v1.0.58727pg_graphql-1.5.9>    Compiling serde_derive v1.0.197728pg_graphql-1.5.9>    Compiling unicode-normalization v0.1.23729pg_graphql-1.5.9>    Compiling is-terminal v0.4.13730pg_graphql-1.5.9>    Compiling cc v1.0.92731pg_graphql-1.5.9>    Compiling minimal-lexical v0.2.1732pg_graphql-1.5.9>    Compiling ryu v1.0.17733pg_graphql-1.5.9>    Compiling percent-encoding v2.3.1734pg_graphql-1.5.9>    Compiling itoa v1.0.11735pg_graphql-1.5.9>    Compiling unicode-bidi v0.3.15736pg_graphql-1.5.9>    Compiling ucd-trie v0.1.6737pg_graphql-1.5.9>    Compiling owo-colors v4.1.0738pg_graphql-1.5.9>    Compiling regex-syntax v0.8.3739pg_graphql-1.5.9>    Compiling regex-automata v0.4.6740pg_graphql-1.5.9>    Compiling serde_spanned v0.6.5741pg_graphql-1.5.9>    Compiling toml_datetime v0.6.5742pg_graphql-1.5.9>    Compiling toml_edit v0.22.9743pg_graphql-1.6.1>    Compiling wyz v0.5.1744pg_graphql-1.6.1>    Compiling darling v0.14.4745pg_graphql-1.6.1>    Compiling rand_core v0.9.0746pg_graphql-1.5.9>    Compiling toml v0.8.12747pg_graphql-1.6.1>    Compiling pgrx-macros v0.16.1748pg_graphql-1.5.9>    Compiling pest v2.7.9749pg_graphql-1.5.9>    Compiling idna v0.5.0750pg_graphql-1.6.1>    Compiling ppv-lite86 v0.2.20751pg_graphql-1.5.9>    Compiling form_urlencoded v1.2.1752pg_graphql-1.6.1>    Compiling enum-map-derive v0.17.0753pg_graphql-1.5.9>    Compiling nom v7.1.3754pg_graphql-1.5.9>    Compiling supports-color v2.1.0755pg_graphql-1.6.1>    Compiling funty v2.0.0756pg_graphql-1.5.9>    Compiling supports-color v3.0.1757pg_graphql-1.5.9>    Compiling libloading v0.8.3758pg_graphql-1.5.9>    Compiling either v1.10.0759pg_graphql-1.6.1>    Compiling half v1.8.3760pg_graphql-1.5.9>    Compiling yansi-term v0.1.2761pg_graphql-1.5.9>    Compiling bindgen v0.70.1762pg_graphql-1.6.1>    Compiling bytes v1.11.1763pg_graphql-1.5.9>    Compiling syn v1.0.109764pg_graphql-1.5.9>    Compiling unicode-width v0.1.14765pg_graphql-1.5.9>    Compiling fixedbitset v0.4.2766pg_graphql-1.5.9>    Compiling cexpr v0.6.0767pg_graphql-1.5.9>    Compiling annotate-snippets v0.9.2768pg_graphql-1.5.9>    Compiling itertools v0.12.1769pg_graphql-1.6.1>    Compiling combine v4.6.7770pg_graphql-1.5.9>    Compiling pathsearch v0.2.0771pg_graphql-1.5.9>    Compiling url v2.5.0772pg_graphql-1.5.9>    Compiling semver-parser v0.10.2773pg_graphql-1.5.9>    Compiling cargo_toml v0.19.2774pg_graphql-1.6.1>    Compiling serde_cbor v0.11.2775pg_graphql-1.6.1>    Compiling bitvec v1.0.1776pg_graphql-1.5.9>    Compiling regex v1.10.4777pg_graphql-1.6.1>    Compiling enum-map v2.7.3778pg_graphql-1.6.1>    Compiling rand_chacha v0.9.0779pg_graphql-1.5.9>    Compiling home v0.5.9780pg_graphql-1.6.1>    Compiling cached_proc_macro v0.18.1781pg_graphql-1.5.9>    Compiling rustc-hash v1.1.0782pg_graphql-1.5.9>    Compiling bitflags v2.5.0783pg_graphql-1.5.9>    Compiling shlex v1.3.0784pg_graphql-1.5.9>    Compiling same-file v1.0.6785pg_graphql-1.5.9>    Compiling unicode-segmentation v1.11.0786pg_graphql-1.5.9>    Compiling convert_case v0.6.0787pg_graphql-1.6.1>    Compiling uuid v1.18.0788pg_graphql-1.5.9>    Compiling walkdir v2.5.0789pg_graphql-1.6.1>    Compiling instant v0.1.13790pg_graphql-1.6.1>    Compiling cached_proc_macro_types v0.1.1791pg_graphql-1.5.9>    Compiling pgrx-pg-config v0.12.6792pg_graphql-1.6.1>    Compiling seahash v4.1.0793pg_graphql-1.6.1>    Compiling hashbrown v0.14.5794pg_graphql-1.6.1>    Compiling cached v0.46.1795pg_graphql-1.5.9>    Compiling semver v0.11.0796pg_graphql-1.6.1>    Compiling itertools v0.10.5797pg_graphql-1.6.1>    Compiling pgrx v0.16.1798pg_graphql-1.6.1>    Compiling rand v0.9.3799pg_graphql-1.6.1>    Compiling graphql-parser v0.4.1800pg_graphql-1.6.1>    Compiling bimap v0.6.3801pg_graphql-1.6.1>    Compiling lazy_static v1.5.0802pg_graphql-1.6.1>    Compiling base64 v0.13.1803pg_graphql-1.5.9>    Compiling getrandom v0.2.14804pg_graphql-1.5.9>    Compiling fnv v1.0.7805pg_graphql-1.5.9>    Compiling ident_case v1.0.1806pg_graphql-1.5.9>    Compiling unescape v0.1.0807pg_graphql-1.5.9>    Compiling strsim v0.10.0808pg_graphql-1.5.9>    Compiling byteorder v1.5.0809pg_graphql-1.5.9>    Compiling darling_core v0.14.4810pg_graphql-1.5.9>    Compiling pgrx-bindgen v0.12.6811pg_graphql-1.5.9>    Compiling rustc_version v0.3.3812pg_graphql-1.5.9>    Compiling petgraph v0.6.4813pg_graphql-1.5.9>    Compiling cee-scape v0.2.0814pg_graphql-1.5.9>    Compiling radium v0.7.0815pg_graphql-1.5.9>    Compiling pgrx-pg-sys v0.12.6816pg_graphql-1.5.9>    Compiling pgrx-sql-entity-graph v0.12.6817pg_graphql-1.6.1>    Compiling pg_graphql v1.6.1 (/build/source)818pg_graphql-1.5.9>    Compiling atomic-traits v0.3.0819pg_graphql-1.5.9>    Compiling darling_macro v0.14.4820pg_graphql-1.5.9>    Compiling tap v1.0.1821pg_graphql-1.5.9>    Compiling void v1.0.2822pg_graphql-1.5.9>    Compiling heapless v0.8.0823pg_graphql-1.5.9>    Compiling unreachable v1.0.0824pg_graphql-1.5.9>    Compiling wyz v0.5.1825pg_graphql-1.5.9>    Compiling pgrx-macros v0.12.6826pg_graphql-1.5.9>    Compiling darling v0.14.4827pg_graphql-1.5.9>    Compiling hash32 v0.3.1828pg_graphql-1.5.9>    Compiling rand_core v0.6.4829pg_graphql-1.5.9>    Compiling enum-map-derive v0.17.0830pg_graphql-1.5.9>    Compiling funty v2.0.0831pg_graphql-1.5.9>    Compiling half v1.8.3832pg_graphql-1.5.9>    Compiling stable_deref_trait v1.2.0833pg_graphql-1.5.9>    Compiling ppv-lite86 v0.2.17834pg_graphql-1.5.9>    Compiling sptr v0.3.2835pg_graphql-1.5.9>    Compiling ascii v0.9.3836pg_graphql-1.5.9>    Compiling combine v3.8.1837pg_graphql-1.5.9>    Compiling rand_chacha v0.3.1838pg_graphql-1.5.9>    Compiling serde_cbor v0.11.2839pg_graphql-1.5.9>    Compiling bitvec v1.0.1840pg_graphql-1.5.9>    Compiling enum-map v2.7.3841pg_graphql-1.6.1>     Finished `release` profile [optimized] target(s) in 3m 07s842pg_graphql-1.6.1>   Installing extension843pg_graphql-1.6.1>      Copying control file to /nix/store/s2s0vf5dji6nm5v4fzxgcj9jj7qh0s25-pg_graphql-1.6.1/nix/store/48l45fvi99n90x6p9i4cs1lmzby6cb73-postgresql-15.19/share/postgresql/extension/pg_graphql.control844pg_graphql-1.5.9>    Compiling cached_proc_macro v0.18.1845pg_graphql-1.6.1>      Copying shared library to /nix/store/s2s0vf5dji6nm5v4fzxgcj9jj7qh0s25-pg_graphql-1.6.1/nix/store/k4dpm55d68aq0df72hjk046xy1124lhn-postgresql-15.19-lib/lib/pg_graphql.so846pg_graphql-1.6.1>   Discovered 5 SQL entities: 0 schemas (0 unique), 1 functions, 0 types, 0 enums, 4 sqls, 0 ords, 0 hashes, 0 aggregates, 0 triggers847pg_graphql-1.6.1>   Rebuilding pgrx_embed, in debug mode, for SQL generation with features  pg15848pg_graphql-1.6.1>    Compiling proc-macro2 v1.0.101849pg_graphql-1.6.1>    Compiling unicode-ident v1.0.16850pg_graphql-1.6.1>    Compiling stable_deref_trait v1.2.0851pg_graphql-1.6.1>    Compiling libc v0.2.175852pg_graphql-1.6.1>    Compiling memchr v2.7.4853pg_graphql-1.6.1>    Compiling quote v1.0.40854pg_graphql-1.5.9>    Compiling uuid v1.8.0855pg_graphql-1.6.1>    Compiling syn v2.0.98856pg_graphql-1.6.1>    Compiling cfg-if v1.0.0857pg_graphql-1.6.1>    Compiling litemap v0.7.4858pg_graphql-1.6.1>    Compiling writeable v0.5.5859pg_graphql-1.6.1>    Compiling serde v1.0.219860pg_graphql-1.6.1>    Compiling icu_locid_transform_data v1.5.0861pg_graphql-1.6.1>    Compiling eyre v0.6.12862pg_graphql-1.6.1>    Compiling once_cell v1.21.3863pg_graphql-1.6.1>    Compiling icu_properties_data v1.5.0864pg_graphql-1.6.1>    Compiling thiserror v2.0.16865pg_graphql-1.6.1>    Compiling indenter v0.3.3866pg_graphql-1.6.1>    Compiling utf8_iter v1.0.4867pg_graphql-1.6.1>    Compiling equivalent v1.0.1868pg_graphql-1.5.9>    Compiling instant v0.1.12869pg_graphql-1.6.1>    Compiling icu_normalizer_data v1.5.0870pg_graphql-1.6.1>    Compiling foldhash v0.1.5871pg_graphql-1.5.9>    Compiling seahash v4.1.0872pg_graphql-1.6.1>    Compiling allocator-api2 v0.2.21873pg_graphql-1.5.9>    Compiling cached_proc_macro_types v0.1.1874pg_graphql-1.5.9>    Compiling cached v0.46.1875pg_graphql-1.6.1>    Compiling shlex v1.3.0876pg_graphql-1.5.9>    Compiling rand v0.8.5877pg_graphql-1.6.1>    Compiling utf16_iter v1.0.5878pg_graphql-1.6.1>    Compiling glob v0.3.2879pg_graphql-1.6.1>    Compiling synstructure v0.13.1880pg_graphql-1.6.1>    Compiling write16 v1.0.0881pg_graphql-1.6.1>    Compiling smallvec v1.13.2882pg_graphql-1.6.1>    Compiling clang-sys v1.8.1883pg_graphql-1.5.9>    Compiling graphql-parser v0.4.0884pg_graphql-1.6.1>    Compiling hashbrown v0.15.2885pg_graphql-1.6.1>    Compiling zerofrom-derive v0.1.5886pg_graphql-1.6.1>    Compiling yoke-derive v0.7.5887pg_graphql-1.6.1>    Compiling zerovec-derive v0.10.3888pg_graphql-1.6.1>    Compiling zerofrom v0.1.5889pg_graphql-1.6.1>    Compiling yoke v0.7.5890pg_graphql-1.6.1>    Compiling serde_derive v1.0.219891pg_graphql-1.5.9>    Compiling itertools v0.10.5892pg_graphql-1.6.1>    Compiling zerovec v0.10.4893pg_graphql-1.6.1>    Compiling displaydoc v0.2.5894pg_graphql-1.6.1>    Compiling tinystr v0.7.6895pg_graphql-1.6.1>    Compiling icu_locid v1.5.0896pg_graphql-1.5.9>    Compiling bimap v0.6.3897pg_graphql-1.6.1>    Compiling icu_provider_macros v1.5.0898pg_graphql-1.5.9>    Compiling base64 v0.13.1899pg_graphql-1.5.9>    Compiling lazy_static v1.4.0900pg_graphql-1.6.1>    Compiling icu_provider v1.5.0901pg_graphql-1.6.1>    Compiling icu_locid_transform v1.5.0902pg_graphql-1.5.9>    Compiling pgrx v0.12.6903pg_graphql-1.6.1>    Compiling icu_collections v1.5.0904pg_graphql-1.6.1>    Compiling icu_properties v1.5.1905pg_graphql-1.6.1>    Compiling thiserror-impl v2.0.16906pg_graphql-1.6.1>    Compiling icu_normalizer v1.5.0907pg_graphql-1.6.1>    Compiling winnow v0.7.13908pg_graphql-1.6.1>    Compiling serde_json v1.0.138909pg_graphql-1.6.1>    Compiling anyhow v1.0.95910pg_graphql-1.6.1>    Compiling idna_adapter v1.2.0911pg_graphql-1.6.1>    Compiling serde_spanned v1.0.0912pg_graphql-1.6.1>    Compiling toml_datetime v0.7.0913pg_graphql-1.6.1>    Compiling cc v1.2.11914pg_graphql-1.6.1>    Compiling toml_parser v1.0.2915pg_graphql-1.6.1>    Compiling aho-corasick v1.1.3916pg_graphql-1.6.1>    Compiling minimal-lexical v0.2.1917pg_graphql-1.6.1>    Compiling itoa v1.0.14918pg_graphql-1.6.1>    Compiling regex-syntax v0.8.5919pg_graphql-1.6.1>    Compiling percent-encoding v2.3.1920pg_graphql-1.6.1>    Compiling toml_writer v1.0.2921pg_graphql-1.6.1>    Compiling is_ci v1.2.0922pg_graphql-1.6.1>    Compiling owo-colors v4.2.2923pg_graphql-1.6.1>    Compiling ryu v1.0.19924pg_graphql-1.6.1>    Compiling supports-color v3.0.2925pg_graphql-1.6.1>    Compiling toml v0.9.5926pg_graphql-1.6.1>    Compiling regex-automata v0.4.9927pg_graphql-1.6.1>    Compiling form_urlencoded v1.2.1928pg_graphql-1.6.1>    Compiling nom v7.1.3929pg_graphql-1.6.1>    Compiling idna v1.0.3930pg_graphql-1.6.1>    Compiling libloading v0.8.6931pg_graphql-1.6.1>    Compiling anstyle v1.0.10932pg_graphql-1.6.1>    Compiling getrandom v0.3.1933pg_graphql-1.6.1>    Compiling unicode-width v0.2.1934pg_graphql-1.6.1>    Compiling fixedbitset v0.5.7935pg_graphql-1.6.1>    Compiling syn v1.0.109936pg_graphql-1.6.1>    Compiling either v1.13.0937pg_graphql-1.6.1>    Compiling bindgen v0.71.1938pg_graphql-1.6.1>    Compiling itertools v0.13.0939pg_graphql-1.6.1>    Compiling annotate-snippets v0.11.5940pg_graphql-1.5.9>    Compiling pg_graphql v1.5.9 (/build/source)941pg_graphql-1.6.1>    Compiling pathsearch v0.2.0942pg_graphql-1.6.1>    Compiling url v2.5.4943pg_graphql-1.6.1>    Compiling regex v1.11.1944pg_graphql-1.6.1>    Compiling cexpr v0.6.0945pg_graphql-1.6.1>    Compiling cargo_toml v0.22.3946pg_graphql-1.6.1>    Compiling same-file v1.0.6947pg_graphql-1.6.1>    Compiling rustc-hash v2.1.1948pg_graphql-1.6.1>    Compiling bitflags v2.9.3949pg_graphql-1.6.1>    Compiling unicode-segmentation v1.12.0950pg_graphql-1.6.1>    Compiling pgrx-pg-config v0.16.1951pg_graphql-1.6.1>    Compiling convert_case v0.8.0952pg_graphql-1.6.1>    Compiling walkdir v2.5.0953pg_graphql-1.6.1>    Compiling indexmap v2.7.1954pg_graphql-1.6.1>    Compiling zerocopy v0.8.14955pg_graphql-1.6.1>    Compiling strsim v0.10.0956pg_graphql-1.6.1>    Compiling ident_case v1.0.1957pg_graphql-1.6.1>    Compiling unescape v0.1.0958pg_graphql-1.6.1>    Compiling fnv v1.0.7959pg_graphql-1.6.1>    Compiling darling_core v0.14.4960pg_graphql-1.6.1>    Compiling petgraph v0.8.2961pg_graphql-1.6.1>    Compiling pgrx-bindgen v0.16.1962pg_graphql-1.6.1>    Compiling cee-scape v0.2.0963pg_graphql-1.6.1>    Compiling zerocopy-derive v0.7.35964pg_graphql-1.6.1>    Compiling thiserror v1.0.69965pg_graphql-1.6.1>    Compiling byteorder v1.5.0966pg_graphql-1.6.1>    Compiling radium v0.7.0967pg_graphql-1.6.1>    Compiling zerocopy v0.7.35968pg_graphql-1.6.1>    Compiling pgrx-pg-sys v0.16.1969pg_graphql-1.6.1>    Compiling pgrx-sql-entity-graph v0.16.1970pg_graphql-1.6.1>    Compiling darling_macro v0.14.4971pg_graphql-1.6.1>    Compiling thiserror-impl v1.0.69972pg_graphql-1.6.1>    Compiling tap v1.0.1973pg_graphql-1.6.1>    Compiling wyz v0.5.1974pg_graphql-1.6.1>    Compiling pgrx-macros v0.16.1975pg_graphql-1.6.1>    Compiling rand_core v0.9.0976pg_graphql-1.6.1>    Compiling darling v0.14.4977pg_graphql-1.5.9>     Finished `dev` profile [unoptimized + debuginfo] target(s) in 3m 15s978pg_graphql-1.5.9>      Writing SQL entities to /nix/store/n3yzx2pdglamrghxhz5s1mjrc4x3lhv2-pg_graphql-1.5.9/nix/store/9q4p23a2y63xn8safzzn6lbn07bnkshs-postgresql-17.11/share/postgresql/extension/pg_graphql--1.5.9.sql979pg_graphql-1.5.9>     Finished installing pg_graphql980pg_graphql-1.5.9> buildPhase completed in 7 minutes 48 seconds981pg_graphql-1.5.9> Running phase: checkPhase982pg_graphql-1.5.9>    Validating /nix/store/9q4p23a2y63xn8safzzn6lbn07bnkshs-postgresql-17.11/bin/pg_config983pg_graphql-1.5.9>  Initializing data directory at /build/tmp.YwRrOvoZXA/data-17984pg_graphql-1.6.1>    Compiling ppv-lite86 v0.2.20985pg_graphql-1.5.9> waiting for server to start....2026-10-06 14:22:22.215 GMT [4088] LOG:  starting PostgreSQL 17.11 on aarch64-unknown-linux-gnu, compiled by gcc (GCC) 15.2.0, 64-bit986pg_graphql-1.5.9> 2026-10-06 14:22:22.218 GMT [4088] LOG:  listening on Unix socket "/build/tmp.h10PAihqEG/.s.PGSQL.5432"987pg_graphql-1.5.9> 2026-10-06 14:22:22.226 GMT [4091] LOG:  database system was shut down at 2026-10-06 14:22:21 GMT988pg_graphql-1.5.9> 2026-10-06 14:22:22.232 GMT [4088] LOG:  database system is ready to accept connections989pg_graphql-1.6.1>    Compiling enum-map-derive v0.17.0990pg_graphql-1.5.9>  done991pg_graphql-1.5.9> server started992pg_graphql-1.5.9> createuser: error: connection to server at "localhost" (127.0.0.1), port 5432 failed: Connection refused993pg_graphql-1.5.9> 	Is the server running on that host and accepting TCP/IP connections?994pg_graphql-1.5.9> waiting for server to shut down....2026-10-06 14:22:22.300 GMT [4088] LOG:  received fast shutdown request995pg_graphql-1.5.9> 2026-10-06 14:22:22.303 GMT [4088] LOG:  aborting any active transactions996pg_graphql-1.5.9> 2026-10-06 14:22:22.305 GMT [4088] LOG:  background worker "logical replication launcher" (PID 4094) exited with exit code 1997pg_graphql-1.5.9> 2026-10-06 14:22:22.307 GMT [4089] LOG:  shutting down998pg_graphql-1.5.9> 2026-10-06 14:22:22.309 GMT [4089] LOG:  checkpoint starting: shutdown immediate999pg_graphql-1.5.9> 2026-10-06 14:22:22.329 GMT [4089] LOG:  checkpoint complete: wrote 3 buffers (0.0%); 0 WAL file(s) added, 0 removed, 0 recycled; write=0.007 s, sync=0.003 s, total=0.023 s; sync files=2, longest=0.002 s, average=0.002 s; distance=0 kB, estimate=0 kB; lsn=0/14EC338, redo lsn=0/14EC3381000pg_graphql-1.5.9> 2026-10-06 14:22:22.334 GMT [4088] LOG:  database system is shut down1001pg_graphql-1.5.9>  done1002pg_graphql-1.5.9> server stopped1003pg_graphql-1.5.9>    Validating /build/tmp.0LV5mwPfpR/17/bin/pg_config1004pg_graphql-1.5.9>  Initializing data directory at /build/tmp.0LV5mwPfpR/data-171005pg_graphql-1.6.1>    Compiling funty v2.0.01006pg_graphql-1.5.9>        Using PgConfig("pg17") and `pg_config` from /build/tmp.0LV5mwPfpR/17/bin/pg_config1007pg_graphql-1.5.9>     Building extension with features pg171008pg_graphql-1.5.9>      Running command "/nix/store/hxlcfmjxs6akpyya3k1d4qk1ghbw11ij-rust-default-1.81.0/bin/cargo" "build" "--lib" "--release" "--features" "pg17" "--no-default-features" "--message-format=json-render-diagnostics" "--frozen" "-j" "2"1009pg_graphql-1.5.9>     Finished `release` profile [optimized] target(s) in 0.13s1010pg_graphql-1.5.9>   Installing extension1011pg_graphql-1.5.9>      Copying control file to /build/tmp.0LV5mwPfpR/17/share/postgresql/extension/pg_graphql.control1012pg_graphql-1.6.1>    Compiling bytes v1.11.11013pg_graphql-1.5.9>      Copying shared library to /build/tmp.0LV5mwPfpR/17/lib/pg_graphql.so1014pg_graphql-1.5.9>   Discovered 5 SQL entities: 0 schemas (0 unique), 1 functions, 0 types, 0 enums, 4 sqls, 0 ords, 0 hashes, 0 aggregates, 0 triggers1015pg_graphql-1.5.9>   Rebuilding pgrx_embed, in debug mode, for SQL generation with features pg171016pg_graphql-1.5.9>    Compiling pg_graphql v1.5.9 (/build/source)1017pg_graphql-1.6.1>    Compiling half v1.8.31018pg_graphql-1.6.1>    Compiling serde_cbor v0.11.21019pg_graphql-1.6.1>    Compiling combine v4.6.71020pg_graphql-1.6.1>    Compiling bitvec v1.0.11021pg_graphql-1.6.1>    Compiling enum-map v2.7.31022pg_graphql-1.6.1>    Compiling rand_chacha v0.9.01023pg_graphql-1.6.1>    Compiling cached_proc_macro v0.18.11024pg_graphql-1.6.1>    Compiling uuid v1.18.01025pg_graphql-1.6.1>    Compiling instant v0.1.131026pg_graphql-1.6.1>    Compiling cached_proc_macro_types v0.1.11027pg_graphql-1.6.1>    Compiling hashbrown v0.14.51028pg_graphql-1.6.1>    Compiling seahash v4.1.01029pg_graphql-1.6.1>    Compiling cached v0.46.11030pg_graphql-1.6.1>    Compiling itertools v0.10.51031pg_graphql-1.6.1>    Compiling rand v0.9.31032pg_graphql-1.6.1>    Compiling graphql-parser v0.4.11033pg_graphql-1.6.1>    Compiling bimap v0.6.31034pg_graphql-1.6.1>    Compiling lazy_static v1.5.01035pg_graphql-1.6.1>    Compiling base64 v0.13.11036pg_graphql-1.6.1>    Compiling pgrx v0.16.11037pg_graphql-1.5.9>     Finished `dev` profile [unoptimized + debuginfo] target(s) in 22.74s1038pg_graphql-1.5.9>      Writing SQL entities to /build/tmp.0LV5mwPfpR/17/share/postgresql/extension/pg_graphql--1.5.9.sql1039pg_graphql-1.5.9>     Finished installing pg_graphql1040pg_graphql-1.5.9> ++ mktemp -d1041pg_graphql-1.5.9> + TMPDIR=/build/tmp.lrMV1Ebuay1042pg_graphql-1.5.9> + export PGDATA=/build/tmp.lrMV1Ebuay1043pg_graphql-1.5.9> + PGDATA=/build/tmp.lrMV1Ebuay1044pg_graphql-1.5.9> + export PGHOST=/build/tmp.lrMV1Ebuay1045pg_graphql-1.5.9> + PGHOST=/build/tmp.lrMV1Ebuay1046pg_graphql-1.5.9> + export PGUSER=postgres1047pg_graphql-1.5.9> + PGUSER=postgres1048pg_graphql-1.5.9> + export PGDATABASE=postgres1049pg_graphql-1.5.9> + PGDATABASE=postgres1050pg_graphql-1.5.9> + export PGTZ=UTC1051pg_graphql-1.5.9> + PGTZ=UTC1052pg_graphql-1.5.9> + export PG_COLOR=auto1053pg_graphql-1.5.9> + PG_COLOR=auto1054pg_graphql-1.5.9> + trap 'pg_ctl stop -m i' sigint sigterm exit1055pg_graphql-1.5.9> + rm -rf /build/tmp.lrMV1Ebuay1056pg_graphql-1.5.9> + initdb --no-locale --encoding=UTF8 --nosync -U postgres1057pg_graphql-1.5.9> The files belonging to this database system will be owned by user "nixbld".1058pg_graphql-1.5.9> This user must also own the server process.1059pg_graphql-1.5.9> 1060pg_graphql-1.5.9> The database cluster will be initialized with locale "C".1061pg_graphql-1.5.9> The default text search configuration will be set to "english".1062pg_graphql-1.5.9> 1063pg_graphql-1.5.9> Data page checksums are disabled.1064pg_graphql-1.5.9> 1065pg_graphql-1.5.9> creating directory /build/tmp.lrMV1Ebuay ... ok1066pg_graphql-1.5.9> creating subdirectories ... ok1067pg_graphql-1.5.9> selecting dynamic shared memory implementation ... posix1068pg_graphql-1.5.9> selecting default "max_connections" ... 1001069pg_graphql-1.5.9> selecting default "shared_buffers" ... 128MB1070pg_graphql-1.5.9> selecting default time zone ... UTC1071pg_graphql-1.5.9> creating configuration files ... ok1072pg_graphql-1.5.9> running bootstrap script ... ok1073pg_graphql-1.5.9> performing post-bootstrap initialization ... ok1074pg_graphql-1.5.9> 1075pg_graphql-1.5.9> Sync to disk skipped.1076pg_graphql-1.5.9> The data directory might become corrupt if the operating system crashes.1077pg_graphql-1.5.9> 1078pg_graphql-1.5.9> initdb: warning: enabling "trust" authentication for local connections1079pg_graphql-1.5.9> initdb: hint: You can change this by editing pg_hba.conf or using the option -A, or --auth-local and --auth-host, the next time you run initdb.1080pg_graphql-1.5.9> 1081pg_graphql-1.5.9> Success. You can now start the database server using:1082pg_graphql-1.5.9> 1083pg_graphql-1.5.9>     /build/tmp.0LV5mwPfpR/17/bin/pg_ctl -D /build/tmp.lrMV1Ebuay -l logfile start1084pg_graphql-1.5.9> 1085pg_graphql-1.5.9> + pg_ctl start -o '-F -c listen_addresses="" -c log_min_messages=WARNING -k /build/tmp.lrMV1Ebuay'1086pg_graphql-1.5.9> waiting for server to start....2026-10-06 14:22:47.459 UTC [4360] LOG:  starting PostgreSQL 17.11 on aarch64-unknown-linux-gnu, compiled by gcc (GCC) 15.2.0, 64-bit1087pg_graphql-1.5.9> 2026-10-06 14:22:47.459 UTC [4360] LOG:  listening on Unix socket "/build/tmp.lrMV1Ebuay/.s.PGSQL.5432"1088pg_graphql-1.5.9> 2026-10-06 14:22:47.461 UTC [4363] LOG:  database system was shut down at 2026-10-06 14:22:47 UTC1089pg_graphql-1.5.9> 2026-10-06 14:22:47.465 UTC [4360] LOG:  database system is ready to accept connections1090pg_graphql-1.5.9>  done1091pg_graphql-1.5.9> server started1092pg_graphql-1.5.9> + createdb contrib_regression1093pg_graphql-1.5.9> + TESTDIR=test1094pg_graphql-1.5.9> +++ pg_config --pgxs1095pg_graphql-1.5.9> ++ dirname /nix/store/9q4p23a2y63xn8safzzn6lbn07bnkshs-postgresql-17.11/lib/pgxs/src/makefiles/pgxs.mk1096pg_graphql-1.5.9> + PGXS=/nix/store/9q4p23a2y63xn8safzzn6lbn07bnkshs-postgresql-17.11/lib/pgxs/src/makefiles1097pg_graphql-1.5.9> + REGRESS=/nix/store/9q4p23a2y63xn8safzzn6lbn07bnkshs-postgresql-17.11/lib/pgxs/src/makefiles/../test/regress/pg_regress1098pg_graphql-1.5.9> + '[' 0 -ne 0 ']'1099pg_graphql-1.5.9> ++ ls test/sql1100pg_graphql-1.5.9> ++ sed -e 's/\..*$//'1101pg_graphql-1.5.9> ++ sort1102pg_graphql-1.5.9> + TESTS=$'aliases\nallow_camel_names\narray_args_and_return_types\nbigint_is_string\nbuiltin_directives\ncomment_directive\ncomment_directive_description\ncompound_filters\nempty_mutations\nenum_mappings\nextend_type_with_function\nextend_type_with_function_relation\nextend_type_with_generated_column\nfilter_by_node_id\nfragment_on_mutation\nfragment_on_query\nfunction_calls\nfunction_calls_default_args\nfunction_calls_unsupported\nfunction_return_row_is_selectable\nfunction_return_view_has_pkey\ninflection_fields\ninflection_function\ninflection_relationships\ninflection_types\nissue_163\nissue_170\nissue_225\nissue_237_field_merging\nissue_237_field_merging_mismatched\nissue_300\nissue_306\nissue_312\nissue_334_ambiguous_function\nissue_337\nissue_339_function_return_json\nissue_339_function_return_table\nissue_353_too_many_fields\nissue_370_citext_as_string\nissue_373\nissue_377_enum_search_path\nissue_409_fkey_rls_nullability\nissue_444\nissue_463\nissue_511\nissue_533\nissue_542_partial_unique\nissue_551_too_many_fields\nissue_557_1_to_1_nullability\nissue_fragment_spread_cycles\njson_is_stringified\nmax_page_size\nmax_rows_directive\nmulti_column_primary_key\nmultiple_mutations\nmultiple_queries\nmutation_delete\nmutation_delete_variable\nmutation_insert\nmutation_update\nnull_argument\nomit_exotic_types\nomit_weird_names\noperation_name\noverride_enum_name\noverride_field_name\noverride_func_field_name\noverride_relationship_field_name\noverride_type_name\npage_info\npermissions_connection_column\npermissions_functions\npermissions_node_column\npermissions_table_level\npermissions_types\nprimary_key_is_required\nrelationship_one_to_one\nresolve___schema\nresolve___type\nresolve___typename\nresolve_array_type\nresolve_connection_filter\nresolve_connection_named\nresolve_connection_order_by\nresolve_connection_pagination_args\nresolve_connection_to_conn\nresolve_connection_to_node\nresolve_error_connection_edge_no_field\nresolve_error_connection_edge_node_no_field\nresolve_error_connection_no_field\nresolve_error_from_parser\nresolve_error_mutation_no_field\nresolve_error_node_no_field\nresolve_error_query_no_field\nresolve_fragment\nresolve_graphiql_schema\nresolve_one\nroundtrip_types\nrow_level_security\nsqli_connection\nstring_filters\ntest_error_anon_and_named_operations\ntest_error_invalid_offset\ntest_error_multiple_anon_operations\ntest_error_mutation_transpilation\ntest_error_operation_name_not_found\ntest_error_operation_names_not_unique\ntest_error_parsing\ntest_error_query_transpilation\ntest_error_subscription\ntest_query__type\ntotal_count\ntype_bigfloat\ntype_modifier_max_length\ntype_opaque\nvariable_default\nviews_integration'1103pg_graphql-1.5.9> + psql -v ON_ERROR_STOP=1 -f test/fixtures.sql -d contrib_regression1104pg_graphql-1.5.9> psql:test/fixtures.sql:1: NOTICE:  extension "pg_graphql" does not exist, skipping1105pg_graphql-1.5.9> DROP EXTENSION1106pg_graphql-1.5.9> CREATE EXTENSION1107pg_graphql-1.5.9> COMMENT1108pg_graphql-1.5.9> CREATE FUNCTION1109pg_graphql-1.5.9> + /nix/store/9q4p23a2y63xn8safzzn6lbn07bnkshs-postgresql-17.11/lib/pgxs/src/makefiles/../test/regress/pg_regress --use-existing --dbname=contrib_regression --inputdir=test aliases allow_camel_names array_args_and_return_types bigint_is_string builtin_directives comment_directive comment_directive_description compound_filters empty_mutations enum_mappings extend_type_with_function extend_type_with_function_relation extend_type_with_generated_column filter_by_node_id fragment_on_mutation fragment_on_query function_calls function_calls_default_args function_calls_unsupported function_return_row_is_selectable function_return_view_has_pkey inflection_fields inflection_function inflection_relationships inflection_types issue_163 issue_170 issue_225 issue_237_field_merging issue_237_field_merging_mismatched issue_300 issue_306 issue_312 issue_334_ambiguous_function issue_337 issue_339_function_return_json issue_339_function_return_table issue_353_too_many_fields issue_370_citext_as_string issue_373 issue_377_enum_search_path issue_409_fkey_rls_nullability issue_444 issue_463 issue_511 issue_533 issue_542_partial_unique issue_551_too_many_fields issue_557_1_to_1_nullability issue_fragment_spread_cycles json_is_stringified max_page_size max_rows_directive multi_column_primary_key multiple_mutations multiple_queries mutation_delete mutation_delete_variable mutation_insert mutation_update null_argument omit_exotic_types omit_weird_names operation_name override_enum_name override_field_name override_func_field_name override_relationship_field_name override_type_name page_info permissions_connection_column permissions_functions permissions_node_column permissions_table_level permissions_types primary_key_is_required relationship_one_to_one resolve___schema resolve___type resolve___typename resolve_array_type resolve_connection_filter resolve_connection_named resolve_connection_order_by resolve_connection_pagination_args resolve_connection_to_conn resolve_connection_to_node resolve_error_connection_edge_no_field resolve_error_connection_edge_node_no_field resolve_error_connection_no_field resolve_error_from_parser resolve_error_mutation_no_field resolve_error_node_no_field resolve_error_query_no_field resolve_fragment resolve_graphiql_schema resolve_one roundtrip_types row_level_security sqli_connection string_filters test_error_anon_and_named_operations test_error_invalid_offset test_error_multiple_anon_operations test_error_mutation_transpilation test_error_operation_name_not_found test_error_operation_names_not_unique test_error_parsing test_error_query_transpilation test_error_subscription test_query__type total_count type_bigfloat type_modifier_max_length type_opaque variable_default views_integration1110pg_graphql-1.5.9> # using postmaster on /build/tmp.lrMV1Ebuay, default port1111pg_graphql-1.5.9> ok 1         - aliases                                    56 ms1112pg_graphql-1.5.9> ok 2         - allow_camel_names                          54 ms1113pg_graphql-1.5.9> ok 3         - array_args_and_return_types              1552 ms1114pg_graphql-1.5.9> ok 4         - bigint_is_string                           52 ms1115pg_graphql-1.5.9> ok 5         - builtin_directives                         60 ms1116pg_graphql-1.5.9> ok 6         - comment_directive                          10 ms1117pg_graphql-1.5.9> ok 7         - comment_directive_description              49 ms1118pg_graphql-1.5.9> ok 8         - compound_filters                          250 ms1119pg_graphql-1.5.9> ok 9         - empty_mutations                            51 ms1120pg_graphql-1.5.9> ok 10        - enum_mappings                              55 ms1121pg_graphql-1.5.9> ok 11        - extend_type_with_function                  51 ms1122pg_graphql-1.5.9> ok 12        - extend_type_with_function_relation        142 ms1123pg_graphql-1.5.9> ok 13        - extend_type_with_generated_column          52 ms1124pg_graphql-1.5.9> ok 14        - filter_by_node_id                          58 ms1125pg_graphql-1.5.9> ok 15        - fragment_on_mutation                       49 ms1126pg_graphql-1.5.9> ok 16        - fragment_on_query                          51 ms1127pg_graphql-1.5.9> ok 17        - function_calls                           1329 ms1128pg_graphql-1.5.9> ok 18        - function_calls_default_args                97 ms1129pg_graphql-1.5.9> ok 19        - function_calls_unsupported                295 ms1130pg_graphql-1.5.9> ok 20        - function_return_row_is_selectable          79 ms1131pg_graphql-1.5.9> ok 21        - function_return_view_has_pkey              75 ms1132pg_graphql-1.5.9> ok 22        - inflection_fields                         122 ms1133pg_graphql-1.5.9> ok 23        - inflection_function                       123 ms1134pg_graphql-1.5.9> ok 24        - inflection_relationships                  189 ms1135pg_graphql-1.5.9> ok 25        - inflection_types                          127 ms1136pg_graphql-1.5.9> ok 26        - issue_163                                  46 ms1137pg_graphql-1.5.9> ok 27        - issue_170                                  50 ms1138pg_graphql-1.5.9> ok 28        - issue_225                                  51 ms1139pg_graphql-1.5.9> ok 29        - issue_237_field_merging                    90 ms1140pg_graphql-1.5.9> ok 30        - issue_237_field_merging_mismatched         83 ms1141pg_graphql-1.5.9> ok 31        - issue_300                                  54 ms1142pg_graphql-1.5.9> ok 32        - issue_306                                  54 ms1143pg_graphql-1.5.9> ok 33        - issue_312                                  53 ms1144pg_graphql-1.5.9> ok 34        - issue_334_ambiguous_function               50 ms1145pg_graphql-1.5.9> ok 35        - issue_337                                  85 ms1146pg_graphql-1.6.1>    Compiling pg_graphql v1.6.1 (/build/source)1147pg_graphql-1.5.9> ok 36        - issue_339_function_return_json             48 ms1148pg_graphql-1.5.9> ok 37        - issue_339_function_return_table            47 ms1149pg_graphql-1.5.9> ok 38        - issue_353_too_many_fields                  59 ms1150pg_graphql-1.5.9> ok 39        - issue_370_citext_as_string                 63 ms1151pg_graphql-1.5.9> ok 40        - issue_373                                  54 ms1152pg_graphql-1.5.9> ok 41        - issue_377_enum_search_path                 76 ms1153pg_graphql-1.5.9> ok 42        - issue_409_fkey_rls_nullability            106 ms1154pg_graphql-1.5.9> ok 43        - issue_444                                  43 ms1155pg_graphql-1.5.9> ok 44        - issue_463                                  49 ms1156pg_graphql-1.5.9> ok 45        - issue_511                                  55 ms1157pg_graphql-1.5.9> ok 46        - issue_533                                  97 ms1158pg_graphql-1.5.9> ok 47        - issue_542_partial_unique                   77 ms1159pg_graphql-1.5.9> ok 48        - issue_551_too_many_fields                  66 ms1160pg_graphql-1.5.9> ok 49        - issue_557_1_to_1_nullability               58 ms1161pg_graphql-1.5.9> ok 50        - issue_fragment_spread_cycles              206 ms1162pg_graphql-1.5.9> ok 51        - json_is_stringified                        53 ms1163pg_graphql-1.5.9> ok 52        - max_page_size                              47 ms1164pg_graphql-1.5.9> ok 53        - max_rows_directive                        100 ms1165pg_graphql-1.5.9> ok 54        - multi_column_primary_key                   60 ms1166pg_graphql-1.5.9> ok 55        - multiple_mutations                         49 ms1167pg_graphql-1.5.9> ok 56        - multiple_queries                           50 ms1168pg_graphql-1.5.9> ok 57        - mutation_delete                            58 ms1169pg_graphql-1.5.9> ok 58        - mutation_delete_variable                   49 ms1170pg_graphql-1.5.9> ok 59        - mutation_insert                            58 ms1171pg_graphql-1.5.9> ok 60        - mutation_update                            63 ms1172pg_graphql-1.5.9> ok 61        - null_argument                              47 ms1173pg_graphql-1.5.9> ok 62        - omit_exotic_types                          48 ms1174pg_graphql-1.5.9> ok 63        - omit_weird_names                           72 ms1175pg_graphql-1.5.9> ok 64        - operation_name                             48 ms1176pg_graphql-1.5.9> ok 65        - override_enum_name                         43 ms1177pg_graphql-1.5.9> ok 66        - override_field_name                        46 ms1178pg_graphql-1.5.9> ok 67        - override_func_field_name                   52 ms1179pg_graphql-1.5.9> ok 68        - override_relationship_field_name           51 ms1180pg_graphql-1.5.9> ok 69        - override_type_name                         48 ms1181pg_graphql-1.5.9> ok 70        - page_info                                  67 ms1182pg_graphql-1.5.9> ok 71        - permissions_connection_column              81 ms1183pg_graphql-1.5.9> ok 72        - permissions_functions                      77 ms1184pg_graphql-1.5.9> ok 73        - permissions_node_column                    84 ms1185pg_graphql-1.5.9> ok 74        - permissions_table_level                   163 ms1186pg_graphql-1.5.9> ok 75        - permissions_types                          95 ms1187pg_graphql-1.5.9> ok 76        - primary_key_is_required                    74 ms1188pg_graphql-1.5.9> ok 77        - relationship_one_to_one                    53 ms1189pg_graphql-1.5.9> ok 78        - resolve___schema                           56 ms1190pg_graphql-1.5.9> ok 79        - resolve___type                             47 ms1191pg_graphql-1.5.9> ok 80        - resolve___typename                         51 ms1192pg_graphql-1.5.9> ok 81        - resolve_array_type                         51 ms1193pg_graphql-1.5.9> ok 82        - resolve_connection_filter                 104 ms1194pg_graphql-1.5.9> ok 83        - resolve_connection_named                   46 ms1195pg_graphql-1.5.9> ok 84        - resolve_connection_order_by                78 ms1196pg_graphql-1.5.9> ok 85        - resolve_connection_pagination_args         96 ms1197pg_graphql-1.5.9> ok 86        - resolve_connection_to_conn                 54 ms1198pg_graphql-1.5.9> ok 87        - resolve_connection_to_node                 51 ms1199pg_graphql-1.5.9> ok 88        - resolve_error_connection_edge_no_field       45 ms1200pg_graphql-1.5.9> ok 89        - resolve_error_connection_edge_node_no_field       45 ms1201pg_graphql-1.5.9> ok 90        - resolve_error_connection_no_field          47 ms1202pg_graphql-1.5.9> ok 91        - resolve_error_from_parser                  12 ms1203pg_graphql-1.5.9> ok 92        - resolve_error_mutation_no_field            42 ms1204pg_graphql-1.5.9> ok 93        - resolve_error_node_no_field                50 ms1205pg_graphql-1.5.9> ok 94        - resolve_error_query_no_field               43 ms1206pg_graphql-1.5.9> ok 95        - resolve_fragment                           48 ms1207pg_graphql-1.5.9> ok 96        - resolve_graphiql_schema                   107 ms1208pg_graphql-1.5.9> ok 97        - resolve_one                                90 ms1209pg_graphql-1.5.9> ok 98        - roundtrip_types                            62 ms1210pg_graphql-1.5.9> ok 99        - row_level_security                         55 ms1211pg_graphql-1.5.9> ok 100       - sqli_connection                            58 ms1212pg_graphql-1.5.9> ok 101       - string_filters                             58 ms1213pg_graphql-1.5.9> ok 102       - test_error_anon_and_named_operations       41 ms1214pg_graphql-1.5.9> ok 103       - test_error_invalid_offset                  78 ms1215pg_graphql-1.5.9> ok 104       - test_error_multiple_anon_operations        41 ms1216pg_graphql-1.5.9> ok 105       - test_error_mutation_transpilation          51 ms1217pg_graphql-1.5.9> ok 106       - test_error_operation_name_not_found        41 ms1218pg_graphql-1.5.9> ok 107       - test_error_operation_names_not_unique       42 ms1219pg_graphql-1.5.9> ok 108       - test_error_parsing                         11 ms1220pg_graphql-1.5.9> ok 109       - test_error_query_transpilation             49 ms1221pg_graphql-1.5.9> ok 110       - test_error_subscription                    42 ms1222pg_graphql-1.5.9> ok 111       - test_query__type                           45 ms1223pg_graphql-1.5.9> ok 112       - total_count                                74 ms1224pg_graphql-1.5.9> ok 113       - type_bigfloat                              54 ms1225pg_graphql-1.5.9> ok 114       - type_modifier_max_length                   52 ms1226pg_graphql-1.5.9> ok 115       - type_opaque                                52 ms1227pg_graphql-1.5.9> ok 116       - variable_default                           50 ms1228pg_graphql-1.5.9> ok 117       - views_integration                         166 ms1229pg_graphql-1.5.9> 1..1171230pg_graphql-1.5.9> # All 117 tests passed.1231pg_graphql-1.5.9> + pg_ctl stop -m i1232pg_graphql-1.5.9> waiting for server to shut down...2026-10-06 14:22:58.619 UTC [4360] LOG:  received immediate shutdown request1233pg_graphql-1.5.9> .2026-10-06 14:22:58.626 UTC [4360] LOG:  database system is shut down1234pg_graphql-1.5.9>  done1235pg_graphql-1.5.9> server stopped1236pg_graphql-1.5.9> checkPhase completed in 37 seconds1237pg_graphql-1.5.9> Running phase: installPhase1238pg_graphql-1.5.9> Executing buildPgrxExtension install1239pg_graphql-1.5.9> Running phase: fixupPhase1240pg_graphql-1.5.9> shrinking RPATHs of ELF executables and libraries in /nix/store/n3yzx2pdglamrghxhz5s1mjrc4x3lhv2-pg_graphql-1.5.91241pg_graphql-1.5.9> shrinking /nix/store/n3yzx2pdglamrghxhz5s1mjrc4x3lhv2-pg_graphql-1.5.9/lib/pg_graphql-1.5.9.so1242pg_graphql-1.5.9> checking for references to /build/ in /nix/store/n3yzx2pdglamrghxhz5s1mjrc4x3lhv2-pg_graphql-1.5.9...1243pg_graphql-1.5.9> patching script interpreter paths in /nix/store/n3yzx2pdglamrghxhz5s1mjrc4x3lhv2-pg_graphql-1.5.91244pg_graphql-1.5.9> stripping (with command strip and flags -S -p) in  /nix/store/n3yzx2pdglamrghxhz5s1mjrc4x3lhv2-pg_graphql-1.5.9/lib1245pg_graphql-1.5.9> stripping (with command strip and flags -s -p) in  /nix/store/n3yzx2pdglamrghxhz5s1mjrc4x3lhv2-pg_graphql-1.5.9/lib1246building '/nix/store/0n0iaya9csx9by2pimrx1yglzw8dp4zs-pg_net-0.13.0.drv' on 'ssh-ng://nixbot-remote-build@78.232.36.247'1247building '/nix/store/0n0iaya9csx9by2pimrx1yglzw8dp4zs-pg_net-0.13.0.drv'1248pg_net-0.13.0> Running phase: unpackPhase1249pg_net-0.13.0> unpacking source archive /nix/store/bxdzbzjn4yi7ch55dlcgzk6npzx2p4jz-source1250pg_net-0.13.0> source root is source1251pg_net-0.13.0> Running phase: patchPhase1252pg_net-0.13.0> Running phase: updateAutotoolsGnuConfigScriptsPhase1253pg_net-0.13.0> Running phase: configurePhase1254pg_net-0.13.0> no configure script, doing nothing1255pg_net-0.13.0> Running phase: buildPhase1256pg_net-0.13.0> gcc -Wall -Wmissing-prototypes -Wpointer-arith -Wdeclaration-after-statement -Werror=vla -Wendif-labels -Wmissing-format-attribute -Wimplicit-fallthrough=3 -Wcast-function-type -Wformat-security -fno-strict-aliasing -fwrapv -fexcess-precision=standard -Wno-deprecated-non-prototype -Wno-format-truncation -Wno-stringop-truncation -g -O2 -std=gnu17 -std=c11 -Werror -Wno-declaration-after-statement -fPIC  -DEXTVERSION=\"0.13.0\" -I. -I./ -I/nix/store/48l45fvi99n90x6p9i4cs1lmzby6cb73-postgresql-15.19/include/server -I/nix/store/48l45fvi99n90x6p9i4cs1lmzby6cb73-postgresql-15.19/include/internal -D_GNU_SOURCE  -I/nix/store/p17klc3qq4nl9ihfwqfpi8cnqvcf92xz-libxml2-2.15.1-dev/include/libxml2 -I/nix/store/mglbi4dy4kpx7v1dcgf6iincp5x38hsc-lz4-1.10.0-dev/include -I/nix/store/g41q9md9rdcr3lkydi6f8zd6fza3h1q4-zstd-1.5.7-dev/include -I/nix/store/n2vnr7ycfk6midbzxcwd28qj3bgb50cz-icu4c-75.1-dev/include  -c -o src/worker.o src/worker.c1257pg_net-0.13.0> gcc -Wall -Wmissing-prototypes -Wpointer-arith -Wdeclaration-after-statement -Werror=vla -Wendif-labels -Wmissing-format-attribute -Wimplicit-fallthrough=3 -Wcast-function-type -Wformat-security -fno-strict-aliasing -fwrapv -fexcess-precision=standard -Wno-deprecated-non-prototype -Wno-format-truncation -Wno-stringop-truncation -g -O2 -std=gnu17 -std=c11 -Werror -Wno-declaration-after-statement -fPIC  -DEXTVERSION=\"0.13.0\" -I. -I./ -I/nix/store/48l45fvi99n90x6p9i4cs1lmzby6cb73-postgresql-15.19/include/server -I/nix/store/48l45fvi99n90x6p9i4cs1lmzby6cb73-postgresql-15.19/include/internal -D_GNU_SOURCE  -I/nix/store/p17klc3qq4nl9ihfwqfpi8cnqvcf92xz-libxml2-2.15.1-dev/include/libxml2 -I/nix/store/mglbi4dy4kpx7v1dcgf6iincp5x38hsc-lz4-1.10.0-dev/include -I/nix/store/g41q9md9rdcr3lkydi6f8zd6fza3h1q4-zstd-1.5.7-dev/include -I/nix/store/n2vnr7ycfk6midbzxcwd28qj3bgb50cz-icu4c-75.1-dev/include  -c -o src/util.o src/util.c1258pg_net-0.13.0> gcc -Wall -Wmissing-prototypes -Wpointer-arith -Wdeclaration-after-statement -Werror=vla -Wendif-labels -Wmissing-format-attribute -Wimplicit-fallthrough=3 -Wcast-function-type -Wformat-security -fno-strict-aliasing -fwrapv -fexcess-precision=standard -Wno-deprecated-non-prototype -Wno-format-truncation -Wno-stringop-truncation -g -O2 -std=gnu17 -std=c11 -Werror -Wno-declaration-after-statement -fPIC  -DEXTVERSION=\"0.13.0\" -I. -I./ -I/nix/store/48l45fvi99n90x6p9i4cs1lmzby6cb73-postgresql-15.19/include/server -I/nix/store/48l45fvi99n90x6p9i4cs1lmzby6cb73-postgresql-15.19/include/internal -D_GNU_SOURCE  -I/nix/store/p17klc3qq4nl9ihfwqfpi8cnqvcf92xz-libxml2-2.15.1-dev/include/libxml2 -I/nix/store/mglbi4dy4kpx7v1dcgf6iincp5x38hsc-lz4-1.10.0-dev/include -I/nix/store/g41q9md9rdcr3lkydi6f8zd6fza3h1q4-zstd-1.5.7-dev/include -I/nix/store/n2vnr7ycfk6midbzxcwd28qj3bgb50cz-icu4c-75.1-dev/include  -c -o src/core.o src/core.c1259pg_net-0.13.0> In file included from src/core.c:23:1260pg_net-0.13.0> In function 'init_curl_handle',1261pg_net-0.13.0>     inlined from 'consume_request_queue' at src/core.c:273:5:1262pg_net-0.13.0> src/util.h:6:11: warning: call to 'Wcurl_easy_setopt_err_long' declared with attribute warning: curl_easy_setopt expects a long argument [-Wattribute-warning]1263pg_net-0.13.0>     6 |       if (curl_easy_setopt(hdl, opt, prm) != CURLE_OK) \1264pg_net-0.13.0>       |           ^~~~~~~~~~~~~~~~1265pg_net-0.13.0> src/core.c:94:7: note: in expansion of macro 'CURL_EZ_SETOPT'1266pg_net-0.13.0>    94 |       CURL_EZ_SETOPT(curl_ez_handle, CURLOPT_POST, 1);1267pg_net-0.13.0>       |       ^~~~~~~~~~~~~~1268pg_net-0.13.0> src/util.h:6:11: warning: call to 'Wcurl_easy_setopt_err_long' declared with attribute warning: curl_easy_setopt expects a long argument [-Wattribute-warning]1269pg_net-0.13.0>     6 |       if (curl_easy_setopt(hdl, opt, prm) != CURLE_OK) \1270pg_net-0.13.0>       |           ^~~~~~~~~~~~~~~~1271pg_net-0.13.0> src/core.c:95:7: note: in expansion of macro 'CURL_EZ_SETOPT'1272pg_net-0.13.0>    95 |       CURL_EZ_SETOPT(curl_ez_handle, CURLOPT_POSTFIELDSIZE, 0);1273pg_net-0.13.0>       |       ^~~~~~~~~~~~~~1274pg_net-0.13.0> src/util.h:6:11: warning: call to 'Wcurl_easy_setopt_err_long' declared with attribute warning: curl_easy_setopt expects a long argument [-Wattribute-warning]1275pg_net-0.13.0>     6 |       if (curl_easy_setopt(hdl, opt, prm) != CURLE_OK) \1276pg_net-0.13.0>       |           ^~~~~~~~~~~~~~~~1277pg_net-0.13.0> src/core.c:108:3: note: in expansion of macro 'CURL_EZ_SETOPT'1278pg_net-0.13.0>   108 |   CURL_EZ_SETOPT(curl_ez_handle, CURLOPT_TIMEOUT_MS, timeout_milliseconds);1279pg_net-0.13.0>       |   ^~~~~~~~~~~~~~1280pg_net-0.13.0> src/util.h:6:11: warning: call to 'Wcurl_easy_setopt_err_long' declared with attribute warning: curl_easy_setopt expects a long argument [-Wattribute-warning]1281pg_net-0.13.0>     6 |       if (curl_easy_setopt(hdl, opt, prm) != CURLE_OK) \1282pg_net-0.13.0>       |           ^~~~~~~~~~~~~~~~1283pg_net-0.13.0> src/core.c:110:3: note: in expansion of macro 'CURL_EZ_SETOPT'1284pg_net-0.13.0>   110 |   CURL_EZ_SETOPT(curl_ez_handle, CURLOPT_FOLLOWLOCATION, true);1285pg_net-0.13.0>       |   ^~~~~~~~~~~~~~1286pg_net-0.13.0> gcc -Wall -Wmissing-prototypes -Wpointer-arith -Wdeclaration-after-statement -Werror=vla -Wendif-labels -Wmissing-format-attribute -Wimplicit-fallthrough=3 -Wcast-function-type -Wformat-security -fno-strict-aliasing -fwrapv -fexcess-precision=standard -Wno-deprecated-non-prototype -Wno-format-truncation -Wno-stringop-truncation -g -O2 -std=gnu17 -std=c11 -Werror -Wno-declaration-after-statement -fPIC  -DEXTVERSION=\"0.13.0\" -I. -I./ -I/nix/store/48l45fvi99n90x6p9i4cs1lmzby6cb73-postgresql-15.19/include/server -I/nix/store/48l45fvi99n90x6p9i4cs1lmzby6cb73-postgresql-15.19/include/internal -D_GNU_SOURCE  -I/nix/store/p17klc3qq4nl9ihfwqfpi8cnqvcf92xz-libxml2-2.15.1-dev/include/libxml2 -I/nix/store/mglbi4dy4kpx7v1dcgf6iincp5x38hsc-lz4-1.10.0-dev/include -I/nix/store/g41q9md9rdcr3lkydi6f8zd6fza3h1q4-zstd-1.5.7-dev/include -I/nix/store/n2vnr7ycfk6midbzxcwd28qj3bgb50cz-icu4c-75.1-dev/include  -c -o src/event.o src/event.c1287pg_net-0.13.0> In file included from /nix/store/jviasb44hibgh09829gbmbssbz2jjnhz-curl-8.17.0-dev/include/curl/curl.h:3333,1288pg_net-0.13.0>                  from /nix/store/jviasb44hibgh09829gbmbssbz2jjnhz-curl-8.17.0-dev/include/curl/multi.h:51,1289pg_net-0.13.0>                  from src/event.h:4,1290pg_net-0.13.0>                  from src/event.c:6:1291pg_net-0.13.0> /nix/store/jviasb44hibgh09829gbmbssbz2jjnhz-curl-8.17.0-dev/include/curl/multi.h:429:23: error: expected identifier or '(' before '__extension__'1292pg_net-0.13.0>   429 | CURL_EXTERN CURLMcode curl_multi_setopt(CURLM *multi_handle,1293pg_net-0.13.0>       |                       ^~~~~~~~~~~~~~~~~1294pg_net-0.13.0> /nix/store/jviasb44hibgh09829gbmbssbz2jjnhz-curl-8.17.0-dev/include/curl/multi.h:429:23: error: expected identifier or '(' before ')' token1295pg_net-0.13.0>   429 | CURL_EXTERN CURLMcode curl_multi_setopt(CURLM *multi_handle,1296pg_net-0.13.0>       |                       ^~~~~~~~~~~~~~~~~1297pg_net-0.13.0> make: *** [<builtin>: src/event.o] Error 11298error: build of '/nix/store/0n0iaya9csx9by2pimrx1yglzw8dp4zs-pg_net-0.13.0.drv' on 'ssh-ng://nixbot-remote-build@78.232.36.247' failed: Cannot build '/nix/store/0n0iaya9csx9by2pimrx1yglzw8dp4zs-pg_net-0.13.0.drv'.1299       Reason: builder failed with exit code 2.1300       Output paths:1301         /nix/store/14dkr1mhbrh869r2k75r03ngw6q7c4ma-pg_net-0.13.01302       Last 25 log lines:1303       >       |       ^~~~~~~~~~~~~~1304       > src/util.h:6:11: warning: call to 'Wcurl_easy_setopt_err_long' declared with attribute warning: curl_easy_setopt expects a long argument [-Wattribute-warning]1305       >     6 |       if (curl_easy_setopt(hdl, opt, prm) != CURLE_OK) \1306       >       |           ^~~~~~~~~~~~~~~~1307       > src/core.c:108:3: note: in expansion of macro 'CURL_EZ_SETOPT'1308       >   108 |   CURL_EZ_SETOPT(curl_ez_handle, CURLOPT_TIMEOUT_MS, timeout_milliseconds);1309       >       |   ^~~~~~~~~~~~~~1310       > src/util.h:6:11: warning: call to 'Wcurl_easy_setopt_err_long' declared with attribute warning: curl_easy_setopt expects a long argument [-Wattribute-warning]1311       >     6 |       if (curl_easy_setopt(hdl, opt, prm) != CURLE_OK) \1312       >       |           ^~~~~~~~~~~~~~~~1313       > src/core.c:110:3: note: in expansion of macro 'CURL_EZ_SETOPT'1314       >   110 |   CURL_EZ_SETOPT(curl_ez_handle, CURLOPT_FOLLOWLOCATION, true);1315       >       |   ^~~~~~~~~~~~~~1316       > gcc -Wall -Wmissing-prototypes -Wpointer-arith -Wdeclaration-after-statement -Werror=vla -Wendif-labels -Wmissing-format-attribute -Wimplicit-fallthrough=3 -Wcast-function-type -Wformat-security -fno-strict-aliasing -fwrapv -fexcess-precision=standard -Wno-deprecated-non-prototype -Wno-format-truncation -Wno-stringop-truncation -g -O2 -std=gnu17 -std=c11 -Werror -Wno-declaration-after-statement -fPIC  -DEXTVERSION=\"0.13.0\" -I. -I./ -I/nix/store/48l45fvi99n90x6p9i4cs1lmzby6cb73-postgresql-15.19/include/server -I/nix/store/48l45fvi99n90x6p9i4cs1lmzby6cb73-postgresql-15.19/include/internal -D_GNU_SOURCE  -I/nix/store/p17klc3qq4nl9ihfwqfpi8cnqvcf92xz-libxml2-2.15.1-dev/include/libxml2 -I/nix/store/mglbi4dy4kpx7v1dcgf6iincp5x38hsc-lz4-1.10.0-dev/include -I/nix/store/g41q9md9rdcr3lkydi6f8zd6fza3h1q4-zstd-1.5.7-dev/include -I/nix/store/n2vnr7ycfk6midbzxcwd28qj3bgb50cz-icu4c-75.1-dev/include  -c -o src/event.o src/event.c1317       > In file included from /nix/store/jviasb44hibgh09829gbmbssbz2jjnhz-curl-8.17.0-dev/include/curl/curl.h:3333,1318       >                  from /nix/store/jviasb44hibgh09829gbmbssbz2jjnhz-curl-8.17.0-dev/include/curl/multi.h:51,1319       >                  from src/event.h:4,1320       >                  from src/event.c:6:1321       > /nix/store/jviasb44hibgh09829gbmbssbz2jjnhz-curl-8.17.0-dev/include/curl/multi.h:429:23: error: expected identifier or '(' before '__extension__'1322       >   429 | CURL_EXTERN CURLMcode curl_multi_setopt(CURLM *multi_handle,1323       >       |                       ^~~~~~~~~~~~~~~~~1324       > /nix/store/jviasb44hibgh09829gbmbssbz2jjnhz-curl-8.17.0-dev/include/curl/multi.h:429:23: error: expected identifier or '(' before ')' token1325       >   429 | CURL_EXTERN CURLMcode curl_multi_setopt(CURLM *multi_handle,1326       >       |                       ^~~~~~~~~~~~~~~~~1327       > make: *** [<builtin>: src/event.o] Error 11328       For full logs, run:1329         nix log /nix/store/0n0iaya9csx9by2pimrx1yglzw8dp4zs-pg_net-0.13.0.drv1330error: Cannot build '/nix/store/0n0iaya9csx9by2pimrx1yglzw8dp4zs-pg_net-0.13.0.drv'.1331       Reason: builder failed with exit code 1.1332       Output paths:1333         /nix/store/14dkr1mhbrh869r2k75r03ngw6q7c4ma-pg_net-0.13.01334pg_graphql-1.6.1>     Finished `dev` profile [unoptimized + debuginfo] target(s) in 2m 08s1335pg_graphql-1.6.1>      Writing SQL entities to /nix/store/s2s0vf5dji6nm5v4fzxgcj9jj7qh0s25-pg_graphql-1.6.1/nix/store/48l45fvi99n90x6p9i4cs1lmzby6cb73-postgresql-15.19/share/postgresql/extension/pg_graphql--1.6.1.sql1336pg_graphql-1.6.1>     Finished installing pg_graphql1337pg_graphql-1.6.1> buildPhase completed in 5 minutes 18 seconds1338pg_graphql-1.6.1> Running phase: checkPhase1339pg_graphql-1.6.1>    Validating /nix/store/48l45fvi99n90x6p9i4cs1lmzby6cb73-postgresql-15.19/bin/pg_config1340pg_graphql-1.6.1>  Initializing data directory at /build/tmp.YfWv0TsvWX/data-151341pg_graphql-1.6.1> waiting for server to start....2026-10-06 14:23:19.613 GMT [5238] LOG:  starting PostgreSQL 15.19 on aarch64-unknown-linux-gnu, compiled by gcc (GCC) 15.2.0, 64-bit1342pg_graphql-1.6.1> 2026-10-06 14:23:19.616 GMT [5238] LOG:  listening on Unix socket "/build/tmp.0Q7C2FQfMG/.s.PGSQL.5432"1343pg_graphql-1.6.1> 2026-10-06 14:23:19.624 GMT [5241] LOG:  database system was shut down at 2026-10-06 14:23:19 GMT1344pg_graphql-1.6.1> 2026-10-06 14:23:19.633 GMT [5238] LOG:  database system is ready to accept connections1345pg_graphql-1.6.1>  done1346pg_graphql-1.6.1> server started1347pg_graphql-1.6.1> createuser: error: connection to server at "localhost" (127.0.0.1), port 5432 failed: Connection refused1348pg_graphql-1.6.1> 	Is the server running on that host and accepting TCP/IP connections?1349pg_graphql-1.6.1> waiting for server to shut down....2026-10-06 14:23:19.695 GMT [5238] LOG:  received fast shutdown request1350pg_graphql-1.6.1> 2026-10-06 14:23:19.698 GMT [5238] LOG:  aborting any active transactions1351pg_graphql-1.6.1> 2026-10-06 14:23:19.700 GMT [5238] LOG:  background worker "logical replication launcher" (PID 5244) exited with exit code 11352pg_graphql-1.6.1> 2026-10-06 14:23:19.700 GMT [5239] LOG:  shutting down1353pg_graphql-1.6.1> 2026-10-06 14:23:19.702 GMT [5239] LOG:  checkpoint starting: shutdown immediate1354pg_graphql-1.6.1> 2026-10-06 14:23:19.717 GMT [5239] LOG:  checkpoint complete: wrote 3 buffers (0.0%); 0 WAL file(s) added, 0 removed, 0 recycled; write=0.004 s, sync=0.003 s, total=0.017 s; sync files=2, longest=0.002 s, average=0.002 s; distance=0 kB, estimate=0 kB1355pg_graphql-1.6.1> 2026-10-06 14:23:19.721 GMT [5238] LOG:  database system is shut down1356pg_graphql-1.6.1>  done1357pg_graphql-1.6.1> server stopped1358pg_graphql-1.6.1>    Validating /build/tmp.Bh6RUpv3Zp/15/bin/pg_config1359pg_graphql-1.6.1>  Initializing data directory at /build/tmp.Bh6RUpv3Zp/data-151360pg_graphql-1.6.1>        Using PgConfig("pg15") and `pg_config` from /build/tmp.Bh6RUpv3Zp/15/bin/pg_config1361pg_graphql-1.6.1>     Building extension with features pg151362pg_graphql-1.6.1>      Running command "/nix/store/8aa27y4zp6s8cv6f6chng7cv416ngp5c-cargo-1.88.0-aarch64-unknown-linux-gnu/bin/cargo" "build" "--lib" "--release" "--features" "pg15" "--no-default-features" "--message-format=json-render-diagnostics" "--frozen" "-j" "2"1363pg_graphql-1.6.1>     Finished `release` profile [optimized] target(s) in 0.14s1364pg_graphql-1.6.1>   Installing extension1365pg_graphql-1.6.1>      Copying control file to /build/tmp.Bh6RUpv3Zp/15/share/postgresql/extension/pg_graphql.control1366pg_graphql-1.6.1>      Copying shared library to /build/tmp.Bh6RUpv3Zp/15/lib/pg_graphql.so1367pg_graphql-1.6.1>   Discovered 5 SQL entities: 0 schemas (0 unique), 1 functions, 0 types, 0 enums, 4 sqls, 0 ords, 0 hashes, 0 aggregates, 0 triggers1368pg_graphql-1.6.1>   Rebuilding pgrx_embed, in debug mode, for SQL generation with features pg151369pg_graphql-1.6.1>    Compiling pg_graphql v1.6.1 (/build/source)1370building '/nix/store/g6nfp5n056kw2jvfzldzxrrrxfpfcka0-pg_net-0.13.0.drv' on 'ssh-ng://nixbot-remote-build@78.232.36.247'1371building '/nix/store/g6nfp5n056kw2jvfzldzxrrrxfpfcka0-pg_net-0.13.0.drv'1372pg_net-0.13.0> Running phase: unpackPhase1373pg_net-0.13.0> unpacking source archive /nix/store/bxdzbzjn4yi7ch55dlcgzk6npzx2p4jz-source1374pg_net-0.13.0> source root is source1375pg_net-0.13.0> Running phase: patchPhase1376pg_net-0.13.0> Running phase: updateAutotoolsGnuConfigScriptsPhase1377pg_net-0.13.0> Running phase: configurePhase1378pg_net-0.13.0> no configure script, doing nothing1379pg_net-0.13.0> Running phase: buildPhase1380pg_net-0.13.0> gcc -Wall -Wmissing-prototypes -Wpointer-arith -Wdeclaration-after-statement -Werror=vla -Wendif-labels -Wmissing-format-attribute -Wimplicit-fallthrough=3 -Wcast-function-type -Wshadow=compatible-local -Wformat-security -fno-strict-aliasing -fwrapv -fexcess-precision=standard -Wno-format-truncation -Wno-stringop-truncation -g -O2 -std=c11 -Werror -Wno-declaration-after-statement -fPIC -fvisibility=hidden  -DEXTVERSION=\"0.13.0\" -I. -I./ -I/nix/store/9q4p23a2y63xn8safzzn6lbn07bnkshs-postgresql-17.11/include/server -I/nix/store/9q4p23a2y63xn8safzzn6lbn07bnkshs-postgresql-17.11/include/internal -D_GNU_SOURCE  -I/nix/store/p17klc3qq4nl9ihfwqfpi8cnqvcf92xz-libxml2-2.15.1-dev/include/libxml2 -I/nix/store/mglbi4dy4kpx7v1dcgf6iincp5x38hsc-lz4-1.10.0-dev/include -I/nix/store/g41q9md9rdcr3lkydi6f8zd6fza3h1q4-zstd-1.5.7-dev/include -I/nix/store/n2vnr7ycfk6midbzxcwd28qj3bgb50cz-icu4c-75.1-dev/include  -c -o src/worker.o src/worker.c1381pg_net-0.13.0> gcc -Wall -Wmissing-prototypes -Wpointer-arith -Wdeclaration-after-statement -Werror=vla -Wendif-labels -Wmissing-format-attribute -Wimplicit-fallthrough=3 -Wcast-function-type -Wshadow=compatible-local -Wformat-security -fno-strict-aliasing -fwrapv -fexcess-precision=standard -Wno-format-truncation -Wno-stringop-truncation -g -O2 -std=c11 -Werror -Wno-declaration-after-statement -fPIC -fvisibility=hidden  -DEXTVERSION=\"0.13.0\" -I. -I./ -I/nix/store/9q4p23a2y63xn8safzzn6lbn07bnkshs-postgresql-17.11/include/server -I/nix/store/9q4p23a2y63xn8safzzn6lbn07bnkshs-postgresql-17.11/include/internal -D_GNU_SOURCE  -I/nix/store/p17klc3qq4nl9ihfwqfpi8cnqvcf92xz-libxml2-2.15.1-dev/include/libxml2 -I/nix/store/mglbi4dy4kpx7v1dcgf6iincp5x38hsc-lz4-1.10.0-dev/include -I/nix/store/g41q9md9rdcr3lkydi6f8zd6fza3h1q4-zstd-1.5.7-dev/include -I/nix/store/n2vnr7ycfk6midbzxcwd28qj3bgb50cz-icu4c-75.1-dev/include  -c -o src/util.o src/util.c1382pg_net-0.13.0> gcc -Wall -Wmissing-prototypes -Wpointer-arith -Wdeclaration-after-statement -Werror=vla -Wendif-labels -Wmissing-format-attribute -Wimplicit-fallthrough=3 -Wcast-function-type -Wshadow=compatible-local -Wformat-security -fno-strict-aliasing -fwrapv -fexcess-precision=standard -Wno-format-truncation -Wno-stringop-truncation -g -O2 -std=c11 -Werror -Wno-declaration-after-statement -fPIC -fvisibility=hidden  -DEXTVERSION=\"0.13.0\" -I. -I./ -I/nix/store/9q4p23a2y63xn8safzzn6lbn07bnkshs-postgresql-17.11/include/server -I/nix/store/9q4p23a2y63xn8safzzn6lbn07bnkshs-postgresql-17.11/include/internal -D_GNU_SOURCE  -I/nix/store/p17klc3qq4nl9ihfwqfpi8cnqvcf92xz-libxml2-2.15.1-dev/include/libxml2 -I/nix/store/mglbi4dy4kpx7v1dcgf6iincp5x38hsc-lz4-1.10.0-dev/include -I/nix/store/g41q9md9rdcr3lkydi6f8zd6fza3h1q4-zstd-1.5.7-dev/include -I/nix/store/n2vnr7ycfk6midbzxcwd28qj3bgb50cz-icu4c-75.1-dev/include  -c -o src/core.o src/core.c1383pg_net-0.13.0> In file included from src/core.c:23:1384pg_net-0.13.0> In function 'init_curl_handle',1385pg_net-0.13.0>     inlined from 'consume_request_queue' at src/core.c:273:5:1386pg_net-0.13.0> src/util.h:6:11: warning: call to 'Wcurl_easy_setopt_err_long' declared with attribute warning: curl_easy_setopt expects a long argument [-Wattribute-warning]1387pg_net-0.13.0>     6 |       if (curl_easy_setopt(hdl, opt, prm) != CURLE_OK) \1388pg_net-0.13.0>       |           ^~~~~~~~~~~~~~~~1389pg_net-0.13.0> src/core.c:94:7: note: in expansion of macro 'CURL_EZ_SETOPT'1390pg_net-0.13.0>    94 |       CURL_EZ_SETOPT(curl_ez_handle, CURLOPT_POST, 1);1391pg_net-0.13.0>       |       ^~~~~~~~~~~~~~1392pg_net-0.13.0> src/util.h:6:11: warning: call to 'Wcurl_easy_setopt_err_long' declared with attribute warning: curl_easy_setopt expects a long argument [-Wattribute-warning]1393pg_net-0.13.0>     6 |       if (curl_easy_setopt(hdl, opt, prm) != CURLE_OK) \1394pg_net-0.13.0>       |           ^~~~~~~~~~~~~~~~1395pg_net-0.13.0> src/core.c:95:7: note: in expansion of macro 'CURL_EZ_SETOPT'1396pg_net-0.13.0>    95 |       CURL_EZ_SETOPT(curl_ez_handle, CURLOPT_POSTFIELDSIZE, 0);1397pg_net-0.13.0>       |       ^~~~~~~~~~~~~~1398pg_net-0.13.0> src/util.h:6:11: warning: call to 'Wcurl_easy_setopt_err_long' declared with attribute warning: curl_easy_setopt expects a long argument [-Wattribute-warning]1399pg_net-0.13.0>     6 |       if (curl_easy_setopt(hdl, opt, prm) != CURLE_OK) \1400pg_net-0.13.0>       |           ^~~~~~~~~~~~~~~~1401pg_net-0.13.0> src/core.c:108:3: note: in expansion of macro 'CURL_EZ_SETOPT'1402pg_net-0.13.0>   108 |   CURL_EZ_SETOPT(curl_ez_handle, CURLOPT_TIMEOUT_MS, timeout_milliseconds);1403pg_net-0.13.0>       |   ^~~~~~~~~~~~~~1404pg_net-0.13.0> src/util.h:6:11: warning: call to 'Wcurl_easy_setopt_err_long' declared with attribute warning: curl_easy_setopt expects a long argument [-Wattribute-warning]1405pg_net-0.13.0>     6 |       if (curl_easy_setopt(hdl, opt, prm) != CURLE_OK) \1406pg_net-0.13.0>       |           ^~~~~~~~~~~~~~~~1407pg_net-0.13.0> src/core.c:110:3: note: in expansion of macro 'CURL_EZ_SETOPT'1408pg_net-0.13.0>   110 |   CURL_EZ_SETOPT(curl_ez_handle, CURLOPT_FOLLOWLOCATION, true);1409pg_net-0.13.0>       |   ^~~~~~~~~~~~~~1410pg_net-0.13.0> gcc -Wall -Wmissing-prototypes -Wpointer-arith -Wdeclaration-after-statement -Werror=vla -Wendif-labels -Wmissing-format-attribute -Wimplicit-fallthrough=3 -Wcast-function-type -Wshadow=compatible-local -Wformat-security -fno-strict-aliasing -fwrapv -fexcess-precision=standard -Wno-format-truncation -Wno-stringop-truncation -g -O2 -std=c11 -Werror -Wno-declaration-after-statement -fPIC -fvisibility=hidden  -DEXTVERSION=\"0.13.0\" -I. -I./ -I/nix/store/9q4p23a2y63xn8safzzn6lbn07bnkshs-postgresql-17.11/include/server -I/nix/store/9q4p23a2y63xn8safzzn6lbn07bnkshs-postgresql-17.11/include/internal -D_GNU_SOURCE  -I/nix/store/p17klc3qq4nl9ihfwqfpi8cnqvcf92xz-libxml2-2.15.1-dev/include/libxml2 -I/nix/store/mglbi4dy4kpx7v1dcgf6iincp5x38hsc-lz4-1.10.0-dev/include -I/nix/store/g41q9md9rdcr3lkydi6f8zd6fza3h1q4-zstd-1.5.7-dev/include -I/nix/store/n2vnr7ycfk6midbzxcwd28qj3bgb50cz-icu4c-75.1-dev/include  -c -o src/event.o src/event.c1411pg_net-0.13.0> In file included from /nix/store/jviasb44hibgh09829gbmbssbz2jjnhz-curl-8.17.0-dev/include/curl/curl.h:3333,1412pg_net-0.13.0>                  from /nix/store/jviasb44hibgh09829gbmbssbz2jjnhz-curl-8.17.0-dev/include/curl/multi.h:51,1413pg_net-0.13.0>                  from src/event.h:4,1414pg_net-0.13.0>                  from src/event.c:6:1415pg_net-0.13.0> /nix/store/jviasb44hibgh09829gbmbssbz2jjnhz-curl-8.17.0-dev/include/curl/multi.h:429:23: error: expected identifier or '(' before '__extension__'1416pg_net-0.13.0>   429 | CURL_EXTERN CURLMcode curl_multi_setopt(CURLM *multi_handle,1417pg_net-0.13.0>       |                       ^~~~~~~~~~~~~~~~~1418pg_net-0.13.0> /nix/store/jviasb44hibgh09829gbmbssbz2jjnhz-curl-8.17.0-dev/include/curl/multi.h:429:23: error: expected identifier or '(' before ')' token1419pg_net-0.13.0>   429 | CURL_EXTERN CURLMcode curl_multi_setopt(CURLM *multi_handle,1420pg_net-0.13.0>       |                       ^~~~~~~~~~~~~~~~~1421pg_net-0.13.0> make: *** [<builtin>: src/event.o] Error 11422error: build of '/nix/store/g6nfp5n056kw2jvfzldzxrrrxfpfcka0-pg_net-0.13.0.drv' on 'ssh-ng://nixbot-remote-build@78.232.36.247' failed: Cannot build '/nix/store/g6nfp5n056kw2jvfzldzxrrrxfpfcka0-pg_net-0.13.0.drv'.1423       Reason: builder failed with exit code 2.1424       Output paths:1425         /nix/store/0z6qc5i8vhckm5s9j7br24f5kfxsgds5-pg_net-0.13.01426       Last 25 log lines:1427       >       |       ^~~~~~~~~~~~~~1428       > src/util.h:6:11: warning: call to 'Wcurl_easy_setopt_err_long' declared with attribute warning: curl_easy_setopt expects a long argument [-Wattribute-warning]1429       >     6 |       if (curl_easy_setopt(hdl, opt, prm) != CURLE_OK) \1430       >       |           ^~~~~~~~~~~~~~~~1431       > src/core.c:108:3: note: in expansion of macro 'CURL_EZ_SETOPT'1432       >   108 |   CURL_EZ_SETOPT(curl_ez_handle, CURLOPT_TIMEOUT_MS, timeout_milliseconds);1433       >       |   ^~~~~~~~~~~~~~1434       > src/util.h:6:11: warning: call to 'Wcurl_easy_setopt_err_long' declared with attribute warning: curl_easy_setopt expects a long argument [-Wattribute-warning]1435       >     6 |       if (curl_easy_setopt(hdl, opt, prm) != CURLE_OK) \1436       >       |           ^~~~~~~~~~~~~~~~1437       > src/core.c:110:3: note: in expansion of macro 'CURL_EZ_SETOPT'1438       >   110 |   CURL_EZ_SETOPT(curl_ez_handle, CURLOPT_FOLLOWLOCATION, true);1439       >       |   ^~~~~~~~~~~~~~1440       > gcc -Wall -Wmissing-prototypes -Wpointer-arith -Wdeclaration-after-statement -Werror=vla -Wendif-labels -Wmissing-format-attribute -Wimplicit-fallthrough=3 -Wcast-function-type -Wshadow=compatible-local -Wformat-security -fno-strict-aliasing -fwrapv -fexcess-precision=standard -Wno-format-truncation -Wno-stringop-truncation -g -O2 -std=c11 -Werror -Wno-declaration-after-statement -fPIC -fvisibility=hidden  -DEXTVERSION=\"0.13.0\" -I. -I./ -I/nix/store/9q4p23a2y63xn8safzzn6lbn07bnkshs-postgresql-17.11/include/server -I/nix/store/9q4p23a2y63xn8safzzn6lbn07bnkshs-postgresql-17.11/include/internal -D_GNU_SOURCE  -I/nix/store/p17klc3qq4nl9ihfwqfpi8cnqvcf92xz-libxml2-2.15.1-dev/include/libxml2 -I/nix/store/mglbi4dy4kpx7v1dcgf6iincp5x38hsc-lz4-1.10.0-dev/include -I/nix/store/g41q9md9rdcr3lkydi6f8zd6fza3h1q4-zstd-1.5.7-dev/include -I/nix/store/n2vnr7ycfk6midbzxcwd28qj3bgb50cz-icu4c-75.1-dev/include  -c -o src/event.o src/event.c1441       > In file included from /nix/store/jviasb44hibgh09829gbmbssbz2jjnhz-curl-8.17.0-dev/include/curl/curl.h:3333,1442       >                  from /nix/store/jviasb44hibgh09829gbmbssbz2jjnhz-curl-8.17.0-dev/include/curl/multi.h:51,1443       >                  from src/event.h:4,1444       >                  from src/event.c:6:1445       > /nix/store/jviasb44hibgh09829gbmbssbz2jjnhz-curl-8.17.0-dev/include/curl/multi.h:429:23: error: expected identifier or '(' before '__extension__'1446       >   429 | CURL_EXTERN CURLMcode curl_multi_setopt(CURLM *multi_handle,1447       >       |                       ^~~~~~~~~~~~~~~~~1448       > /nix/store/jviasb44hibgh09829gbmbssbz2jjnhz-curl-8.17.0-dev/include/curl/multi.h:429:23: error: expected identifier or '(' before ')' token1449       >   429 | CURL_EXTERN CURLMcode curl_multi_setopt(CURLM *multi_handle,1450       >       |                       ^~~~~~~~~~~~~~~~~1451       > make: *** [<builtin>: src/event.o] Error 11452       For full logs, run:1453         nix log /nix/store/g6nfp5n056kw2jvfzldzxrrrxfpfcka0-pg_net-0.13.0.drv1454error: Cannot build '/nix/store/g6nfp5n056kw2jvfzldzxrrrxfpfcka0-pg_net-0.13.0.drv'.1455       Reason: builder failed with exit code 1.1456       Output paths:1457         /nix/store/0z6qc5i8vhckm5s9j7br24f5kfxsgds5-pg_net-0.13.01458pg_graphql-1.6.1>     Finished `dev` profile [unoptimized + debuginfo] target(s) in 15.27s1459pg_graphql-1.6.1>      Writing SQL entities to /build/tmp.Bh6RUpv3Zp/15/share/postgresql/extension/pg_graphql--1.6.1.sql1460pg_graphql-1.6.1>     Finished installing pg_graphql1461pg_graphql-1.6.1> ++ mktemp -d1462pg_graphql-1.6.1> + TMPDIR=/build/tmp.O4zQpDyoki1463pg_graphql-1.6.1> + export PGDATA=/build/tmp.O4zQpDyoki1464pg_graphql-1.6.1> + PGDATA=/build/tmp.O4zQpDyoki1465pg_graphql-1.6.1> + export PGHOST=/build/tmp.O4zQpDyoki1466pg_graphql-1.6.1> + PGHOST=/build/tmp.O4zQpDyoki1467pg_graphql-1.6.1> + export PGUSER=postgres1468pg_graphql-1.6.1> + PGUSER=postgres1469pg_graphql-1.6.1> + export PGDATABASE=postgres1470pg_graphql-1.6.1> + PGDATABASE=postgres1471pg_graphql-1.6.1> + export PGTZ=UTC1472pg_graphql-1.6.1> + PGTZ=UTC1473pg_graphql-1.6.1> + export PG_COLOR=auto1474pg_graphql-1.6.1> + PG_COLOR=auto1475pg_graphql-1.6.1> + trap 'pg_ctl stop -m i' sigint sigterm exit1476pg_graphql-1.6.1> + rm -rf /build/tmp.O4zQpDyoki1477pg_graphql-1.6.1> + initdb --no-locale --encoding=UTF8 --nosync -U postgres1478pg_graphql-1.6.1> The files belonging to this database system will be owned by user "nixbld".1479pg_graphql-1.6.1> This user must also own the server process.1480pg_graphql-1.6.1> 1481pg_graphql-1.6.1> The database cluster will be initialized with locale "C".1482pg_graphql-1.6.1> The default text search configuration will be set to "english".1483pg_graphql-1.6.1> 1484pg_graphql-1.6.1> Data page checksums are disabled.1485pg_graphql-1.6.1> 1486pg_graphql-1.6.1> creating directory /build/tmp.O4zQpDyoki ... ok1487pg_graphql-1.6.1> creating subdirectories ... ok1488pg_graphql-1.6.1> selecting dynamic shared memory implementation ... posix1489pg_graphql-1.6.1> selecting default max_connections ... 1001490pg_graphql-1.6.1> selecting default shared_buffers ... 128MB1491pg_graphql-1.6.1> selecting default time zone ... UTC1492pg_graphql-1.6.1> creating configuration files ... ok1493pg_graphql-1.6.1> running bootstrap script ... ok1494pg_graphql-1.6.1> performing post-bootstrap initialization ... ok1495pg_graphql-1.6.1> 1496pg_graphql-1.6.1> Sync to disk skipped.1497pg_graphql-1.6.1> The data directory might become corrupt if the operating system crashes.1498pg_graphql-1.6.1> 1499pg_graphql-1.6.1> initdb: warning: enabling "trust" authentication for local connections1500pg_graphql-1.6.1> initdb: hint: You can change this by editing pg_hba.conf or using the option -A, or --auth-local and --auth-host, the next time you run initdb.1501pg_graphql-1.6.1> 1502pg_graphql-1.6.1> Success. You can now start the database server using:1503pg_graphql-1.6.1> 1504pg_graphql-1.6.1>     /build/tmp.Bh6RUpv3Zp/15/bin/pg_ctl -D /build/tmp.O4zQpDyoki -l logfile start1505pg_graphql-1.6.1> 1506pg_graphql-1.6.1> + pg_ctl start -o '-F -c listen_addresses="" -c log_min_messages=WARNING -k /build/tmp.O4zQpDyoki'1507pg_graphql-1.6.1> waiting for server to start....2026-10-06 14:23:37.251 UTC [5512] LOG:  starting PostgreSQL 15.19 on aarch64-unknown-linux-gnu, compiled by gcc (GCC) 15.2.0, 64-bit1508pg_graphql-1.6.1> 2026-10-06 14:23:37.252 UTC [5512] LOG:  listening on Unix socket "/build/tmp.O4zQpDyoki/.s.PGSQL.5432"1509pg_graphql-1.6.1> 2026-10-06 14:23:37.254 UTC [5515] LOG:  database system was shut down at 2026-10-06 14:23:37 UTC1510pg_graphql-1.6.1> 2026-10-06 14:23:37.257 UTC [5512] LOG:  database system is ready to accept connections1511pg_graphql-1.6.1>  done1512pg_graphql-1.6.1> server started1513pg_graphql-1.6.1> + createdb contrib_regression1514pg_graphql-1.6.1> + TESTDIR=test1515pg_graphql-1.6.1> +++ pg_config --pgxs1516pg_graphql-1.6.1> ++ dirname /nix/store/48l45fvi99n90x6p9i4cs1lmzby6cb73-postgresql-15.19/lib/pgxs/src/makefiles/pgxs.mk1517pg_graphql-1.6.1> + PGXS=/nix/store/48l45fvi99n90x6p9i4cs1lmzby6cb73-postgresql-15.19/lib/pgxs/src/makefiles1518pg_graphql-1.6.1> + REGRESS=/nix/store/48l45fvi99n90x6p9i4cs1lmzby6cb73-postgresql-15.19/lib/pgxs/src/makefiles/../test/regress/pg_regress1519pg_graphql-1.6.1> + '[' 0 -ne 0 ']'1520pg_graphql-1.6.1> ++ ls test/sql1521pg_graphql-1.6.1> ++ sed -e 's/\..*$//'1522pg_graphql-1.6.1> ++ sort1523pg_graphql-1.6.1> + TESTS=$'aggregate\naggregate_directive\naliases\nallow_camel_names\narray_args_and_return_types\nbigint_is_string\nbuiltin_directives\ncomment_directive\ncomment_directive_description\ncompound_filters\nempty_mutations\nenum_mappings\nextend_type_with_function\nextend_type_with_function_relation\nextend_type_with_generated_column\nfilter_by_node_id\nfragment_on_mutation\nfragment_on_query\nfunction_calls\nfunction_calls_default_args\nfunction_calls_unsupported\nfunction_return_row_is_selectable\nfunction_return_view_has_pkey\ninflection_fields\ninflection_function\ninflection_relationships\ninflection_types\nintrospection\nissue_163\nissue_170\nissue_225\nissue_237_field_merging\nissue_237_field_merging_mismatched\nissue_300\nissue_306\nissue_312\nissue_334_ambiguous_function\nissue_337\nissue_339_function_return_json\nissue_339_function_return_table\nissue_353_too_many_fields\nissue_370_citext_as_string\nissue_373\nissue_377_enum_search_path\nissue_409_fkey_rls_nullability\nissue_444\nissue_463\nissue_511\nissue_533\nissue_542_partial_unique\nissue_551_too_many_fields\nissue_557_1_to_1_nullability\nissue_581_missing_desc_on_schema\nissue_fragment_spread_cycles\njson_is_stringified\nmax_page_size\nmax_rows_directive\nmulti_column_primary_key\nmultiple_mutations\nmultiple_queries\nmutation_delete\nmutation_delete_variable\nmutation_insert\nmutation_update\nnull_argument\nomit_exotic_types\nomit_weird_names\noperation_name\noverride_enum_name\noverride_field_name\noverride_func_field_name\noverride_relationship_field_name\noverride_type_name\npage_info\npermissions_connection_column\npermissions_functions\npermissions_node_column\npermissions_table_level\npermissions_types\nprimary_key_is_required\nprimary_key_queries\nrelationship_one_to_one\nresolve___schema\nresolve___type\nresolve___typename\nresolve_array_type\nresolve_connection_filter\nresolve_connection_named\nresolve_connection_order_by\nresolve_connection_pagination_args\nresolve_connection_to_conn\nresolve_connection_to_node\nresolve_error_connection_edge_no_field\nresolve_error_connection_edge_node_no_field\nresolve_error_connection_no_field\nresolve_error_from_parser\nresolve_error_mutation_no_field\nresolve_error_node_no_field\nresolve_error_query_no_field\nresolve_fragment\nresolve_graphiql_schema\nresolve_one\nroundtrip_types\nrow_level_security\nsqli_connection\nstring_filters\ntest_error_anon_and_named_operations\ntest_error_invalid_offset\ntest_error_multiple_anon_operations\ntest_error_mutation_transpilation\ntest_error_operation_name_not_found\ntest_error_operation_names_not_unique\ntest_error_query_transpilation\ntest_error_subscription\ntest_query__type\ntotal_count\ntype_bigfloat\ntype_modifier_max_length\ntype_opaque\nvariable_default\nviews_integration'1524pg_graphql-1.6.1> + psql -v ON_ERROR_STOP=1 -f test/fixtures.sql -d contrib_regression1525pg_graphql-1.6.1> psql:test/fixtures.sql:1: NOTICE:  extension "pg_graphql" does not exist, skipping1526pg_graphql-1.6.1> DROP EXTENSION1527pg_graphql-1.6.1> CREATE EXTENSION1528pg_graphql-1.6.1> COMMENT1529pg_graphql-1.6.1> CREATE FUNCTION1530pg_graphql-1.6.1> + /nix/store/48l45fvi99n90x6p9i4cs1lmzby6cb73-postgresql-15.19/lib/pgxs/src/makefiles/../test/regress/pg_regress --use-existing --dbname=contrib_regression --inputdir=test aggregate aggregate_directive aliases allow_camel_names array_args_and_return_types bigint_is_string builtin_directives comment_directive comment_directive_description compound_filters empty_mutations enum_mappings extend_type_with_function extend_type_with_function_relation extend_type_with_generated_column filter_by_node_id fragment_on_mutation fragment_on_query function_calls function_calls_default_args function_calls_unsupported function_return_row_is_selectable function_return_view_has_pkey inflection_fields inflection_function inflection_relationships inflection_types introspection issue_163 issue_170 issue_225 issue_237_field_merging issue_237_field_merging_mismatched issue_300 issue_306 issue_312 issue_334_ambiguous_function issue_337 issue_339_function_return_json issue_339_function_return_table issue_353_too_many_fields issue_370_citext_as_string issue_373 issue_377_enum_search_path issue_409_fkey_rls_nullability issue_444 issue_463 issue_511 issue_533 issue_542_partial_unique issue_551_too_many_fields issue_557_1_to_1_nullability issue_581_missing_desc_on_schema issue_fragment_spread_cycles json_is_stringified max_page_size max_rows_directive multi_column_primary_key multiple_mutations multiple_queries mutation_delete mutation_delete_variable mutation_insert mutation_update null_argument omit_exotic_types omit_weird_names operation_name override_enum_name override_field_name override_func_field_name override_relationship_field_name override_type_name page_info permissions_connection_column permissions_functions permissions_node_column permissions_table_level permissions_types primary_key_is_required primary_key_queries relationship_one_to_one resolve___schema resolve___type resolve___typename resolve_array_type resolve_connection_filter resolve_connection_named resolve_connection_order_by resolve_connection_pagination_args resolve_connection_to_conn resolve_connection_to_node resolve_error_connection_edge_no_field resolve_error_connection_edge_node_no_field resolve_error_connection_no_field resolve_error_from_parser resolve_error_mutation_no_field resolve_error_node_no_field resolve_error_query_no_field resolve_fragment resolve_graphiql_schema resolve_one roundtrip_types row_level_security sqli_connection string_filters test_error_anon_and_named_operations test_error_invalid_offset test_error_multiple_anon_operations test_error_mutation_transpilation test_error_operation_name_not_found test_error_operation_names_not_unique test_error_query_transpilation test_error_subscription test_query__type total_count type_bigfloat type_modifier_max_length type_opaque variable_default views_integration1531pg_graphql-1.6.1> (using postmaster on /build/tmp.O4zQpDyoki, default port)1532pg_graphql-1.6.1> ============== running regression test queries        ==============1533pg_graphql-1.6.1> test aggregate                    ... ok           98 ms1534pg_graphql-1.6.1> test aggregate_directive          ... ok           76 ms1535pg_graphql-1.6.1> test aliases                      ... ok           94 ms1536pg_graphql-1.6.1> test allow_camel_names            ... ok           61 ms1537pg_graphql-1.6.1> test array_args_and_return_types  ... ok         1529 ms1538pg_graphql-1.6.1> test bigint_is_string             ... ok           55 ms1539pg_graphql-1.6.1> test builtin_directives           ... ok           62 ms1540pg_graphql-1.6.1> test comment_directive            ... ok           10 ms1541pg_graphql-1.6.1> test comment_directive_description ... ok           50 ms1542pg_graphql-1.6.1> test compound_filters             ... ok          256 ms1543pg_graphql-1.6.1> test empty_mutations              ... ok           49 ms1544pg_graphql-1.6.1> test enum_mappings                ... ok           57 ms1545pg_graphql-1.6.1> test extend_type_with_function    ... ok           52 ms1546pg_graphql-1.6.1> test extend_type_with_function_relation ... ok          140 ms1547pg_graphql-1.6.1> test extend_type_with_generated_column ... ok           50 ms1548pg_graphql-1.6.1> test filter_by_node_id            ... ok           55 ms1549pg_graphql-1.6.1> test fragment_on_mutation         ... ok           51 ms1550pg_graphql-1.6.1> test fragment_on_query            ... ok           49 ms1551pg_graphql-1.6.1> test function_calls               ... ok         1337 ms1552pg_graphql-1.6.1> test function_calls_default_args  ... ok          100 ms1553pg_graphql-1.6.1> test function_calls_unsupported   ... ok          298 ms1554pg_graphql-1.6.1> test function_return_row_is_selectable ... ok           81 ms1555pg_graphql-1.6.1> test function_return_view_has_pkey ... ok           78 ms1556pg_graphql-1.6.1> test inflection_fields            ... ok          132 ms1557pg_graphql-1.6.1> test inflection_function          ... ok          133 ms1558pg_graphql-1.6.1> test inflection_relationships     ... ok          188 ms1559pg_graphql-1.6.1> test inflection_types             ... ok          130 ms1560pg_graphql-1.6.1> test introspection                ... ok          257 ms1561pg_graphql-1.6.1> test issue_163                    ... ok           50 ms1562pg_graphql-1.6.1> test issue_170                    ... ok           52 ms1563pg_graphql-1.6.1> test issue_225                    ... ok           55 ms1564pg_graphql-1.6.1> test issue_237_field_merging      ... ok           96 ms1565pg_graphql-1.6.1> test issue_237_field_merging_mismatched ... ok           86 ms1566pg_graphql-1.6.1> test issue_300                    ... ok           55 ms1567pg_graphql-1.6.1> test issue_306                    ... ok           60 ms1568pg_graphql-1.6.1> test issue_312                    ... ok           52 ms1569pg_graphql-1.6.1> test issue_334_ambiguous_function ... ok           56 ms1570pg_graphql-1.6.1> test issue_337                    ... ok           88 ms1571pg_graphql-1.6.1> test issue_339_function_return_json ... ok           57 ms1572pg_graphql-1.6.1> test issue_339_function_return_table ... ok           50 ms1573pg_graphql-1.6.1> test issue_353_too_many_fields    ... ok           62 ms1574pg_graphql-1.6.1> test issue_370_citext_as_string   ... ok           69 ms1575pg_graphql-1.6.1> test issue_373                    ... ok           54 ms1576pg_graphql-1.6.1> test issue_377_enum_search_path   ... ok           82 ms1577pg_graphql-1.6.1> test issue_409_fkey_rls_nullability ... ok          107 ms1578pg_graphql-1.6.1> test issue_444                    ... ok           45 ms1579pg_graphql-1.6.1> test issue_463                    ... ok           51 ms1580pg_graphql-1.6.1> test issue_511                    ... ok           61 ms1581pg_graphql-1.6.1> test issue_533                    ... ok          103 ms1582pg_graphql-1.6.1> test issue_542_partial_unique     ... ok           80 ms1583pg_graphql-1.6.1> test issue_551_too_many_fields    ... ok           73 ms1584pg_graphql-1.6.1> test issue_557_1_to_1_nullability ... ok           58 ms1585pg_graphql-1.6.1> test issue_581_missing_desc_on_schema ... ok           53 ms1586pg_graphql-1.6.1> test issue_fragment_spread_cycles ... ok          215 ms1587pg_graphql-1.6.1> test json_is_stringified          ... ok           56 ms1588pg_graphql-1.6.1> test max_page_size                ... ok           51 ms1589pg_graphql-1.6.1> test max_rows_directive           ... ok          209 ms1590pg_graphql-1.6.1> test multi_column_primary_key     ... ok           63 ms1591pg_graphql-1.6.1> test multiple_mutations           ... ok           54 ms1592pg_graphql-1.6.1> test multiple_queries             ... ok           51 ms1593pg_graphql-1.6.1> test mutation_delete              ... ok           63 ms1594pg_graphql-1.6.1> test mutation_delete_variable     ... ok           52 ms1595pg_graphql-1.6.1> test mutation_insert              ... ok           62 ms1596pg_graphql-1.6.1> test mutation_update              ... ok           65 ms1597pg_graphql-1.6.1> test null_argument                ... ok           50 ms1598pg_graphql-1.6.1> test omit_exotic_types            ... ok           51 ms1599pg_graphql-1.6.1> test omit_weird_names             ... ok           78 ms1600pg_graphql-1.6.1> test operation_name               ... ok           52 ms1601pg_graphql-1.6.1> test override_enum_name           ... ok           46 ms1602pg_graphql-1.6.1> test override_field_name          ... ok           49 ms1603pg_graphql-1.6.1> test override_func_field_name     ... ok           53 ms1604pg_graphql-1.6.1> test override_relationship_field_name ... ok           53 ms1605pg_graphql-1.6.1> test override_type_name           ... ok           53 ms1606pg_graphql-1.6.1> test page_info                    ... ok           72 ms1607pg_graphql-1.6.1> test permissions_connection_column ... ok           84 ms1608pg_graphql-1.6.1> test permissions_functions        ... ok           75 ms1609pg_graphql-1.6.1> test permissions_node_column      ... ok           85 ms1610pg_graphql-1.6.1> test permissions_table_level      ... ok          164 ms1611pg_graphql-1.6.1> test permissions_types            ... ok           98 ms1612pg_graphql-1.6.1> test primary_key_is_required      ... ok           76 ms1613pg_graphql-1.6.1> test primary_key_queries          ... ok          274 ms1614pg_graphql-1.6.1> test relationship_one_to_one      ... ok           57 ms1615pg_graphql-1.6.1> test resolve___schema             ... ok           61 ms1616pg_graphql-1.6.1> test resolve___type               ... ok           51 ms1617pg_graphql-1.6.1> test resolve___typename           ... ok          114 ms1618pg_graphql-1.6.1> test resolve_array_type           ... ok           54 ms1619pg_graphql-1.6.1> test resolve_connection_filter    ... ok          115 ms1620pg_graphql-1.6.1> test resolve_connection_named     ... ok           50 ms1621pg_graphql-1.6.1> test resolve_connection_order_by  ... ok           83 ms1622pg_graphql-1.6.1> test resolve_connection_pagination_args ... ok          102 ms1623pg_graphql-1.6.1> test resolve_connection_to_conn   ... ok           57 ms1624pg_graphql-1.6.1> test resolve_connection_to_node   ... ok           56 ms1625pg_graphql-1.6.1> test resolve_error_connection_edge_no_field ... ok           48 ms1626pg_graphql-1.6.1> test resolve_error_connection_edge_node_no_field ... ok           48 ms1627pg_graphql-1.6.1> test resolve_error_connection_no_field ... ok           48 ms1628pg_graphql-1.6.1> test resolve_error_from_parser    ... ok           12 ms1629pg_graphql-1.6.1> test resolve_error_mutation_no_field ... ok           45 ms1630pg_graphql-1.6.1> test resolve_error_node_no_field  ... ok           49 ms1631pg_graphql-1.6.1> test resolve_error_query_no_field ... ok           44 ms1632pg_graphql-1.6.1> test resolve_fragment             ... ok           51 ms1633pg_graphql-1.6.1> test resolve_graphiql_schema      ... ok          114 ms1634pg_graphql-1.6.1> test resolve_one                  ... ok           93 ms1635pg_graphql-1.6.1> test roundtrip_types              ... ok           65 ms1636pg_graphql-1.6.1> test row_level_security           ... ok           53 ms1637pg_graphql-1.6.1> test sqli_connection              ... ok           62 ms1638pg_graphql-1.6.1> test string_filters               ... ok           62 ms1639pg_graphql-1.6.1> test test_error_anon_and_named_operations ... ok           44 ms1640pg_graphql-1.6.1> test test_error_invalid_offset    ... ok           77 ms1641pg_graphql-1.6.1> test test_error_multiple_anon_operations ... ok          104 ms1642pg_graphql-1.6.1> test test_error_mutation_transpilation ... ok           52 ms1643pg_graphql-1.6.1> test test_error_operation_name_not_found ... ok           44 ms1644pg_graphql-1.6.1> test test_error_operation_names_not_unique ... ok           44 ms1645pg_graphql-1.6.1> test test_error_query_transpilation ... ok           52 ms1646pg_graphql-1.6.1> test test_error_subscription      ... ok           44 ms1647pg_graphql-1.6.1> test test_query__type             ... ok           44 ms1648pg_graphql-1.6.1> test total_count                  ... ok           78 ms1649pg_graphql-1.6.1> test type_bigfloat                ... ok           53 ms1650pg_graphql-1.6.1> test type_modifier_max_length     ... ok           54 ms1651pg_graphql-1.6.1> test type_opaque                  ... ok           56 ms1652pg_graphql-1.6.1> test variable_default             ... ok           54 ms1653pg_graphql-1.6.1> test views_integration            ... ok          178 ms1654pg_graphql-1.6.1> 1655pg_graphql-1.6.1> =======================1656pg_graphql-1.6.1>  All 121 tests passed. 1657pg_graphql-1.6.1> =======================1658pg_graphql-1.6.1> 1659pg_graphql-1.6.1> + pg_ctl stop -m i1660pg_graphql-1.6.1> waiting for server to shut down....2026-10-06 14:23:49.748 UTC [5512] LOG:  received immediate shutdown request1661pg_graphql-1.6.1> 2026-10-06 14:23:49.756 UTC [5512] LOG:  database system is shut down1662pg_graphql-1.6.1>  done1663pg_graphql-1.6.1> server stopped1664pg_graphql-1.6.1> checkPhase completed in 31 seconds1665pg_graphql-1.6.1> Running phase: installPhase1666pg_graphql-1.6.1> Executing buildPgrxExtension install1667pg_graphql-1.6.1> Running phase: fixupPhase1668pg_graphql-1.6.1> shrinking RPATHs of ELF executables and libraries in /nix/store/s2s0vf5dji6nm5v4fzxgcj9jj7qh0s25-pg_graphql-1.6.11669pg_graphql-1.6.1> shrinking /nix/store/s2s0vf5dji6nm5v4fzxgcj9jj7qh0s25-pg_graphql-1.6.1/lib/pg_graphql-1.6.1.so1670pg_graphql-1.6.1> checking for references to /build/ in /nix/store/s2s0vf5dji6nm5v4fzxgcj9jj7qh0s25-pg_graphql-1.6.1...1671pg_graphql-1.6.1> patching script interpreter paths in /nix/store/s2s0vf5dji6nm5v4fzxgcj9jj7qh0s25-pg_graphql-1.6.11672pg_graphql-1.6.1> stripping (with command strip and flags -S -p) in  /nix/store/s2s0vf5dji6nm5v4fzxgcj9jj7qh0s25-pg_graphql-1.6.1/lib1673pg_graphql-1.6.1> stripping (with command strip and flags -s -p) in  /nix/store/s2s0vf5dji6nm5v4fzxgcj9jj7qh0s25-pg_graphql-1.6.1/lib1674building '/nix/store/s72y0nj96pwds84md5hz9x09cidw3azz-vector-0.6.0.drv' on 'ssh-ng://nixbot-remote-build@78.232.36.247'1675building '/nix/store/s72y0nj96pwds84md5hz9x09cidw3azz-vector-0.6.0.drv'1676vector-0.6.0> Running phase: unpackPhase1677vector-0.6.0> unpacking source archive /nix/store/7dgsykawkl9ss69fdz0iw3xlswl31jlz-source1678vector-0.6.0> source root is source1679vector-0.6.0> Running phase: patchPhase1680vector-0.6.0> Running phase: updateAutotoolsGnuConfigScriptsPhase1681vector-0.6.0> Running phase: configurePhase1682vector-0.6.0> no configure script, doing nothing1683vector-0.6.0> Running phase: buildPhase1684vector-0.6.0> build flags: SHELL=/nix/store/q1lr86rzsxxbbqdz8m6bcv94saaz8wlv-bash-5.3p3/bin/bash1685vector-0.6.0> gcc -Wall -Wmissing-prototypes -Wpointer-arith -Wdeclaration-after-statement -Werror=vla -Wendif-labels -Wmissing-format-attribute -Wimplicit-fallthrough=3 -Wcast-function-type -Wshadow=compatible-local -Wformat-security -fno-strict-aliasing -fwrapv -fexcess-precision=standard -Wno-format-truncation -Wno-stringop-truncation -g -O2 -march=native -ftree-vectorize -fassociative-math -fno-signed-zeros -fno-trapping-math -fPIC -fvisibility=hidden -I. -I./ -I/nix/store/9q4p23a2y63xn8safzzn6lbn07bnkshs-postgresql-17.11/include/server -I/nix/store/9q4p23a2y63xn8safzzn6lbn07bnkshs-postgresql-17.11/include/internal -D_GNU_SOURCE  -I/nix/store/p17klc3qq4nl9ihfwqfpi8cnqvcf92xz-libxml2-2.15.1-dev/include/libxml2 -I/nix/store/mglbi4dy4kpx7v1dcgf6iincp5x38hsc-lz4-1.10.0-dev/include -I/nix/store/g41q9md9rdcr3lkydi6f8zd6fza3h1q4-zstd-1.5.7-dev/include -I/nix/store/n2vnr7ycfk6midbzxcwd28qj3bgb50cz-icu4c-75.1-dev/include  -c -o src/hnsw.o src/hnsw.c1686vector-0.6.0> warning: Skipping impure flag -march=native because NIX_ENFORCE_NO_NATIVE is set1687vector-0.6.0> gcc -Wall -Wmissing-prototypes -Wpointer-arith -Wdeclaration-after-statement -Werror=vla -Wendif-labels -Wmissing-format-attribute -Wimplicit-fallthrough=3 -Wcast-function-type -Wshadow=compatible-local -Wformat-security -fno-strict-aliasing -fwrapv -fexcess-precision=standard -Wno-format-truncation -Wno-stringop-truncation -g -O2 -march=native -ftree-vectorize -fassociative-math -fno-signed-zeros -fno-trapping-math -fPIC -fvisibility=hidden -I. -I./ -I/nix/store/9q4p23a2y63xn8safzzn6lbn07bnkshs-postgresql-17.11/include/server -I/nix/store/9q4p23a2y63xn8safzzn6lbn07bnkshs-postgresql-17.11/include/internal -D_GNU_SOURCE  -I/nix/store/p17klc3qq4nl9ihfwqfpi8cnqvcf92xz-libxml2-2.15.1-dev/include/libxml2 -I/nix/store/mglbi4dy4kpx7v1dcgf6iincp5x38hsc-lz4-1.10.0-dev/include -I/nix/store/g41q9md9rdcr3lkydi6f8zd6fza3h1q4-zstd-1.5.7-dev/include -I/nix/store/n2vnr7ycfk6midbzxcwd28qj3bgb50cz-icu4c-75.1-dev/include  -c -o src/hnswbuild.o src/hnswbuild.c1688vector-0.6.0> warning: Skipping impure flag -march=native because NIX_ENFORCE_NO_NATIVE is set1689vector-0.6.0> gcc -Wall -Wmissing-prototypes -Wpointer-arith -Wdeclaration-after-statement -Werror=vla -Wendif-labels -Wmissing-format-attribute -Wimplicit-fallthrough=3 -Wcast-function-type -Wshadow=compatible-local -Wformat-security -fno-strict-aliasing -fwrapv -fexcess-precision=standard -Wno-format-truncation -Wno-stringop-truncation -g -O2 -march=native -ftree-vectorize -fassociative-math -fno-signed-zeros -fno-trapping-math -fPIC -fvisibility=hidden -I. -I./ -I/nix/store/9q4p23a2y63xn8safzzn6lbn07bnkshs-postgresql-17.11/include/server -I/nix/store/9q4p23a2y63xn8safzzn6lbn07bnkshs-postgresql-17.11/include/internal -D_GNU_SOURCE  -I/nix/store/p17klc3qq4nl9ihfwqfpi8cnqvcf92xz-libxml2-2.15.1-dev/include/libxml2 -I/nix/store/mglbi4dy4kpx7v1dcgf6iincp5x38hsc-lz4-1.10.0-dev/include -I/nix/store/g41q9md9rdcr3lkydi6f8zd6fza3h1q4-zstd-1.5.7-dev/include -I/nix/store/n2vnr7ycfk6midbzxcwd28qj3bgb50cz-icu4c-75.1-dev/include  -c -o src/hnswinsert.o src/hnswinsert.c1690vector-0.6.0> warning: Skipping impure flag -march=native because NIX_ENFORCE_NO_NATIVE is set1691vector-0.6.0> gcc -Wall -Wmissing-prototypes -Wpointer-arith -Wdeclaration-after-statement -Werror=vla -Wendif-labels -Wmissing-format-attribute -Wimplicit-fallthrough=3 -Wcast-function-type -Wshadow=compatible-local -Wformat-security -fno-strict-aliasing -fwrapv -fexcess-precision=standard -Wno-format-truncation -Wno-stringop-truncation -g -O2 -march=native -ftree-vectorize -fassociative-math -fno-signed-zeros -fno-trapping-math -fPIC -fvisibility=hidden -I. -I./ -I/nix/store/9q4p23a2y63xn8safzzn6lbn07bnkshs-postgresql-17.11/include/server -I/nix/store/9q4p23a2y63xn8safzzn6lbn07bnkshs-postgresql-17.11/include/internal -D_GNU_SOURCE  -I/nix/store/p17klc3qq4nl9ihfwqfpi8cnqvcf92xz-libxml2-2.15.1-dev/include/libxml2 -I/nix/store/mglbi4dy4kpx7v1dcgf6iincp5x38hsc-lz4-1.10.0-dev/include -I/nix/store/g41q9md9rdcr3lkydi6f8zd6fza3h1q4-zstd-1.5.7-dev/include -I/nix/store/n2vnr7ycfk6midbzxcwd28qj3bgb50cz-icu4c-75.1-dev/include  -c -o src/hnswscan.o src/hnswscan.c1692vector-0.6.0> warning: Skipping impure flag -march=native because NIX_ENFORCE_NO_NATIVE is set1693vector-0.6.0> gcc -Wall -Wmissing-prototypes -Wpointer-arith -Wdeclaration-after-statement -Werror=vla -Wendif-labels -Wmissing-format-attribute -Wimplicit-fallthrough=3 -Wcast-function-type -Wshadow=compatible-local -Wformat-security -fno-strict-aliasing -fwrapv -fexcess-precision=standard -Wno-format-truncation -Wno-stringop-truncation -g -O2 -march=native -ftree-vectorize -fassociative-math -fno-signed-zeros -fno-trapping-math -fPIC -fvisibility=hidden -I. -I./ -I/nix/store/9q4p23a2y63xn8safzzn6lbn07bnkshs-postgresql-17.11/include/server -I/nix/store/9q4p23a2y63xn8safzzn6lbn07bnkshs-postgresql-17.11/include/internal -D_GNU_SOURCE  -I/nix/store/p17klc3qq4nl9ihfwqfpi8cnqvcf92xz-libxml2-2.15.1-dev/include/libxml2 -I/nix/store/mglbi4dy4kpx7v1dcgf6iincp5x38hsc-lz4-1.10.0-dev/include -I/nix/store/g41q9md9rdcr3lkydi6f8zd6fza3h1q4-zstd-1.5.7-dev/include -I/nix/store/n2vnr7ycfk6midbzxcwd28qj3bgb50cz-icu4c-75.1-dev/include  -c -o src/hnswutils.o src/hnswutils.c1694vector-0.6.0> warning: Skipping impure flag -march=native because NIX_ENFORCE_NO_NATIVE is set1695vector-0.6.0> gcc -Wall -Wmissing-prototypes -Wpointer-arith -Wdeclaration-after-statement -Werror=vla -Wendif-labels -Wmissing-format-attribute -Wimplicit-fallthrough=3 -Wcast-function-type -Wshadow=compatible-local -Wformat-security -fno-strict-aliasing -fwrapv -fexcess-precision=standard -Wno-format-truncation -Wno-stringop-truncation -g -O2 -march=native -ftree-vectorize -fassociative-math -fno-signed-zeros -fno-trapping-math -fPIC -fvisibility=hidden -I. -I./ -I/nix/store/9q4p23a2y63xn8safzzn6lbn07bnkshs-postgresql-17.11/include/server -I/nix/store/9q4p23a2y63xn8safzzn6lbn07bnkshs-postgresql-17.11/include/internal -D_GNU_SOURCE  -I/nix/store/p17klc3qq4nl9ihfwqfpi8cnqvcf92xz-libxml2-2.15.1-dev/include/libxml2 -I/nix/store/mglbi4dy4kpx7v1dcgf6iincp5x38hsc-lz4-1.10.0-dev/include -I/nix/store/g41q9md9rdcr3lkydi6f8zd6fza3h1q4-zstd-1.5.7-dev/include -I/nix/store/n2vnr7ycfk6midbzxcwd28qj3bgb50cz-icu4c-75.1-dev/include  -c -o src/hnswvacuum.o src/hnswvacuum.c1696vector-0.6.0> warning: Skipping impure flag -march=native because NIX_ENFORCE_NO_NATIVE is set1697vector-0.6.0> gcc -Wall -Wmissing-prototypes -Wpointer-arith -Wdeclaration-after-statement -Werror=vla -Wendif-labels -Wmissing-format-attribute -Wimplicit-fallthrough=3 -Wcast-function-type -Wshadow=compatible-local -Wformat-security -fno-strict-aliasing -fwrapv -fexcess-precision=standard -Wno-format-truncation -Wno-stringop-truncation -g -O2 -march=native -ftree-vectorize -fassociative-math -fno-signed-zeros -fno-trapping-math -fPIC -fvisibility=hidden -I. -I./ -I/nix/store/9q4p23a2y63xn8safzzn6lbn07bnkshs-postgresql-17.11/include/server -I/nix/store/9q4p23a2y63xn8safzzn6lbn07bnkshs-postgresql-17.11/include/internal -D_GNU_SOURCE  -I/nix/store/p17klc3qq4nl9ihfwqfpi8cnqvcf92xz-libxml2-2.15.1-dev/include/libxml2 -I/nix/store/mglbi4dy4kpx7v1dcgf6iincp5x38hsc-lz4-1.10.0-dev/include -I/nix/store/g41q9md9rdcr3lkydi6f8zd6fza3h1q4-zstd-1.5.7-dev/include -I/nix/store/n2vnr7ycfk6midbzxcwd28qj3bgb50cz-icu4c-75.1-dev/include  -c -o src/ivfbuild.o src/ivfbuild.c1698vector-0.6.0> warning: Skipping impure flag -march=native because NIX_ENFORCE_NO_NATIVE is set1699vector-0.6.0> gcc -Wall -Wmissing-prototypes -Wpointer-arith -Wdeclaration-after-statement -Werror=vla -Wendif-labels -Wmissing-format-attribute -Wimplicit-fallthrough=3 -Wcast-function-type -Wshadow=compatible-local -Wformat-security -fno-strict-aliasing -fwrapv -fexcess-precision=standard -Wno-format-truncation -Wno-stringop-truncation -g -O2 -march=native -ftree-vectorize -fassociative-math -fno-signed-zeros -fno-trapping-math -fPIC -fvisibility=hidden -I. -I./ -I/nix/store/9q4p23a2y63xn8safzzn6lbn07bnkshs-postgresql-17.11/include/server -I/nix/store/9q4p23a2y63xn8safzzn6lbn07bnkshs-postgresql-17.11/include/internal -D_GNU_SOURCE  -I/nix/store/p17klc3qq4nl9ihfwqfpi8cnqvcf92xz-libxml2-2.15.1-dev/include/libxml2 -I/nix/store/mglbi4dy4kpx7v1dcgf6iincp5x38hsc-lz4-1.10.0-dev/include -I/nix/store/g41q9md9rdcr3lkydi6f8zd6fza3h1q4-zstd-1.5.7-dev/include -I/nix/store/n2vnr7ycfk6midbzxcwd28qj3bgb50cz-icu4c-75.1-dev/include  -c -o src/ivfflat.o src/ivfflat.c1700vector-0.6.0> warning: Skipping impure flag -march=native because NIX_ENFORCE_NO_NATIVE is set1701vector-0.6.0> gcc -Wall -Wmissing-prototypes -Wpointer-arith -Wdeclaration-after-statement -Werror=vla -Wendif-labels -Wmissing-format-attribute -Wimplicit-fallthrough=3 -Wcast-function-type -Wshadow=compatible-local -Wformat-security -fno-strict-aliasing -fwrapv -fexcess-precision=standard -Wno-format-truncation -Wno-stringop-truncation -g -O2 -march=native -ftree-vectorize -fassociative-math -fno-signed-zeros -fno-trapping-math -fPIC -fvisibility=hidden -I. -I./ -I/nix/store/9q4p23a2y63xn8safzzn6lbn07bnkshs-postgresql-17.11/include/server -I/nix/store/9q4p23a2y63xn8safzzn6lbn07bnkshs-postgresql-17.11/include/internal -D_GNU_SOURCE  -I/nix/store/p17klc3qq4nl9ihfwqfpi8cnqvcf92xz-libxml2-2.15.1-dev/include/libxml2 -I/nix/store/mglbi4dy4kpx7v1dcgf6iincp5x38hsc-lz4-1.10.0-dev/include -I/nix/store/g41q9md9rdcr3lkydi6f8zd6fza3h1q4-zstd-1.5.7-dev/include -I/nix/store/n2vnr7ycfk6midbzxcwd28qj3bgb50cz-icu4c-75.1-dev/include  -c -o src/ivfinsert.o src/ivfinsert.c1702vector-0.6.0> warning: Skipping impure flag -march=native because NIX_ENFORCE_NO_NATIVE is set1703vector-0.6.0> gcc -Wall -Wmissing-prototypes -Wpointer-arith -Wdeclaration-after-statement -Werror=vla -Wendif-labels -Wmissing-format-attribute -Wimplicit-fallthrough=3 -Wcast-function-type -Wshadow=compatible-local -Wformat-security -fno-strict-aliasing -fwrapv -fexcess-precision=standard -Wno-format-truncation -Wno-stringop-truncation -g -O2 -march=native -ftree-vectorize -fassociative-math -fno-signed-zeros -fno-trapping-math -fPIC -fvisibility=hidden -I. -I./ -I/nix/store/9q4p23a2y63xn8safzzn6lbn07bnkshs-postgresql-17.11/include/server -I/nix/store/9q4p23a2y63xn8safzzn6lbn07bnkshs-postgresql-17.11/include/internal -D_GNU_SOURCE  -I/nix/store/p17klc3qq4nl9ihfwqfpi8cnqvcf92xz-libxml2-2.15.1-dev/include/libxml2 -I/nix/store/mglbi4dy4kpx7v1dcgf6iincp5x38hsc-lz4-1.10.0-dev/include -I/nix/store/g41q9md9rdcr3lkydi6f8zd6fza3h1q4-zstd-1.5.7-dev/include -I/nix/store/n2vnr7ycfk6midbzxcwd28qj3bgb50cz-icu4c-75.1-dev/include  -c -o src/ivfkmeans.o src/ivfkmeans.c1704vector-0.6.0> warning: Skipping impure flag -march=native because NIX_ENFORCE_NO_NATIVE is set1705vector-0.6.0> gcc -Wall -Wmissing-prototypes -Wpointer-arith -Wdeclaration-after-statement -Werror=vla -Wendif-labels -Wmissing-format-attribute -Wimplicit-fallthrough=3 -Wcast-function-type -Wshadow=compatible-local -Wformat-security -fno-strict-aliasing -fwrapv -fexcess-precision=standard -Wno-format-truncation -Wno-stringop-truncation -g -O2 -march=native -ftree-vectorize -fassociative-math -fno-signed-zeros -fno-trapping-math -fPIC -fvisibility=hidden -I. -I./ -I/nix/store/9q4p23a2y63xn8safzzn6lbn07bnkshs-postgresql-17.11/include/server -I/nix/store/9q4p23a2y63xn8safzzn6lbn07bnkshs-postgresql-17.11/include/internal -D_GNU_SOURCE  -I/nix/store/p17klc3qq4nl9ihfwqfpi8cnqvcf92xz-libxml2-2.15.1-dev/include/libxml2 -I/nix/store/mglbi4dy4kpx7v1dcgf6iincp5x38hsc-lz4-1.10.0-dev/include -I/nix/store/g41q9md9rdcr3lkydi6f8zd6fza3h1q4-zstd-1.5.7-dev/include -I/nix/store/n2vnr7ycfk6midbzxcwd28qj3bgb50cz-icu4c-75.1-dev/include  -c -o src/ivfscan.o src/ivfscan.c1706vector-0.6.0> warning: Skipping impure flag -march=native because NIX_ENFORCE_NO_NATIVE is set1707vector-0.6.0> gcc -Wall -Wmissing-prototypes -Wpointer-arith -Wdeclaration-after-statement -Werror=vla -Wendif-labels -Wmissing-format-attribute -Wimplicit-fallthrough=3 -Wcast-function-type -Wshadow=compatible-local -Wformat-security -fno-strict-aliasing -fwrapv -fexcess-precision=standard -Wno-format-truncation -Wno-stringop-truncation -g -O2 -march=native -ftree-vectorize -fassociative-math -fno-signed-zeros -fno-trapping-math -fPIC -fvisibility=hidden -I. -I./ -I/nix/store/9q4p23a2y63xn8safzzn6lbn07bnkshs-postgresql-17.11/include/server -I/nix/store/9q4p23a2y63xn8safzzn6lbn07bnkshs-postgresql-17.11/include/internal -D_GNU_SOURCE  -I/nix/store/p17klc3qq4nl9ihfwqfpi8cnqvcf92xz-libxml2-2.15.1-dev/include/libxml2 -I/nix/store/mglbi4dy4kpx7v1dcgf6iincp5x38hsc-lz4-1.10.0-dev/include -I/nix/store/g41q9md9rdcr3lkydi6f8zd6fza3h1q4-zstd-1.5.7-dev/include -I/nix/store/n2vnr7ycfk6midbzxcwd28qj3bgb50cz-icu4c-75.1-dev/include  -c -o src/ivfutils.o src/ivfutils.c1708vector-0.6.0> warning: Skipping impure flag -march=native because NIX_ENFORCE_NO_NATIVE is set1709vector-0.6.0> gcc -Wall -Wmissing-prototypes -Wpointer-arith -Wdeclaration-after-statement -Werror=vla -Wendif-labels -Wmissing-format-attribute -Wimplicit-fallthrough=3 -Wcast-function-type -Wshadow=compatible-local -Wformat-security -fno-strict-aliasing -fwrapv -fexcess-precision=standard -Wno-format-truncation -Wno-stringop-truncation -g -O2 -march=native -ftree-vectorize -fassociative-math -fno-signed-zeros -fno-trapping-math -fPIC -fvisibility=hidden -I. -I./ -I/nix/store/9q4p23a2y63xn8safzzn6lbn07bnkshs-postgresql-17.11/include/server -I/nix/store/9q4p23a2y63xn8safzzn6lbn07bnkshs-postgresql-17.11/include/internal -D_GNU_SOURCE  -I/nix/store/p17klc3qq4nl9ihfwqfpi8cnqvcf92xz-libxml2-2.15.1-dev/include/libxml2 -I/nix/store/mglbi4dy4kpx7v1dcgf6iincp5x38hsc-lz4-1.10.0-dev/include -I/nix/store/g41q9md9rdcr3lkydi6f8zd6fza3h1q4-zstd-1.5.7-dev/include -I/nix/store/n2vnr7ycfk6midbzxcwd28qj3bgb50cz-icu4c-75.1-dev/include  -c -o src/ivfvacuum.o src/ivfvacuum.c1710vector-0.6.0> warning: Skipping impure flag -march=native because NIX_ENFORCE_NO_NATIVE is set1711vector-0.6.0> gcc -Wall -Wmissing-prototypes -Wpointer-arith -Wdeclaration-after-statement -Werror=vla -Wendif-labels -Wmissing-format-attribute -Wimplicit-fallthrough=3 -Wcast-function-type -Wshadow=compatible-local -Wformat-security -fno-strict-aliasing -fwrapv -fexcess-precision=standard -Wno-format-truncation -Wno-stringop-truncation -g -O2 -march=native -ftree-vectorize -fassociative-math -fno-signed-zeros -fno-trapping-math -fPIC -fvisibility=hidden -I. -I./ -I/nix/store/9q4p23a2y63xn8safzzn6lbn07bnkshs-postgresql-17.11/include/server -I/nix/store/9q4p23a2y63xn8safzzn6lbn07bnkshs-postgresql-17.11/include/internal -D_GNU_SOURCE  -I/nix/store/p17klc3qq4nl9ihfwqfpi8cnqvcf92xz-libxml2-2.15.1-dev/include/libxml2 -I/nix/store/mglbi4dy4kpx7v1dcgf6iincp5x38hsc-lz4-1.10.0-dev/include -I/nix/store/g41q9md9rdcr3lkydi6f8zd6fza3h1q4-zstd-1.5.7-dev/include -I/nix/store/n2vnr7ycfk6midbzxcwd28qj3bgb50cz-icu4c-75.1-dev/include  -c -o src/vector.o src/vector.c1712vector-0.6.0> warning: Skipping impure flag -march=native because NIX_ENFORCE_NO_NATIVE is set1713vector-0.6.0> gcc -Wall -Wmissing-prototypes -Wpointer-arith -Wdeclaration-after-statement -Werror=vla -Wendif-labels -Wmissing-format-attribute -Wimplicit-fallthrough=3 -Wcast-function-type -Wshadow=compatible-local -Wformat-security -fno-strict-aliasing -fwrapv -fexcess-precision=standard -Wno-format-truncation -Wno-stringop-truncation -g -O2 -march=native -ftree-vectorize -fassociative-math -fno-signed-zeros -fno-trapping-math -fPIC -fvisibility=hidden -shared -o vector.so src/hnsw.o src/hnswbuild.o src/hnswinsert.o src/hnswscan.o src/hnswutils.o src/hnswvacuum.o src/ivfbuild.o src/ivfflat.o src/ivfinsert.o src/ivfkmeans.o src/ivfscan.o src/ivfutils.o src/ivfvacuum.o src/vector.o -L/nix/store/07zklik5dwl2sfqym1gwbrrkfby7lrjn-postgresql-17.11-lib/lib    -L/nix/store/wfk1mrpj1r5f7iyihjnh0jjixr900z7y-libxml2-2.15.1/lib -L/nix/store/62b24z1igfh6ws654fhsgnm3fm7j1z3c-lz4-1.10.0-lib/lib -L/nix/store/fqy9nkaahib56gcy0r77qjk7n03cvnfs-zstd-1.5.7/lib -Wl,--as-needed -Wl,-rpath,'/nix/store/07zklik5dwl2sfqym1gwbrrkfby7lrjn-postgresql-17.11-lib/lib',--enable-new-dtags -fvisibility=hidden 1714vector-0.6.0> warning: Skipping impure flag -march=native because NIX_ENFORCE_NO_NATIVE is set1715vector-0.6.0> cp sql/vector.sql sql/vector--0.6.0.sql1716vector-0.6.0> Running phase: installPhase1717vector-0.6.0> Running phase: fixupPhase1718vector-0.6.0> shrinking RPATHs of ELF executables and libraries in /nix/store/bnny0z3lvpnlahhpqy5dh0vj8kyxqzxq-vector-0.6.01719vector-0.6.0> shrinking /nix/store/bnny0z3lvpnlahhpqy5dh0vj8kyxqzxq-vector-0.6.0/lib/vector-0.6.0.so1720vector-0.6.0> checking for references to /build/ in /nix/store/bnny0z3lvpnlahhpqy5dh0vj8kyxqzxq-vector-0.6.0...1721vector-0.6.0> patching script interpreter paths in /nix/store/bnny0z3lvpnlahhpqy5dh0vj8kyxqzxq-vector-0.6.01722vector-0.6.0> stripping (with command strip and flags -S -p) in  /nix/store/bnny0z3lvpnlahhpqy5dh0vj8kyxqzxq-vector-0.6.0/lib