nixbot

builds

cancelled checks.aarch64-linux.ext-pg_repack build #132 · raw · eval 37.2 s · 2.2 GiB allocated · ·

1these 343 derivations will be built:2  /nix/store/09yw6by1xkgwvadzkn03bvaxw955v632-pg_partman.drv3  /nix/store/0cmixqwsz3vb82j49j1mhvyk8crg4dcw-wrappers-0.6.0.drv4  /nix/store/f4fxzxll7q3m5cy6rib758j63zcky8dk-supabase_vault-0.2.8.drv5  /nix/store/zyzrb73x0fw62dyxqdz0znqnzvgqa7g6-supabase_vault-0.3.1.drv6  /nix/store/0dxji73cc07dbqk8nny6y5mkf5qr6kl8-supabase_vault.drv7  /nix/store/fl27cr5qdrq44nk61x5yjlqxsrc8mg3n-pgsodium-3.0.4.drv8  /nix/store/jl20dg8fxlmlv84f7cda9xa6mq8y46sr-pgsodium-3.1.7.drv9  /nix/store/l6md1p6ahq43yili977j4021ky05la94-pgsodium-3.1.8.drv10  /nix/store/pvz0jf5drhdz4jj5k592kxbdgk4lm52r-pgsodium-3.1.6.drv11  /nix/store/zdz6b4s43i332x3xlvjivc7p4csihzba-pgsodium-3.1.5.drv12  /nix/store/0h7mnh8was4m19z53z0dmakrp0c9271q-pgsodium.drv13  /nix/store/0i6b8yy32fc4mgfm75w94gw9ja033kw5-wrappers-0.5.5.drv14  /nix/store/qbrypyj5k7h0pffxxshbyym24h89f2y1-gdal-3.8.5.drv15  /nix/store/l9h30apsjb4s39av0lwsad1vv59rdkv6-cgal-6.0.2.drv16  /nix/store/s3myd88a11h86h3h8cvhgd1im0zk6i65-sfcgal-2.2.0.drv17  /nix/store/h1vl8vpk154yppn5lcqms2680igi0mmj-postgis-3.3.2.drv18  /nix/store/2ylkw9crapb58vd5g0vj602jfyb1p3r6-postgis.drv19  /nix/store/58cinn47vbvwr1wxdkspmvi9cj27b07h-safeupdate-1.4.drv20  /nix/store/6c0mnd757hvxppfyrsf4cb1wgnbd4111-safeupdate.drv21  /nix/store/ciwky5vscrx4c52kr30fm8j4idj8qgsn-pg_stat_monitor-2.1.drv22  /nix/store/7a02zvvkkkriis78wgz6n8nnkwm2gh22-pg_stat_monitor.drv23  /nix/store/9gh7fip2wf0wip8wnv1axd8ghar0x5fb-pgmq-1.5.1.drv24  /nix/store/k4swwy7459wf558rbrraclsr4sjccz0h-pgmq-1.4.4.drv25  /nix/store/8zsadvm8mv18kpy4qy724ps2jlbsik0w-pgmq.drv26  /nix/store/4wk9vb1q3kdnhj8hsq8pwgbp82glwg9w-timescaledb-2.9.1.drv27  /nix/store/9wzj3wh6sczzk849dmjwvmnkshggakxp-timescaledb.drv28  /nix/store/2nmg9sxx50xmndps3714hbvwjyd5rqv0-vector-0.8.2.drv29  /nix/store/94d6rmv5v8zdjsgzl3yrhpg7zq6zdjpx-vector-0.5.1.drv30  /nix/store/alajylsl9b90m65n0ps0mkbkw679x4sn-vector-0.6.2.drv31  /nix/store/jmilv9h5p0v4grgqnhfn22i7zl352ybh-vector-0.7.4.drv32  /nix/store/q3mdjvqpw4xbwcjy5y1ps1igxsjvx133-vector-0.7.0.drv33  /nix/store/v5dnr617av2jgk6kpddxbxxqjqgl5kzg-vector-0.8.0.drv34  /nix/store/z40s48rz55qgpw6g6wiqi68hkfas4h1l-vector-0.6.0.drv35  /nix/store/zygvf0wgqsyi96fangshfkwjiyylhvkz-vector-0.4.0.drv36  /nix/store/9zndhfzc45vrfn297g1hav7m6ba3rlzk-vector.drv37  /nix/store/0nln7k62ggiw9s5y0icr3hyribl5iazb-pg_graphql-1.2.3.drv38  /nix/store/63ifr5p2wzl7vygaj7pq847nwnrnxm3p-pg_graphql-1.5.0.drv39  /nix/store/6hfik9nnrihzb6dj53in06v6a4qmgsj3-pg_graphql-1.5.7.drv40  /nix/store/7pqhalqwaggagybgy24lm93c5b8d4isk-pg_graphql-1.4.2.drv41  /nix/store/ag5rlkqwfkwlgvxg1yhivjqfcaq2w14v-pg_graphql-1.5.1-mergeless.drv42  /nix/store/cgazfazb4ak4csd48khgjsa4vxmmddfb-pg_graphql-1.5.11.drv43  /nix/store/d78fjdz9zrccq7f563jz9fj1a45yrq5x-pg_graphql-1.1.0.drv44  /nix/store/dk0a0irlxsl04249qy2dnc6bm4wkk1lc-pg_graphql-1.6.1.drv45  /nix/store/dnwfmlfwyqnkzy2jyzf6h3q044wk6hbg-pg_graphql-1.5.9.drv46  /nix/store/f694g0m8chfk6z6yh787135bzcqwnli4-pg_graphql-1.5.4.drv47  /nix/store/fsgiwnrg38ssgf05vkmzc21v93a36qmd-pg_graphql-1.2.2.drv48  /nix/store/h9damb814a5fmzyc5wgcildkm32vy1bv-pg_graphql-1.6.2.drv49  /nix/store/iq0gzwfxzxkns0gpdkhjx1cc6s4q1i2q-pg_graphql-1.5.6.drv50  /nix/store/q66z8j5qs96rgahzmlrq4n41d2avywar-pg_graphql-1.0.2.drv51  /nix/store/v0mqjlj6j73wpc66h34djrv08j7q3l8w-pg_graphql-1.4.4.drv52  /nix/store/wnn3f47lz59i84mdzvmc1a7man89cmic-pg_graphql-1.2.0.drv53  /nix/store/yds474rgqgxjdw6zm0ylvpvvd4l0xmkl-pg_graphql-1.4.1.drv54  /nix/store/yhfqz2chz94q9k3rv8hgwcsyri02wlm8-pg_graphql-1.5.1.drv55  /nix/store/a4icbsgspmpi3nfs8vffp42sg9v7a25f-pg_graphql.drv56  /nix/store/a7qnf8v2hw96v6kdba9j02fljccy432g-pg_tle.drv57  /nix/store/c08rdgxba5n6zhyp78l8sd6fhnbc4a4c-pgsodium-3.1.7.drv58  /nix/store/hh2jpg5qdwgdwzi96qcay1a5ffhi0f4i-pgsodium-3.1.6.drv59  /nix/store/jwrjvb9m50v44sla4jpig83jab7zn17x-pgsodium-3.1.8.drv60  /nix/store/m1xdmpffkflwgdin5ljvfh72wxq5lxpx-pgsodium-3.1.5.drv61  /nix/store/wjhhlaiwzvm5m08my4d983icdmcpllzd-pgsodium-3.0.4.drv62  /nix/store/a9laaq557mna86dm87lq3211xy5h2zyl-pgsodium.drv63  /nix/store/ag6xlrckwkx594nhf6j3sq2ngwbryyz8-http.drv64  /nix/store/i0gq8yqxp5h7l782n2ki94b1d62m6zsg-plpgsql_check-2.2.drv65  /nix/store/q117a7mx5d5bzln8xg24fh1vfzq7bsz4-plpgsql_check-2.7.drv66  /nix/store/rj6qw8pwvr91cy6qyp8xibrw4arrpj9j-plpgsql_check-2.8.drv67  /nix/store/c782i897gj20c0r8bmphf8p6r5s5wdli-plpgsql_check.drv68  /nix/store/b139hl0gpc9icb6j6q28gl1chw7i9260-rum-1.3.drv69  /nix/store/csvzp35khfq15v5g275y14094s58v10k-rum.drv70  /nix/store/c2pcswnd4yfp02pas6a7grpm0fmk70wx-supabase_vault-0.3.1.drv71  /nix/store/jb3j93i6ljmvqkv5cnv3lh3d9zn4zcjz-supabase_vault-0.2.8.drv72  /nix/store/gc3nb7r1a8rbf6f8yf4zs2nnb65awkxq-supabase_vault.drv73  /nix/store/7inhp3jz4x6l1m2i6aa1w6bbb91r1hay-pgroonga-3.2.5.drv74  /nix/store/xim497rkcncpxb5vvyli3j4jnziyybgy-pgroonga-3.0.7.drv75  /nix/store/gdd3j67qcdibplv1d440a6gsix87s5xs-pgroonga.drv76  /nix/store/ihx5q75k74a4cqq4k9bwnl5yin262kq2-pgrouting-3.4.1.drv77  /nix/store/hf9dly2ryx969lw950ld454fqfa6c41r-pgrouting.drv78  /nix/store/8kjmsmcqakfh251gpi83kpszgvy3zgj2-pg_jsonschema-0.3.1.drv79  /nix/store/dllk76mn670xnq6146jk4lmj5hpxmp4c-pg_jsonschema-0.3.3.drv80  /nix/store/pqncxlsh0gj7xk3n4mwxqiyyzim9c7g7-pg_jsonschema-0.2.0.drv81  /nix/store/iljk5j7rhldnws1iwi3j8qjxnaalxqjv-pg_jsonschema.drv82  /nix/store/82vdx9lfkbv67j79qzi9yzvqrj043w52-wal2json-2.6.drv83  /nix/store/iz713zhjyn0lym6ls12i9vxca9cxf4hi-wal2json.drv84  /nix/store/zfhvj40marmxclav9a5ppx3dmq3xd3hh-pg_partman-5.3.1.drv85  /nix/store/jcxqgl4g37gj09v4km7dl525ym1kxla2-pg_partman.drv86  /nix/store/mc1n2fml7avin2lrpgrd5cx7wjdb4gcg-pg_hashids-1.3.0-cd0e1b31d52b394a0df64079406a14a4f7387cd6.drv87  /nix/store/jsqjxdn4qp571nvc40r8xx103s9qb7c9-pg_hashids.drv88  /nix/store/7lzcc5d36122752hpjb6lij6sc2ai2a0-plv8-3.1.5.drv89  /nix/store/87brzrl1nsm8z4my02aldnxd8fb0i69x-plv8-3.1.4.drv90  /nix/store/k6nh1vivj2dgh0jk2mpsiy4p5v6sjyzk-plv8.drv91  /nix/store/xjfjfch45p5g0snar9qpm4amblh2jya8-plan_filter-0.1.drv92  /nix/store/lhdnha0m1rqpv0cmivzv3s7znjmgxc14-plan_filter.drv93  /nix/store/0n0iaya9csx9by2pimrx1yglzw8dp4zs-pg_net-0.13.0.drv94  /nix/store/25f3j4f5ialq0qwpdpc7gya55q9i2mai-pg_net-0.11.0.drv95  /nix/store/5xdj291zxpgm4qhx0749x7j0wwlfilf4-pg_net-0.1.drv96  /nix/store/6nzc8mspw5i4qqlvgriv2l1439xlh68v-pg_net-0.10.0.drv97  /nix/store/7iq4z475k625nsn9wc9nf4vxa7x1f1qd-pg_net-0.19.5.drv98  /nix/store/cfrc2vk3cgabx1447j2n7s3zxraq6395-pg_net-0.14.0.drv99  /nix/store/iwq28h7yniccm9ra8q6dc0wma0l6hnqn-pg_net-0.6.drv100  /nix/store/nw3d144zhshkgx1z66g9g2wg5829w36n-pg_net-0.7.1.drv101  /nix/store/nwcnf7x9i2zdx48936w9ixsnxzhbab16-pg_net-0.20.0.drv102  /nix/store/rfdqkjkjdwz7ydrwlfn9cdy68zz9z6rf-pg_net-0.7.drv103  /nix/store/whvqb38akl195470ks3jads9kmq2i9gj-pg_net-0.8.0.drv104  /nix/store/zy29jzcj1bsz7760wbmlg78czaddsrni-pg_net-0.20.3.drv105  /nix/store/q7ak647qv213m4vc4fnr43i09azs1b0p-pg_net.drv106  /nix/store/s7vxni6a17dm43jdicq8ksfjsk2d7c0n-pgaudit.drv107  /nix/store/nwi7hxl3j1cxn7ylrkx8sbbg3sqld8ag-pgtap-1.3.3.drv108  /nix/store/sxzi0qg4ingw35zkbi2pk2vfgxbq5k2a-pgtap.drv109  /nix/store/wza7bzcbymwld5yd1bh5p859l0fgd9af-pg_cron-1.4.2.drv110  /nix/store/xcji3ff216yxrc2yf2yss6mza01w0ccm-pg_cron.drv111  /nix/store/21s45rg3i2jfhdarxmqf3dr79allgdgh-wrappers-0.4.5.drv112  /nix/store/56j6z0f3g50m72cj7ynr22p9fdml79q9-wrappers-0.5.3.drv113  /nix/store/9m4hgq2s9z1cy1508wymdcl2n1w3ky5h-wrappers-0.6.2.drv114  /nix/store/f3b53aqd65czxnbbash43yraza54ds7k-wrappers-0.4.3.drv115  /nix/store/fpcwzjw9wdhbljjpcjlbz4w6236qzl70-wrappers-0.3.0.drv116  /nix/store/hygnfcb7az5nw4c4aranasi27gnhzgan-wrappers-0.6.3.drv117  /nix/store/iimlppn24xgvgjvnm4xp8z9bxl4p4p1d-wrappers-0.4.1.drv118  /nix/store/l3ww3jfvj5l8bp25p66wrjziy8m0vi23-wrappers-0.5.0.drv119  /nix/store/ns9rs9anq0rsl3sh1rhxmqcsll7lkjd0-wrappers-0.5.6.drv120  /nix/store/nvjw377g2m07i1z93mngr72qhpjmafvy-wrappers-0.4.6.drv121  /nix/store/qzn17ml7z84zcmcw96j0z0f6m9j6y7qm-wrappers-0.5.4.drv122  /nix/store/xbhixx8nl4iifcfi17lpavbs9cxcg5ka-wrappers-0.6.1.drv123  /nix/store/y06jjr5k7hk7zs8gzilg4g50b184va6a-wrappers-0.4.2.drv124  /nix/store/y1qh08g7i9w1x2s10rq7ammigljy82kw-wrappers-0.4.4.drv125  /nix/store/z1yzqa9qzq4ri1f58lngsljs0abhgjz5-wrappers-0.5.7.drv126  /nix/store/xcq8s20l2ynk52356w6nqkdw7379h4g4-wrappers.drv127  /nix/store/3m1k34jx4kw90mcghzrp83c2dfhrwab8-pg_repack-1.5.1.drv128  /nix/store/c7dnz58z4jqy26qinfmray2nlvxx3442-pg_repack-1.4.8.drv129  /nix/store/iwgg2la44vzaaa2ja2xyaydck2jab651-pg_repack-1.5.2.drv130  /nix/store/xd0qgx5kfkw00jgxs1v9rm4ksfdjky95-pg_repack.drv131  /nix/store/fakh4z5ssr1vhknp3xv3ch232i3ph2ax-postgresql-and-plugins-15.19.drv132  /nix/store/4z7sbcap8vdzfs1smz81k2crr4sgm640-postgresql-and-plugins-15.19.drv133  /nix/store/q4qvxkwv7rl1jac9sf5aap56gjx0n5mb-system-path.drv134  /nix/store/9in45xg9fcahx70h7alf6jg08sin568q-dbus-1.drv135  /nix/store/jffmpfrihfl3k6lfgdc4ii4a62343h7x-X-Restart-Triggers-dbus.drv136  /nix/store/0jyfsa7sd5nhfiwbk0i0i0k7bbgigy6z-unit-dbus.service.drv137  /nix/store/0nn0jglvy3w5hd868rilks6acxx242hj-pg_net-0.19.5.drv138  /nix/store/0q3jswlrym436vq3yzd7nmxpfpc7zbw7-wrappers-0.5.6.drv139  /nix/store/0wbkhlgz00c1nhm74adar4kk6dbid1dq-pg_graphql-1.5.11.drv140  /nix/store/1k3nzf8206jy6jjwdb50jn8rij79dvvj-plan_filter-0.1.drv141  /nix/store/17zhj6r14i4xx0fmzclykpcnyicwhbga-plan_filter.drv142  /nix/store/18746y4c8pvpm3al2bydwcn29pgwkjij-pg_repack-1.4.8.drv143  /nix/store/1hza0wxglhyl1641a3yki78kp045s8x2-wrappers-0.5.7.drv144  /nix/store/1mkhz1wanb7sx61imr6wqda0cqnvnj8q-wal2json-2.6.drv145  /nix/store/1r4ihdrrxnxp1kc97akzkb6yf0rhj5fy-wal2json-2.6.drv146  /nix/store/spkggw5b21kbiq57p7fq00khhxxg9mpm-http-1.6.1.drv147  /nix/store/1s2y3lhnrwphps8mxwxhj6pli5p72pz8-http.drv148  /nix/store/m94894cysabrjwxvvsg00i2c4vxrwj44-pg_graphql-1.6.1.drv149  /nix/store/nsc639d0i1mzcdskxc5v8874w8f4zf8x-pg_graphql-1.6.2.drv150  /nix/store/w47195gn53xxlfnja6kkgpgj0pbxj66m-pg_graphql-1.5.9.drv151  /nix/store/2j0amjv943p6zmhzl3mx9z6jr1qcpn3i-pg_graphql.drv152  /nix/store/2wp2aqp71l4218m1z0aas6789yx18sv3-pgrouting-3.4.1.drv153  /nix/store/564f4p7z536irjy1x7a6i39nk3n3g2r2-pgrouting.drv154  /nix/store/7m924d2lj1z3y952h3rhjixfq3sygp4r-pg_tle.drv155  /nix/store/z008z9r9dipnvldyfh7pklhxwdav0faw-http-1.6.1.drv156  /nix/store/82hvrn43v2lmbsbj2cnaaps4iy6q9dqn-http.drv157  /nix/store/k4qjk97aggz30jlgv2hdqka8fy8z07pg-supabase_vault-0.3.1.drv158  /nix/store/z8jynkjsnrfphim33c02aci4n6i2s9la-supabase_vault-0.2.8.drv159  /nix/store/8ir53vjiqz9rhip8arbxd2b58d0j67w0-supabase_vault.drv160  /nix/store/vrks8v32hwif7cfllbj4kb4i2v9b48y8-hypopg.drv161  /nix/store/yxyw8y9hskg7m2sajbfkix9g2pibkl2w-index_advisor-0.2.0.drv162  /nix/store/9c27ix09f1z8w6a63dkm9idp2vsrixh1-index_advisor.drv163  /nix/store/9sv9z7i53r40xnrigr8aywi98izk30rb-wal2json.drv164  /nix/store/g3yy08xhp6kakigznjmymrvasv6xhzz4-rum-1.3.drv165  /nix/store/apcx516gwjdivwb00nzvgwwq26mp6kbp-rum.drv166  /nix/store/m5i71pkvgfbs9l7iwwnbj4hyz9dvj13m-pg_jsonschema-0.3.3.drv167  /nix/store/az9kzhbrx32y837x7nl7dfajllv3l3xn-pg_jsonschema.drv168  /nix/store/ynjdlqr0w8h7ici1xdnsr79mwnzmyyri-pgroonga-3.2.5.drv169  /nix/store/c7b5vgzvlwgra3bhwq5fjzl0cg8lxq53-pgroonga.drv170  /nix/store/axpz1dvivwnmwkkcs392nj9cp1zs4x4h-pg_repack-1.4.8.drv171  /nix/store/gpxphj5cc5qbfjvp1kckicqwibgb6870-pg_repack-1.5.0.drv172  /nix/store/nynlpdydjmjk2fk2fsjz9bws5n6pjjyv-pg_repack-1.5.1.drv173  /nix/store/sa036niivyjgc2rqi9xh890msxh349l9-pg_repack-1.5.2.drv174  /nix/store/f4jr9drjzv7wfj2rxqg6fxg4ki5xv8aq-pg_repack.drv175  /nix/store/3cgs2dl0nwcsnwa5j7vkkp9vnqrax686-wrappers-0.6.0.drv176  /nix/store/74dcpcc376carhrdcf8ka4zmkawz1yv6-wrappers-0.5.4.drv177  /nix/store/92vrj7bj8hswwppxa34pv4a5mcishcns-wrappers-0.4.4.drv178  /nix/store/96l1zwmvz2ffcdfraaalfc6lvhah4kbz-wrappers-0.5.5.drv179  /nix/store/adcv6z66z4kpsasjjh1mcxa915lbdppl-wrappers-0.4.5.drv180  /nix/store/b4n3d1kid5pcaqfl3fjnjmc425dgg1p1-wrappers-0.5.0.drv181  /nix/store/jcd2gw4vawwnh0pmxhl4pl3ll6adggx5-wrappers-0.6.2.drv182  /nix/store/vxwdlzq8s4jj92x0jpc4sl9drjywlalq-wrappers-0.6.3.drv183  /nix/store/xwhq66cqc0ms922bxlcgc1jwff6kqv8g-wrappers-0.5.3.drv184  /nix/store/y6kq63cxxc5v5jh87mv9wpbvk0p4ayfg-wrappers-0.6.1.drv185  /nix/store/zdyyj4cgmfdl46zb5ycwmwr6d30w6mbx-wrappers-0.4.6.drv186  /nix/store/fn58ja37h9fw7mszrd75faxdb0999f0i-wrappers.drv187  /nix/store/8yjdx0pjzbx41fx807nrw1js3y16kbz5-vector-0.5.1.drv188  /nix/store/9yiwshvqw6zii2gdbjn3whic00kdi2kk-vector-0.7.4.drv189  /nix/store/gd4y86918lqw8gzxg8nqrz8sy2dqq9fb-vector-0.7.0.drv190  /nix/store/gdgmh15k0z47wvlyk7n79hg9mm7jzisl-vector-0.6.2.drv191  /nix/store/hs3bxh6aa4yj96k9qp50af7qy1jchwk3-vector-0.6.0.drv192  /nix/store/j5mchw8xwd04x2c28fmf7pccna5x7y95-vector-0.8.2.drv193  /nix/store/qa8qkhza8bf74v69dzxgqvy2mjf799yl-vector-0.8.0.drv194  /nix/store/g5mv4minlqr25pj8gqhzcns6w7bwzaph-vector.drv195  /nix/store/lkbp0bzzg49y6z9h7ms156q0jsiq6qh4-safeupdate-1.4.drv196  /nix/store/icwncd52zxyvvybn79pvj2s9day934p8-safeupdate.drv197  /nix/store/j99v4y7ck8sk68hj9m9aw1avc2dkn4nh-pg_stat_monitor.drv198  /nix/store/9kmiqqmclsl8d77yd54al2d2wlwc6dp1-pgsodium-3.0.4.drv199  /nix/store/ckl9zg69wqkncwizrd6lln7h5492wwn6-pgsodium-3.1.6.drv200  /nix/store/lhi0y1xi9i9i1c8kg95nfhdw95j3dz3r-pgsodium-3.1.5.drv201  /nix/store/msmzmvngp6cx4yl0dwgzp3iv7bv796wg-pgsodium-3.1.8.drv202  /nix/store/zwypkv0vf8m8ybs536jq5wglvhfwdx8y-pgsodium-3.1.7.drv203  /nix/store/l68xzbdq736nzdnwvr9q3x29wcngcsj1-pgsodium.drv204  /nix/store/qk4j715gipc827yxrcwv0g9pviaqxkyy-pg_partman.drv205  /nix/store/46l7zbh5kkmyi58x419ar4kly30qvnhi-gdal-3.8.5.drv206  /nix/store/apd0c6nk3x333r1xj0sl2m3cr96pbizv-postgis-3.3.7.drv207  /nix/store/r12320b80inhy5aq434asc4sa8w6bn0g-postgis.drv208  /nix/store/36hfvpcvdxj64718i9mhil3db8835a6q-plpgsql_check-2.7.drv209  /nix/store/9lpr8r6zwzid07ihmr89rnxqcwv0yfja-plpgsql_check-2.8.drv210  /nix/store/rly88629k74w1nj10q0l6mg2jvd3nr1g-plpgsql_check.drv211  /nix/store/83ycsfk9ivb7sah3lq89d8hy5rxj5vpp-pg_net-0.20.3.drv212  /nix/store/a0ldx82cv1chkbdks86c8mjp8ps4lfgn-pg_net-0.20.0.drv213  /nix/store/b0270km6h57kbdxfkhagcpsilp239adm-pg_net-0.11.0.drv214  /nix/store/lbqp8bfrqa2xm82ma6wyq1gijyajh6kh-pg_net-0.13.0.drv215  /nix/store/rdglczxf0sk4hhwsppqw13zl43vf5wr0-pg_net-0.14.0.drv216  /nix/store/w7547z9slhcibw4s6cwkag6w1f49317s-pg_net-0.20.4.drv217  /nix/store/vvs47f973jig6lflvm7cidm6m20glpy5-pg_net.drv218  /nix/store/92dxzgq4qn1jl389a931z1n5n1a8s5ns-pg_hashids-1.3.0-cd0e1b31d52b394a0df64079406a14a4f7387cd6.drv219  /nix/store/x1kpz6n29pqn2xm06lprn5kwpr0pjhhx-pg_hashids.drv220  /nix/store/y1p5dlzmilwxqbf3a4c7hl6gp9p84wsl-pgmq-1.5.1.drv221  /nix/store/y5rgrfmhzrjr0j6zil7ksqdbcglh0s8i-pgmq.drv222  /nix/store/jk18akz00pd0nr1pixnq9550lnvycgar-pg_cron-1.6.4.drv223  /nix/store/ybhpqdys29q375m5pxxn2w3cbzgf3mxg-pg_cron.drv224  /nix/store/mpyn776iqdn7h94vlp5yxn83a0y4lchc-pgtap-1.3.3.drv225  /nix/store/psjbrnijdnpqyc9s718av7nwmyk0fays-pgtap-1.3.1.drv226  /nix/store/zf19xpsa8jj4bmx09awww0z16cm79z4g-pgtap.drv227  /nix/store/2fndab8axk4hz4s30ijaxnpa1bc9z1dc-postgresql-and-plugins-17_22.drv228  /nix/store/2h15dgac1417g71pjrb4aqcz8yabiv21-plpgsql_check-2.7.drv229  /nix/store/2i3blwmkdwv0753xgc4pb1rm16gk4jmv-wrappers-0.5.6.drv230  /nix/store/3bfr1qggn2db554518zgs8fpzyagvfrb-pg_jsonschema-0.3.3.drv231  /nix/store/2x6xkwfx99zhzhdbmhbrnifqf63l8ica-pg_jsonschema.drv232  /nix/store/381ghgpkv0l9lnv0f1v2jxfg04cspiih-rum-1.3.drv233  /nix/store/3dxfnbp09hx3zc5q8mmvb54v0nb1lrid-plpgsql_check-2.8.drv234  /nix/store/48mqx57r48j330b49mc32k7bvy6445c2-wal2json.drv235  /nix/store/4dv0hiafadp1s6dx9i8qfwajgh422j5n-pg_graphql-1.6.1.drv236  /nix/store/5ls8sxw33v0sm4agddi4xzky3nvhg3g7-index_advisor-0.2.0.drv237  /nix/store/83syfrxa296qd37cig3f07glk8hn533v-pg_stat_monitor.drv238  /nix/store/8szfd9ycs8amd9k5vlvg6prcijxwqr3j-hypopg.drv239  /nix/store/sww4kz29ir2aly4abpn3hb8zfqy4ak06-pg_cron-1.6.4.drv240  /nix/store/9w316phdvwdjv5875fpg98qwdi7hxzv5-pg_cron.drv241  /nix/store/f2nm4421r3k58c32661m7na2f1q95dbh-pgtap-1.3.1.drv242  /nix/store/k7h19a5nads14nh23z55wp7vpifpqdcg-pgtap-1.3.3.drv243  /nix/store/b3wykhrc5d96h1ddr0n8jc0vm6lda047-pgtap.drv244  /nix/store/msp1w36fm572jxlq4yj3ilwksxa0qpag-safeupdate-1.4.drv245  /nix/store/fl0xvi8swv20jz0vkfsm12znd6mp9naq-safeupdate.drv246  /nix/store/hnandxbj17d43iq41vk9jgn2mk94s7fg-index_advisor.drv247  /nix/store/5sxmls2c3rj1id1jy8cp90d7aga5vs9y-pg_graphql-1.5.9.drv248  /nix/store/6f7pk59bx81p58zx4lxc0kpr0a4pskc3-pg_graphql-1.5.11.drv249  /nix/store/kxm7a9483vsp4n6zn93isjb5z31l42fd-pg_graphql-1.6.2.drv250  /nix/store/k2r44m3w1mwab1ipx8m72764yyhxr38v-pg_graphql.drv251  /nix/store/k4lajdzpb6zgp35ib3yfg5hk7p7kj1z3-rum.drv252  /nix/store/8p8fsl25zwlaqwhknw8myg0lfhi6rhsg-wrappers-0.6.0.drv253  /nix/store/a9l3bgzraqwg33ax5gcmbqwrkrrxxnag-wrappers-0.4.5.drv254  /nix/store/fh5b65jxgdyzwrs2g7y12ffnk1yhxczn-wrappers-0.5.7.drv255  /nix/store/h81r7798azz2nz8s3pxp1drpa02ma2m8-wrappers-0.5.4.drv256  /nix/store/hlpygbdz705888l5vwvvnz96901jdbkn-wrappers-0.5.5.drv257  /nix/store/kcan9i952k07b3pm1fnq4s0f7pfn7yx9-wrappers-0.5.3.drv258  /nix/store/pvzl31ydc0nhwqmrw9agqqbmk4v4ycr8-wrappers-0.6.3.drv259  /nix/store/q0lgs5nhw27p302wa3gp300l19ad95f0-wrappers-0.4.4.drv260  /nix/store/rfn5rhjy53sq47kjz5qfawd9pz9a38l1-wrappers-0.5.0.drv261  /nix/store/sg3hglpfqxg0bdxvkn36jnvpd752brga-wrappers-0.4.6.drv262  /nix/store/sn2m8z01kbz72vbl839b4qdhql2lf67m-wrappers-0.6.1.drv263  /nix/store/w5gnd7pybydask3lizsy3lirm83jxx56-wrappers-0.6.2.drv264  /nix/store/kplnvybrmx8df99qr3hsafbkky7hfg3v-wrappers.drv265  /nix/store/ibl9nbmh9mbqgqqfkrq7vgqzbsxj392q-pgmq-1.5.1.drv266  /nix/store/kv8jjb4gkylvk18qlsxl5lp9k29b1d31-pgmq.drv267  /nix/store/hnhqkd9jnn7w4z0z0jacwjwg9x016gyl-pg_repack-1.5.0.drv268  /nix/store/rhyhx66rvbmsmh7i4xf5dqi3pr058hjr-pg_repack-1.5.1.drv269  /nix/store/x14ai73x9yl5ckncl830rpbqxpjvvbg5-pg_repack-1.5.2.drv270  /nix/store/m6b5d5vphi1v49cpgr7ff07zvzfri21p-pg_repack.drv271  /nix/store/q8n9c44w9m7lggw81a93q8rvr4jgmslx-plan_filter-0.1.drv272  /nix/store/n1y2c26wz7wmff6xrz6ggk6zvsgma4bk-plan_filter.drv273  /nix/store/8byjp94z4bcpvgpc2s8ga2rqg9c3xc55-pgrouting-3.4.1.drv274  /nix/store/qs7fc4p2b8g3zc4cd29vi1wck7acipz9-pgrouting.drv275  /nix/store/rqv928k6h7v2jlfgznn4wi7km7zvm5qk-pg_tle.drv276  /nix/store/v635079aqf2hhpg4xnhm2226g7khvdav-plpgsql_check.drv277  /nix/store/84hgdiz6hjkzk0cm5bd3vqsbx45n9zkh-vector-0.8.0.drv278  /nix/store/92n1zijp3izg793lrskmws7kyjz1xg5h-vector-0.6.2.drv279  /nix/store/bxnxr2z670m9ri1dc66149krs7h60dnc-vector-0.7.0.drv280  /nix/store/nyx1ahbyki15bmvygqzj2s1nnbmbi8ig-vector-0.7.4.drv281  /nix/store/s72y0nj96pwds84md5hz9x09cidw3azz-vector-0.6.0.drv282  /nix/store/wy228ccg72w2cv5rbhynqgmbxx7dqlws-vector-0.5.1.drv283  /nix/store/za0ss4y8awhkng526g581wdnh0azibcf-vector-0.8.2.drv284  /nix/store/x3iqn55b29mih079vypw11gf008gj74l-vector.drv285  /nix/store/6601flp9bdqz93g493ma3hhb95ia16fh-pgroonga-3.2.5.drv286  /nix/store/xkmdckj5hdcfgqlyjn2qq5vdv6s09h5a-pgroonga.drv287  /nix/store/al6g5cvx86v4ljmh3sg6hmlsl3ab3bwf-pg_net-0.20.3.drv288  /nix/store/b1pyvgjyn940h95bbnsp15qmb0qli5gd-pg_net-0.20.0.drv289  /nix/store/cl8ikglrq6jdd2cp01jad7n483mvqj8g-pg_net-0.11.0.drv290  /nix/store/g6nfp5n056kw2jvfzldzxrrrxfpfcka0-pg_net-0.13.0.drv291  /nix/store/xwiwd8fzjgv67zb2ji446a8vxjj3s7bs-pg_net-0.14.0.drv292  /nix/store/yf5z0qi17vprkjz68rqyp804sx929g9n-pg_net-0.19.5.drv293  /nix/store/y02vszvrhs7b6kn8llgwzdmnmhqiymzk-pg_net.drv294  /nix/store/k684vf2v1w6afbwv98r05j1f5hg9gw2f-pg_hashids-1.3.0-cd0e1b31d52b394a0df64079406a14a4f7387cd6.drv295  /nix/store/yi643dw2hzxidf2jf635pk0da5c4bs96-pg_hashids.drv296  /nix/store/mxhjb2qfqd8l49wakfpw5qiws2v1bcnn-gdal-3.8.5.drv297  /nix/store/mrfs1y0f5l367m93gpss7lp0jg6nz3bf-postgis-3.3.7.drv298  /nix/store/yskfmp4z518h4ff0mli70gsirhsli1ns-postgis.drv299  /nix/store/nj44phx30461wf1ac6n8fg8cc58agpgv-postgresql-and-plugins-17.11.drv300  /nix/store/rn61yq57k8lhdkx7al266vkbandycwv7-postgresql-and-plugins-17.11.drv301  /nix/store/czird9kid1f479i75r0fcy4ivzd3zzs8-system-path.drv302  /nix/store/i0ygxsqq6na1vsqmbklzxrj1xy5ypk6x-dbus-1.drv303  /nix/store/xnzsv2ymk0qx1fdsm8ssls8mlq8852wc-X-Restart-Triggers-dbus.drv304  /nix/store/5q0f5sx5mas5cc56azv1g9pm53yfrmgc-unit-dbus.service.drv305  /nix/store/a03cbyqm7arwjx83nc7jiwxkbbifg33w-user-units.drv306  /nix/store/acfna74pf7f063994dvxzqkrrhi623c4-unit-dbus.service.drv307  /nix/store/rjsqz027b1xj9q5dymzvs3wbqn2dv53m-postgresql-init.drv308  /nix/store/n0j0873l4a8mlkz6x1bffr3skhaarc7q-unit-postgresql.service.drv309  /nix/store/wmsihsmjyk0h8yjj86lpmijxpzqwk8gg-postgresql-migrate.drv310  /nix/store/pml1z1qw471w7nshf5dxp826pysqs3fz-unit-postgresql-migrate.service.drv311  /nix/store/vrslgxqykax3yi5mlrpiq0v1rq1ilnic-system-units.drv312  /nix/store/p6pnncmb31ibp4zxf61fbkkb0fmq4xai-etc.drv313  /nix/store/x6cijf4csfmd0dc8sqmiajj5dwi4h3dg-activate.drv314  /nix/store/cgyqy4j1g2s9zbh87ddwhr7wn9rssarl-nixos-system-server-test.drv315  /nix/store/i3fy4azgna3zl2za0k3pwx70f2sk6hk8-receipt.drv316  /nix/store/w85w5162f9zdpi7g98sjlk186hrrm57p-postgresql-and-plugins-17_22.drv317  /nix/store/amy1ji0k53n9qihnqys9hvlc60bncr1y-system-path.drv318  /nix/store/7ynly7nv4iq2wvhmmg6p100h3wr2dpxd-dbus-1.drv319  /nix/store/v749g53p5djbqg3y7kfvdsw5g535j0js-X-Restart-Triggers-dbus.drv320  /nix/store/n7wg70ga6zm8b0prwd4np0azpi732zji-unit-dbus.service.drv321  /nix/store/bmn9rg4vrb07wyj1ls41afzdzcmhdqcm-user-units.drv322  /nix/store/jika4rfg3aj00vq2nfqx2i6nild4nvd5-unit-dbus.service.drv323  /nix/store/8r4vw45si1w8qby225b0amhay9ybj6c5-postgresql-orioledb-init.drv324  /nix/store/pgysndf7sfj9ifxk4sy1w8qfx2ln1ws6-unit-postgresql.service.drv325  /nix/store/9i9flpkzn6d3cvhin3s644150jhvcazf-supabase-orioledb-db-init.drv326  /nix/store/s4qicdb2kbzvf3lf6m8xidm4lndgs2yl-unit-supabase-db-init.service.drv327  /nix/store/dgm1f7y3gvjqjfv7r4gfa7pjffgzr4nj-system-units.drv328  /nix/store/sc9b344gbckg6fqywin6bhhs882d6mxa-etc.drv329  /nix/store/k4pazrfsvz1hsx7l4d0jsxvan5b3dq49-activate.drv330  /nix/store/m7z7bg6jaainvrfsikwclppim5yf6kn3-nixos-system-server-test.drv331  /nix/store/70bg25srcrfnwivfph4bhslzhigdgpxw-unit-dbus.service.drv332  /nix/store/cpy2j0c5ribiykpjaig0axzryxzh1g69-user-units.drv333  /nix/store/qbfmigmm8fk4v5nhvb8h71hmhmdaky0g-supabase-db-init.drv334  /nix/store/ggfylf6a7iwk3pn3r08m30684z8rrq5l-unit-supabase-db-init.service.drv335  /nix/store/qsr1582sizlpmavcla4x0gbp3q52g4pd-unit-postgresql.service.drv336  /nix/store/ydkqsx664pp5ndcfl70c84mvxgixix01-system-units.drv337  /nix/store/y3dck3diii9z9x0w771pz541gjd0zwh3-etc.drv338  /nix/store/srl146pjpar66ijj6l2zw99pmy6wpkl9-activate.drv339  /nix/store/sjl12wxd1wb23d9hzlzyqrq731lbrgpb-nixos-system-server-test.drv340  /nix/store/qv2lxny9548lwqjzpi75n12qpyc0fm56-closure-info.drv341  /nix/store/8vx14rz8lihgxgq3s0daqnbhbvnsf97x-run-nixos-vm.drv342  /nix/store/63q2a748lli2nxvrk228r5l81997jmzh-nixos-vm.drv343  /nix/store/cphqrjpp5nssc3n7pm7aq9n5s2x9vsck-nixos-test-driver-pg_repack.drv344  /nix/store/ksq7dkc1zahmqyclmq35v3339bpsg0y0-vm-test-run-pg_repack.drv345building '/nix/store/v0mqjlj6j73wpc66h34djrv08j7q3l8w-pg_graphql-1.4.4.drv' on 'ssh-ng://nixbot-remote-build@78.232.36.247'346building '/nix/store/v0mqjlj6j73wpc66h34djrv08j7q3l8w-pg_graphql-1.4.4.drv'347pg_graphql-1.4.4> Running phase: unpackPhase348pg_graphql-1.4.4> unpacking source archive /nix/store/0dhlpj96hs5zcq34k2za8294cczzh0cx-source349pg_graphql-1.4.4> source root is source350pg_graphql-1.4.4> Executing cargoSetupPostUnpackHook351pg_graphql-1.4.4> Finished cargoSetupPostUnpackHook352pg_graphql-1.4.4> Running phase: patchPhase353pg_graphql-1.4.4> Executing cargoSetupPostPatchHook354pg_graphql-1.4.4> Validating consistency between /build/source/Cargo.lock and /build/cargo-vendor-dir/Cargo.lock355pg_graphql-1.4.4> Finished cargoSetupPostPatchHook356pg_graphql-1.4.4> Running phase: updateAutotoolsGnuConfigScriptsPhase357pg_graphql-1.4.4> Running phase: configurePhase358pg_graphql-1.4.4> Running phase: buildPhase359pg_graphql-1.4.4> Executing cargo-pgrx buildPhase360pg_graphql-1.4.4>    Validating /nix/store/48l45fvi99n90x6p9i4cs1lmzby6cb73-postgresql-15.19/bin/pg_config361pg_graphql-1.4.4>  Initializing data directory at /build/tmp.igZJh4IbNo/data-15362pg_graphql-1.4.4> waiting for server to start....2026-10-06 13:56:54.964 GMT [87] LOG:  starting PostgreSQL 15.19 on aarch64-unknown-linux-gnu, compiled by gcc (GCC) 15.2.0, 64-bit363pg_graphql-1.4.4> 2026-10-06 13:56:54.967 GMT [87] LOG:  listening on Unix socket "/build/tmp.Gdz2EsTBWl/.s.PGSQL.5432"364pg_graphql-1.4.4> 2026-10-06 13:56:54.976 GMT [90] LOG:  database system was shut down at 2026-10-06 13:56:54 GMT365pg_graphql-1.4.4> 2026-10-06 13:56:54.981 GMT [87] LOG:  database system is ready to accept connections366pg_graphql-1.4.4>  done367pg_graphql-1.4.4> server started368pg_graphql-1.4.4> createuser: error: connection to server at "localhost" (127.0.0.1), port 5432 failed: Connection refused369pg_graphql-1.4.4> 	Is the server running on that host and accepting TCP/IP connections?370pg_graphql-1.4.4> waiting for server to shut down....2026-10-06 13:56:55.049 GMT [87] LOG:  received fast shutdown request371pg_graphql-1.4.4> 2026-10-06 13:56:55.051 GMT [87] LOG:  aborting any active transactions372pg_graphql-1.4.4> 2026-10-06 13:56:55.053 GMT [87] LOG:  background worker "logical replication launcher" (PID 93) exited with exit code 1373pg_graphql-1.4.4> 2026-10-06 13:56:55.055 GMT [88] LOG:  shutting down374pg_graphql-1.4.4> 2026-10-06 13:56:55.057 GMT [88] LOG:  checkpoint starting: shutdown immediate375pg_graphql-1.4.4> 2026-10-06 13:56:55.071 GMT [88] LOG:  checkpoint complete: wrote 3 buffers (0.0%); 0 WAL file(s) added, 0 removed, 0 recycled; write=0.004 s, sync=0.002 s, total=0.016 s; sync files=2, longest=0.002 s, average=0.001 s; distance=0 kB, estimate=0 kB376pg_graphql-1.4.4> 2026-10-06 13:56:55.075 GMT [87] LOG:  database system is shut down377pg_graphql-1.4.4>  done378pg_graphql-1.4.4> server stopped379pg_graphql-1.4.4>        Using PgConfig("pg15") and `pg_config` from /nix/store/48l45fvi99n90x6p9i4cs1lmzby6cb73-postgresql-15.19/bin/pg_config380pg_graphql-1.4.4>     Building extension with features  pg15381pg_graphql-1.4.4>      Running command "/nix/store/kmjm2xvp081ivprjgw95k94xmq1iswls-rust-default-1.70.0/bin/cargo" "build" "--release" "--features" " pg15" "--no-default-features" "--message-format=json-render-diagnostics" "--frozen" "-j" "2"382pg_graphql-1.4.4>    Compiling proc-macro2 v1.0.75383pg_graphql-1.4.4>    Compiling unicode-ident v1.0.12384pg_graphql-1.4.4>    Compiling libc v0.2.151385pg_graphql-1.4.4>    Compiling syn v1.0.109386pg_graphql-1.4.4>    Compiling memchr v2.7.1387pg_graphql-1.4.4>    Compiling quote v1.0.35388pg_graphql-1.4.4>    Compiling thiserror v1.0.56389pg_graphql-1.4.4>    Compiling syn v2.0.48390pg_graphql-1.4.4>    Compiling serde v1.0.194391pg_graphql-1.4.4>    Compiling hashbrown v0.14.3392pg_graphql-1.4.4>    Compiling eyre v0.6.11393pg_graphql-1.4.4>    Compiling equivalent v1.0.1394pg_graphql-1.4.4>    Compiling indexmap v2.1.0395pg_graphql-1.4.4>    Compiling serde_derive v1.0.194396pg_graphql-1.4.4>    Compiling thiserror-impl v1.0.56397pg_graphql-1.4.4>    Compiling serde_json v1.0.111398pg_graphql-1.4.4>    Compiling cfg-if v1.0.0399pg_graphql-1.4.4>    Compiling tinyvec_macros v0.1.1400pg_graphql-1.4.4>    Compiling glob v0.3.1401pg_graphql-1.4.4>    Compiling clang-sys v1.7.0402pg_graphql-1.4.4>    Compiling tinyvec v1.6.0403pg_graphql-1.4.4>    Compiling ucd-trie v0.1.6404pg_graphql-1.4.4>    Compiling indenter v0.3.3405pg_graphql-1.4.4>    Compiling winnow v0.5.32406pg_graphql-1.4.4>    Compiling toml_datetime v0.6.5407pg_graphql-1.4.4>    Compiling serde_spanned v0.6.5408pg_graphql-1.4.4>    Compiling anyhow v1.0.79409pg_graphql-1.4.4>    Compiling once_cell v1.19.0410pg_graphql-1.4.4>    Compiling pest v2.7.6411pg_graphql-1.4.4>    Compiling toml_edit v0.21.0412pg_graphql-1.4.4>    Compiling unicode-normalization v0.1.22413pg_graphql-1.4.4>    Compiling unicode-bidi v0.3.14414pg_graphql-1.4.4>    Compiling percent-encoding v2.3.1415pg_graphql-1.4.4>    Compiling semver v1.0.21416pg_graphql-1.4.4>    Compiling regex-syntax v0.8.2417pg_graphql-1.4.4>    Compiling option-ext v0.2.0418pg_graphql-1.4.4>    Compiling minimal-lexical v0.2.1419pg_graphql-1.4.4>    Compiling nom v7.1.3420pg_graphql-1.4.4>    Compiling regex-automata v0.4.3421pg_graphql-1.4.4>    Compiling dirs-sys v0.4.1422pg_graphql-1.4.4>    Compiling form_urlencoded v1.2.1423pg_graphql-1.4.4>    Compiling libloading v0.8.1424pg_graphql-1.4.4>    Compiling idna v0.5.0425pg_graphql-1.4.4>    Compiling toml v0.8.8426pg_graphql-1.4.4>    Compiling semver-parser v0.10.2427pg_graphql-1.4.4>    Compiling ryu v1.0.16428pg_graphql-1.4.4>    Compiling itoa v1.0.10429pg_graphql-1.4.4>    Compiling bindgen v0.68.1430pg_graphql-1.4.4>    Compiling pathsearch v0.2.0431pg_graphql-1.4.4>    Compiling semver v0.11.0432pg_graphql-1.4.4>    Compiling cargo_toml v0.16.3433pg_graphql-1.4.4>    Compiling url v2.5.0434pg_graphql-1.4.4>    Compiling regex v1.10.2435pg_graphql-1.4.4>    Compiling dirs v5.0.1436pg_graphql-1.4.4>    Compiling cexpr v0.6.0437pg_graphql-1.4.4>    Compiling getrandom v0.2.11438pg_graphql-1.4.4>    Compiling fixedbitset v0.4.2439pg_graphql-1.4.4>    Compiling shlex v1.2.0440pg_graphql-1.4.4>    Compiling lazycell v1.3.0441pg_graphql-1.4.4>    Compiling ident_case v1.0.1442pg_graphql-1.4.4>    Compiling bitflags v2.4.1443pg_graphql-1.4.4>    Compiling same-file v1.0.6444pg_graphql-1.4.4>    Compiling strsim v0.10.0445pg_graphql-1.4.4>    Compiling peeking_take_while v0.1.2446pg_graphql-1.4.4>    Compiling unicode-segmentation v1.10.1447pg_graphql-1.4.4>    Compiling autocfg v1.1.0448pg_graphql-1.4.4>    Compiling byteorder v1.5.0449pg_graphql-1.4.4>    Compiling lazy_static v1.4.0450pg_graphql-1.4.4>    Compiling rustc-hash v1.1.0451pg_graphql-1.4.4>    Compiling fnv v1.0.7452pg_graphql-1.4.4>    Compiling owo-colors v3.5.0453pg_graphql-1.4.4>    Compiling pgrx-pg-config v0.11.2454pg_graphql-1.4.4>    Compiling darling_core v0.14.4455pg_graphql-1.4.4>    Compiling memoffset v0.9.0456pg_graphql-1.4.4>    Compiling convert_case v0.6.0457pg_graphql-1.4.4>    Compiling walkdir v2.4.0458pg_graphql-1.4.4>    Compiling petgraph v0.6.4459pg_graphql-1.4.4>    Compiling rustc_version v0.4.0460pg_graphql-1.4.4>    Compiling rustc_version v0.3.3461pg_graphql-1.4.4>    Compiling unescape v0.1.0462pg_graphql-1.4.4>    Compiling radium v0.7.0463pg_graphql-1.4.4>    Compiling pgrx-pg-sys v0.11.2464pg_graphql-1.4.4>    Compiling pgrx-sql-entity-graph v0.11.2465pg_graphql-1.4.4>    Compiling atomic-traits v0.3.0466pg_graphql-1.4.4>    Compiling heapless v0.7.17467pg_graphql-1.4.4>    Compiling darling_macro v0.14.4468pg_graphql-1.4.4>    Compiling either v1.9.0469pg_graphql-1.4.4>    Compiling tap v1.0.1470pg_graphql-1.4.4>    Compiling void v1.0.2471pg_graphql-1.4.4>    Compiling unreachable v1.0.0472pg_graphql-1.4.4>    Compiling wyz v0.5.1473pg_graphql-1.4.4>    Compiling darling v0.14.4474pg_graphql-1.4.4>    Compiling pgrx-macros v0.11.2475pg_graphql-1.4.4>    Compiling hash32 v0.2.1476pg_graphql-1.4.4>    Compiling rand_core v0.6.4477pg_graphql-1.4.4>    Compiling enum-map-derive v0.17.0478pg_graphql-1.4.4>    Compiling half v1.8.2479pg_graphql-1.4.4>    Compiling ppv-lite86 v0.2.17480pg_graphql-1.4.4>    Compiling funty v2.0.0481pg_graphql-1.4.4>    Compiling stable_deref_trait v1.2.0482pg_graphql-1.4.4>    Compiling sptr v0.3.2483pg_graphql-1.4.4>    Compiling ascii v0.9.3484pg_graphql-1.4.4>    Compiling combine v3.8.1485pg_graphql-1.4.4>    Compiling bitvec v1.0.1486pg_graphql-1.4.4>    Compiling rand_chacha v0.3.1487pg_graphql-1.4.4>    Compiling serde_cbor v0.11.2488pg_graphql-1.4.4>    Compiling enum-map v2.7.3489pg_graphql-1.4.4>    Compiling cached_proc_macro v0.18.1490pg_graphql-1.4.4>    Compiling uuid v1.6.1491pg_graphql-1.4.4>    Compiling instant v0.1.12492pg_graphql-1.4.4>    Compiling seahash v4.1.0493pg_graphql-1.4.4>    Compiling cached_proc_macro_types v0.1.0494pg_graphql-1.4.4>    Compiling seq-macro v0.3.5495pg_graphql-1.4.4>    Compiling cached v0.46.1496pg_graphql-1.4.4>    Compiling rand v0.8.5497pg_graphql-1.4.4>    Compiling graphql-parser v0.4.0498pg_graphql-1.4.4>    Compiling pgrx v0.11.2499pg_graphql-1.4.4>    Compiling itertools v0.10.5500pg_graphql-1.4.4>    Compiling bimap v0.6.3501pg_graphql-1.4.4>    Compiling base64 v0.13.1502building '/nix/store/0wbkhlgz00c1nhm74adar4kk6dbid1dq-pg_graphql-1.5.11.drv' on 'ssh-ng://nixbot-remote-build@78.232.36.247'503building '/nix/store/0wbkhlgz00c1nhm74adar4kk6dbid1dq-pg_graphql-1.5.11.drv'504pg_graphql-1.5.11> Running phase: unpackPhase505pg_graphql-1.5.11> unpacking source archive /nix/store/7fifqwfl0gqcak1a1lqswmmpjpj11rag-source506pg_graphql-1.5.11> source root is source507pg_graphql-1.5.11> Executing cargoSetupPostUnpackHook508pg_graphql-1.5.11> Finished cargoSetupPostUnpackHook509pg_graphql-1.5.11> Running phase: patchPhase510pg_graphql-1.5.11> Executing cargoSetupPostPatchHook511pg_graphql-1.5.11> Validating consistency between /build/source/Cargo.lock and /build/cargo-vendor-dir/Cargo.lock512pg_graphql-1.5.11> Finished cargoSetupPostPatchHook513pg_graphql-1.5.11> Running phase: updateAutotoolsGnuConfigScriptsPhase514pg_graphql-1.5.11> Running phase: configurePhase515pg_graphql-1.5.11> Running phase: buildPhase516pg_graphql-1.5.11> Executing cargo-pgrx buildPhase517pg_graphql-1.5.11>    Validating /nix/store/wq2kfr0rkb0hdmf1iwi3mi8pxycakzmq-postgresql-17_22/bin/pg_config518pg_graphql-1.5.11>  Initializing data directory at /build/tmp.D3cQtO9aGw/data-17519pg_graphql-1.5.11> waiting for server to start....2026-10-06 14:05:21.290 GMT [73] LOG:  starting PostgreSQL 17.11 on aarch64-unknown-linux-gnu, compiled by gcc (GCC) 15.2.0, 64-bit520pg_graphql-1.5.11> 2026-10-06 14:05:21.294 GMT [73] LOG:  listening on Unix socket "/build/tmp.M99gvNR4YP/.s.PGSQL.5432"521pg_graphql-1.5.11> 2026-10-06 14:05:21.306 GMT [76] LOG:  database system was shut down at 2026-10-06 14:05:20 GMT522pg_graphql-1.5.11> 2026-10-06 14:05:21.312 GMT [73] LOG:  database system is ready to accept connections523pg_graphql-1.5.11>  done524pg_graphql-1.5.11> server started525pg_graphql-1.5.11> createuser: error: connection to server at "localhost" (127.0.0.1), port 5432 failed: Connection refused526pg_graphql-1.5.11> 	Is the server running on that host and accepting TCP/IP connections?527pg_graphql-1.5.11> waiting for server to shut down....2026-10-06 14:05:21.375 GMT [73] LOG:  received fast shutdown request528pg_graphql-1.5.11> 2026-10-06 14:05:21.378 GMT [73] LOG:  aborting any active transactions529pg_graphql-1.5.11> 2026-10-06 14:05:21.380 GMT [73] LOG:  background worker "logical replication launcher" (PID 79) exited with exit code 1530pg_graphql-1.5.11> 2026-10-06 14:05:21.380 GMT [74] LOG:  shutting down531pg_graphql-1.5.11> 2026-10-06 14:05:21.382 GMT [74] LOG:  checkpoint starting: shutdown immediate532pg_graphql-1.5.11> 2026-10-06 14:05:21.404 GMT [74] LOG:  checkpoint complete: wrote 3 buffers (0.0%); 0 WAL file(s) added, 0 removed, 0 recycled; write=0.008 s, sync=0.002 s, total=0.024 s; sync files=2, longest=0.001 s, average=0.001 s; distance=0 kB, estimate=0 kB; lsn=0/14EC910, redo lsn=0/14EC910533pg_graphql-1.5.11> 2026-10-06 14:05:21.408 GMT [73] LOG:  database system is shut down534pg_graphql-1.5.11>  done535pg_graphql-1.5.11> server stopped536pg_graphql-1.5.11>        Using PgConfig("pg17") and `pg_config` from /nix/store/wq2kfr0rkb0hdmf1iwi3mi8pxycakzmq-postgresql-17_22/bin/pg_config537pg_graphql-1.5.11>     Building extension with features  pg17538pg_graphql-1.5.11>      Running command "/nix/store/hxlcfmjxs6akpyya3k1d4qk1ghbw11ij-rust-default-1.81.0/bin/cargo" "build" "--lib" "--release" "--features" " pg17" "--no-default-features" "--message-format=json-render-diagnostics" "--frozen" "-j" "2"539pg_graphql-1.5.11>    Compiling proc-macro2 v1.0.93540pg_graphql-1.5.11>    Compiling unicode-ident v1.0.16541pg_graphql-1.5.11>    Compiling libc v0.2.169542pg_graphql-1.5.11>    Compiling stable_deref_trait v1.2.0543pg_graphql-1.5.11>    Compiling memchr v2.7.4544pg_graphql-1.5.11>    Compiling quote v1.0.38545pg_graphql-1.5.11>    Compiling syn v2.0.98546pg_graphql-1.5.11>    Compiling thiserror v1.0.69547pg_graphql-1.5.11>    Compiling writeable v0.5.5548pg_graphql-1.5.11>    Compiling serde v1.0.217549pg_graphql-1.5.11>    Compiling litemap v0.7.4550pg_graphql-1.5.11>    Compiling eyre v0.6.12551pg_graphql-1.5.11>    Compiling hashbrown v0.15.2552pg_graphql-1.5.11>    Compiling equivalent v1.0.1553pg_graphql-1.5.11>    Compiling indexmap v2.7.1554pg_graphql-1.5.11>    Compiling icu_locid_transform_data v1.5.0555pg_graphql-1.5.11>    Compiling icu_properties_data v1.5.0556pg_graphql-1.5.11>    Compiling glob v0.3.2557pg_graphql-1.5.11>    Compiling utf16_iter v1.0.5558pg_graphql-1.5.11>    Compiling synstructure v0.13.1559pg_graphql-1.5.11>    Compiling smallvec v1.13.2560pg_graphql-1.5.11>    Compiling utf8_iter v1.0.4561pg_graphql-1.5.11>    Compiling icu_normalizer_data v1.5.0562pg_graphql-1.5.11>    Compiling write16 v1.0.0563pg_graphql-1.5.11>    Compiling thiserror v2.0.11564pg_graphql-1.5.11>    Compiling shlex v1.3.0565pg_graphql-1.5.11>    Compiling serde_json v1.0.138566pg_graphql-1.5.11>    Compiling clang-sys v1.8.1567pg_graphql-1.5.11>    Compiling indenter v0.3.3568pg_graphql-1.5.11>    Compiling winnow v0.7.0569pg_graphql-1.5.11>    Compiling zerofrom-derive v0.1.5570pg_graphql-1.5.11>    Compiling yoke-derive v0.7.5571pg_graphql-1.5.11>    Compiling zerofrom v0.1.5572pg_graphql-1.5.11>    Compiling serde_derive v1.0.217573pg_graphql-1.5.11>    Compiling yoke v0.7.5574pg_graphql-1.5.11>    Compiling zerovec-derive v0.10.3575pg_graphql-1.5.11>    Compiling zerovec v0.10.4576pg_graphql-1.5.11>    Compiling displaydoc v0.2.5577pg_graphql-1.5.11>    Compiling tinystr v0.7.6578pg_graphql-1.5.11>    Compiling icu_locid v1.5.0579pg_graphql-1.5.11>    Compiling icu_provider_macros v1.5.0580pg_graphql-1.5.11>    Compiling thiserror-impl v1.0.69581pg_graphql-1.5.11>    Compiling icu_provider v1.5.0582pg_graphql-1.5.11>    Compiling icu_locid_transform v1.5.0583pg_graphql-1.5.11>    Compiling icu_collections v1.5.0584pg_graphql-1.5.11>    Compiling icu_properties v1.5.1585pg_graphql-1.5.11>    Compiling serde_spanned v0.6.8586pg_graphql-1.5.11>    Compiling toml_datetime v0.6.8587pg_graphql-1.5.11>    Compiling thiserror-impl v2.0.11588pg_graphql-1.5.11>    Compiling icu_normalizer v1.5.0589pg_graphql-1.5.11>    Compiling anyhow v1.0.95590pg_graphql-1.5.11>    Compiling is_ci v1.2.0591pg_graphql-1.5.11>    Compiling cfg-if v1.0.0592pg_graphql-1.5.11>    Compiling once_cell v1.20.2593pg_graphql-1.5.11>    Compiling idna_adapter v1.2.0594pg_graphql-1.5.11>    Compiling toml_edit v0.22.23595pg_graphql-1.5.11>    Compiling cc v1.2.11596pg_graphql-1.5.11>    Compiling is-terminal v0.4.15597pg_graphql-1.5.11>    Compiling owo-colors v4.1.0598pg_graphql-1.5.11>    Compiling percent-encoding v2.3.1599pg_graphql-1.5.11>    Compiling minimal-lexical v0.2.1600pg_graphql-1.5.11>    Compiling ucd-trie v0.1.7601pg_graphql-1.5.11>    Compiling regex-syntax v0.8.5602pg_graphql-1.5.11>    Compiling pest v2.7.15603pg_graphql-1.5.11>    Compiling regex-automata v0.4.9604pg_graphql-1.5.11>    Compiling nom v7.1.3605pg_graphql-1.5.11>    Compiling form_urlencoded v1.2.1606pg_graphql-1.5.11>    Compiling libloading v0.8.6607pg_graphql-1.5.11>    Compiling supports-color v2.1.0608pg_graphql-1.5.11>    Compiling toml v0.8.19609pg_graphql-1.5.11>    Compiling idna v1.0.3610pg_graphql-1.5.11>    Compiling supports-color v3.0.2611pg_graphql-1.5.11>    Compiling itoa v1.0.14612pg_graphql-1.5.11>    Compiling syn v1.0.109613pg_graphql-1.5.11>    Compiling bindgen v0.70.1614pg_graphql-1.5.11>    Compiling yansi-term v0.1.2615pg_graphql-1.5.11>    Compiling ryu v1.0.19616pg_graphql-1.5.11>    Compiling either v1.13.0617pg_graphql-1.5.11>    Compiling byteorder v1.5.0618pg_graphql-1.5.11>    Compiling unicode-width v0.1.14619pg_graphql-1.5.11>    Compiling itertools v0.13.0620pg_graphql-1.5.11>    Compiling annotate-snippets v0.9.2621pg_graphql-1.5.11>    Compiling pathsearch v0.2.0622pg_graphql-1.5.11>    Compiling cargo_toml v0.19.2623pg_graphql-1.5.11>    Compiling url v2.5.4624pg_graphql-1.5.11>    Compiling cexpr v0.6.0625pg_graphql-1.5.11>    Compiling regex v1.11.1626pg_graphql-1.5.11>    Compiling semver-parser v0.10.3627pg_graphql-1.5.11>    Compiling rustc-hash v1.1.0628pg_graphql-1.5.11>    Compiling same-file v1.0.6629pg_graphql-1.5.11>    Compiling home v0.5.11630pg_graphql-1.5.11>    Compiling bitflags v2.8.0631pg_graphql-1.5.11>    Compiling pgrx-pg-config v0.12.9632pg_graphql-1.5.11>    Compiling walkdir v2.5.0633pg_graphql-1.5.11>    Compiling semver v0.11.0634pg_graphql-1.4.4>    Compiling pg_graphql v1.4.4 (/build/source)635pg_graphql-1.5.11>    Compiling getrandom v0.2.15636pg_graphql-1.5.11>    Compiling strsim v0.10.0637pg_graphql-1.5.11>    Compiling fixedbitset v0.4.2638pg_graphql-1.5.11>    Compiling fnv v1.0.7639pg_graphql-1.5.11>    Compiling unicode-segmentation v1.12.0640pg_graphql-1.5.11>    Compiling ident_case v1.0.1641pg_graphql-1.5.11>    Compiling convert_case v0.6.0642pg_graphql-1.5.11>    Compiling darling_core v0.14.4643pg_graphql-1.5.11>    Compiling petgraph v0.6.5644pg_graphql-1.5.11>    Compiling rustc_version v0.3.3645pg_graphql-1.5.11>    Compiling pgrx-bindgen v0.12.9646pg_graphql-1.5.11>    Compiling cee-scape v0.2.0647pg_graphql-1.5.11>    Compiling zerocopy-derive v0.7.35648pg_graphql-1.5.11>    Compiling radium v0.7.0649pg_graphql-1.5.11>    Compiling unescape v0.1.0650pg_graphql-1.5.11>    Compiling pgrx-sql-entity-graph v0.12.9651pg_graphql-1.5.11>    Compiling zerocopy v0.7.35652pg_graphql-1.5.11>    Compiling pgrx-pg-sys v0.12.9653pg_graphql-1.5.11>    Compiling atomic-traits v0.3.0654pg_graphql-1.5.11>    Compiling darling_macro v0.14.4655pg_graphql-1.5.11>    Compiling tap v1.0.1656pg_graphql-1.5.11>    Compiling heapless v0.8.0657pg_graphql-1.5.11>    Compiling wyz v0.5.1658pg_graphql-1.5.11>    Compiling darling v0.14.4659pg_graphql-1.5.11>    Compiling pgrx-macros v0.12.9660pg_graphql-1.5.11>    Compiling ppv-lite86 v0.2.20661pg_graphql-1.5.11>    Compiling rand_core v0.6.4662pg_graphql-1.5.11>    Compiling hash32 v0.3.1663pg_graphql-1.5.11>    Compiling enum-map-derive v0.17.0664pg_graphql-1.5.11>    Compiling half v1.8.3665pg_graphql-1.5.11>    Compiling funty v2.0.0666pg_graphql-1.5.11>    Compiling bytes v1.10.0667pg_graphql-1.5.11>    Compiling sptr v0.3.2668pg_graphql-1.5.11>    Compiling combine v4.6.7669pg_graphql-1.5.11>    Compiling bitvec v1.0.1670pg_graphql-1.5.11>    Compiling serde_cbor v0.11.2671pg_graphql-1.5.11>    Compiling enum-map v2.7.3672pg_graphql-1.5.11>    Compiling rand_chacha v0.3.1673pg_graphql-1.5.11>    Compiling cached_proc_macro v0.18.1674pg_graphql-1.5.11>    Compiling uuid v1.12.1675pg_graphql-1.5.11>    Compiling instant v0.1.13676pg_graphql-1.5.11>    Compiling cached_proc_macro_types v0.1.1677pg_graphql-1.5.11>    Compiling hashbrown v0.14.5678pg_graphql-1.5.11>    Compiling seahash v4.1.0679pg_graphql-1.5.11>    Compiling cached v0.46.1680pg_graphql-1.5.11>    Compiling itertools v0.10.5681pg_graphql-1.5.11>    Compiling rand v0.8.5682pg_graphql-1.5.11>    Compiling graphql-parser v0.4.1683pg_graphql-1.5.11>    Compiling bimap v0.6.3684pg_graphql-1.5.11>    Compiling lazy_static v1.5.0685pg_graphql-1.5.11>    Compiling base64 v0.13.1686pg_graphql-1.5.11>    Compiling pgrx v0.12.9687pg_graphql-1.4.4>     Finished release [optimized] target(s) in 11m 44s688pg_graphql-1.4.4>   Installing extension689pg_graphql-1.4.4>      Copying control file to /nix/store/hyw1qcydkijl3gg63d8n161v8ha50a8c-pg_graphql-1.4.4/nix/store/48l45fvi99n90x6p9i4cs1lmzby6cb73-postgresql-15.19/share/postgresql/extension/pg_graphql.control690pg_graphql-1.4.4>      Copying shared library to /nix/store/hyw1qcydkijl3gg63d8n161v8ha50a8c-pg_graphql-1.4.4/nix/store/k4dpm55d68aq0df72hjk046xy1124lhn-postgresql-15.19-lib/lib/pg_graphql.so691pg_graphql-1.4.4>  Discovering SQL entities692pg_graphql-1.4.4>   Discovered 5 SQL entities: 0 schemas (0 unique), 1 functions, 0 types, 0 enums, 4 sqls, 0 ords, 0 hashes, 0 aggregates, 0 triggers693pg_graphql-1.4.4>      Writing SQL entities to /nix/store/hyw1qcydkijl3gg63d8n161v8ha50a8c-pg_graphql-1.4.4/nix/store/48l45fvi99n90x6p9i4cs1lmzby6cb73-postgresql-15.19/share/postgresql/extension/pg_graphql--1.4.4.sql694pg_graphql-1.4.4>     Finished installing pg_graphql695pg_graphql-1.4.4> buildPhase completed in 12 minutes 3 seconds696pg_graphql-1.4.4> Running phase: checkPhase697pg_graphql-1.4.4>    Validating /nix/store/48l45fvi99n90x6p9i4cs1lmzby6cb73-postgresql-15.19/bin/pg_config698pg_graphql-1.4.4>  Initializing data directory at /build/tmp.24hURcXP2P/data-15699pg_graphql-1.4.4> waiting for server to start....2026-10-06 14:08:58.096 GMT [2798] LOG:  starting PostgreSQL 15.19 on aarch64-unknown-linux-gnu, compiled by gcc (GCC) 15.2.0, 64-bit700pg_graphql-1.4.4> 2026-10-06 14:08:58.100 GMT [2798] LOG:  listening on Unix socket "/build/tmp.6rfOqfFxfI/.s.PGSQL.5432"701pg_graphql-1.4.4> 2026-10-06 14:08:58.109 GMT [2801] LOG:  database system was shut down at 2026-10-06 14:08:57 GMT702pg_graphql-1.4.4> 2026-10-06 14:08:58.116 GMT [2798] LOG:  database system is ready to accept connections703pg_graphql-1.4.4>  done704pg_graphql-1.4.4> server started705pg_graphql-1.4.4> createuser: error: connection to server at "localhost" (127.0.0.1), port 5432 failed: Connection refused706pg_graphql-1.4.4> 	Is the server running on that host and accepting TCP/IP connections?707pg_graphql-1.4.4> waiting for server to shut down....2026-10-06 14:08:58.182 GMT [2798] LOG:  received fast shutdown request708pg_graphql-1.4.4> 2026-10-06 14:08:58.185 GMT [2798] LOG:  aborting any active transactions709pg_graphql-1.4.4> 2026-10-06 14:08:58.187 GMT [2798] LOG:  background worker "logical replication launcher" (PID 2804) exited with exit code 1710pg_graphql-1.4.4> 2026-10-06 14:08:58.188 GMT [2799] LOG:  shutting down711pg_graphql-1.4.4> 2026-10-06 14:08:58.190 GMT [2799] LOG:  checkpoint starting: shutdown immediate712pg_graphql-1.4.4> 2026-10-06 14:08:58.214 GMT [2799] LOG:  checkpoint complete: wrote 3 buffers (0.0%); 0 WAL file(s) added, 0 removed, 0 recycled; write=0.009 s, sync=0.004 s, total=0.027 s; sync files=2, longest=0.002 s, average=0.002 s; distance=0 kB, estimate=0 kB713pg_graphql-1.4.4> 2026-10-06 14:08:58.218 GMT [2798] LOG:  database system is shut down714pg_graphql-1.4.4>  done715pg_graphql-1.4.4> server stopped716pg_graphql-1.4.4>    Validating /build/tmp.Et2fFu1GyN/15/bin/pg_config717pg_graphql-1.4.4>  Initializing data directory at /build/tmp.Et2fFu1GyN/data-15718pg_graphql-1.4.4>        Using PgConfig("pg15") and `pg_config` from /build/tmp.Et2fFu1GyN/15/bin/pg_config719pg_graphql-1.4.4>     Building extension with features pg15720pg_graphql-1.4.4>      Running command "/nix/store/kmjm2xvp081ivprjgw95k94xmq1iswls-rust-default-1.70.0/bin/cargo" "build" "--release" "--features" "pg15" "--no-default-features" "--message-format=json-render-diagnostics" "--frozen" "-j" "2"721pg_graphql-1.4.4>     Finished release [optimized] target(s) in 0.13s722pg_graphql-1.4.4>   Installing extension723pg_graphql-1.4.4>      Copying control file to /build/tmp.Et2fFu1GyN/15/share/postgresql/extension/pg_graphql.control724pg_graphql-1.4.4>      Copying shared library to /build/tmp.Et2fFu1GyN/15/lib/pg_graphql.so725pg_graphql-1.4.4>  Discovering SQL entities726pg_graphql-1.5.11>    Compiling pg_graphql v1.5.11 (/build/source)727pg_graphql-1.4.4>   Discovered 5 SQL entities: 0 schemas (0 unique), 1 functions, 0 types, 0 enums, 4 sqls, 0 ords, 0 hashes, 0 aggregates, 0 triggers728pg_graphql-1.4.4>      Writing SQL entities to /build/tmp.Et2fFu1GyN/15/share/postgresql/extension/pg_graphql--1.4.4.sql729pg_graphql-1.4.4>     Finished installing pg_graphql730pg_graphql-1.4.4> ++ mktemp -d731pg_graphql-1.4.4> + TMPDIR=/build/tmp.CGKIJFPjWL732pg_graphql-1.4.4> + export PGDATA=/build/tmp.CGKIJFPjWL733pg_graphql-1.4.4> + PGDATA=/build/tmp.CGKIJFPjWL734pg_graphql-1.4.4> + export PGHOST=/build/tmp.CGKIJFPjWL735pg_graphql-1.4.4> + PGHOST=/build/tmp.CGKIJFPjWL736pg_graphql-1.4.4> + export PGUSER=postgres737pg_graphql-1.4.4> + PGUSER=postgres738pg_graphql-1.4.4> + export PGDATABASE=postgres739pg_graphql-1.4.4> + PGDATABASE=postgres740pg_graphql-1.4.4> + export PGTZ=UTC741pg_graphql-1.4.4> + PGTZ=UTC742pg_graphql-1.4.4> + export PG_COLOR=auto743pg_graphql-1.4.4> + PG_COLOR=auto744pg_graphql-1.4.4> + trap 'pg_ctl stop -m i' sigint sigterm exit745pg_graphql-1.4.4> + rm -rf /build/tmp.CGKIJFPjWL746pg_graphql-1.4.4> + initdb --no-locale --encoding=UTF8 --nosync -U postgres747pg_graphql-1.4.4> The files belonging to this database system will be owned by user "nixbld".748pg_graphql-1.4.4> This user must also own the server process.749pg_graphql-1.4.4> 750pg_graphql-1.4.4> The database cluster will be initialized with locale "C".751pg_graphql-1.4.4> The default text search configuration will be set to "english".752pg_graphql-1.4.4> 753pg_graphql-1.4.4> Data page checksums are disabled.754pg_graphql-1.4.4> 755pg_graphql-1.4.4> creating directory /build/tmp.CGKIJFPjWL ... ok756pg_graphql-1.4.4> creating subdirectories ... ok757pg_graphql-1.4.4> selecting dynamic shared memory implementation ... posix758pg_graphql-1.4.4> selecting default max_connections ... 100759pg_graphql-1.4.4> selecting default shared_buffers ... 128MB760pg_graphql-1.4.4> selecting default time zone ... UTC761pg_graphql-1.4.4> creating configuration files ... ok762pg_graphql-1.4.4> running bootstrap script ... ok763pg_graphql-1.4.4> performing post-bootstrap initialization ... ok764pg_graphql-1.4.4> 765pg_graphql-1.4.4> Sync to disk skipped.766pg_graphql-1.4.4> The data directory might become corrupt if the operating system crashes.767pg_graphql-1.4.4> 768pg_graphql-1.4.4> initdb: warning: enabling "trust" authentication for local connections769pg_graphql-1.4.4> initdb: hint: You can change this by editing pg_hba.conf or using the option -A, or --auth-local and --auth-host, the next time you run initdb.770pg_graphql-1.4.4> 771pg_graphql-1.4.4> Success. You can now start the database server using:772pg_graphql-1.4.4> 773pg_graphql-1.4.4>     /build/tmp.Et2fFu1GyN/15/bin/pg_ctl -D /build/tmp.CGKIJFPjWL -l logfile start774pg_graphql-1.4.4> 775pg_graphql-1.4.4> + pg_ctl start -o '-F -c listen_addresses="" -c log_min_messages=WARNING -k /build/tmp.CGKIJFPjWL'776pg_graphql-1.4.4> waiting for server to start....2026-10-06 14:09:17.313 UTC [2889] LOG:  starting PostgreSQL 15.19 on aarch64-unknown-linux-gnu, compiled by gcc (GCC) 15.2.0, 64-bit777pg_graphql-1.4.4> 2026-10-06 14:09:17.313 UTC [2889] LOG:  listening on Unix socket "/build/tmp.CGKIJFPjWL/.s.PGSQL.5432"778pg_graphql-1.4.4> 2026-10-06 14:09:17.315 UTC [2892] LOG:  database system was shut down at 2026-10-06 14:09:17 UTC779pg_graphql-1.4.4> 2026-10-06 14:09:17.319 UTC [2889] LOG:  database system is ready to accept connections780pg_graphql-1.4.4>  done781pg_graphql-1.4.4> server started782pg_graphql-1.4.4> + createdb contrib_regression783pg_graphql-1.4.4> + TESTDIR=test784pg_graphql-1.4.4> +++ pg_config --pgxs785pg_graphql-1.4.4> ++ dirname /nix/store/48l45fvi99n90x6p9i4cs1lmzby6cb73-postgresql-15.19/lib/pgxs/src/makefiles/pgxs.mk786pg_graphql-1.4.4> + PGXS=/nix/store/48l45fvi99n90x6p9i4cs1lmzby6cb73-postgresql-15.19/lib/pgxs/src/makefiles787pg_graphql-1.4.4> + REGRESS=/nix/store/48l45fvi99n90x6p9i4cs1lmzby6cb73-postgresql-15.19/lib/pgxs/src/makefiles/../test/regress/pg_regress788pg_graphql-1.4.4> + '[' 0 -ne 0 ']'789pg_graphql-1.4.4> ++ ls test/sql790pg_graphql-1.4.4> ++ sed -e 's/\..*$//'791pg_graphql-1.4.4> ++ sort792pg_graphql-1.4.4> + TESTS=$'aliases\nallow_camel_names\narray_args_and_return_types\nbigint_is_string\nbuiltin_directives\ncomment_directive\ncomment_directive_description\ncompound_filters\nempty_mutations\nenum_mappings\nextend_type_with_function\nextend_type_with_function_relation\nextend_type_with_generated_column\nfilter_by_node_id\nfragment_on_mutation\nfragment_on_query\nfunction_calls\nfunction_calls_unsupported\nfunction_return_row_is_selectable\nfunction_return_view_has_pkey\ninflection_fields\ninflection_function\ninflection_relationships\ninflection_types\nissue_163\nissue_170\nissue_225\nissue_237_field_merging\nissue_237_field_merging_mismatched\nissue_300\nissue_306\nissue_312\nissue_334_ambiguous_function\nissue_337\nissue_339_function_return_json\nissue_339_function_return_table\nissue_353_too_many_fields\nissue_370_citext_as_string\nissue_373\nissue_377_enum_search_path\nissue_444\nissue_463\nissue_fragment_spread_cycles\njson_is_stringified\nmax_page_size\nmax_rows_directive\nmulti_column_primary_key\nmultiple_mutations\nmultiple_queries\nmutation_delete\nmutation_delete_variable\nmutation_insert\nmutation_update\nnull_argument\nomit_exotic_types\nomit_weird_names\noperation_name\noverride_enum_name\noverride_field_name\noverride_func_field_name\noverride_relationship_field_name\noverride_type_name\npage_info\npermissions_connection_column\npermissions_functions\npermissions_node_column\npermissions_table_level\npermissions_types\nprimary_key_is_required\nrelationship_one_to_one\nresolve___schema\nresolve___type\nresolve___typename\nresolve_array_type\nresolve_connection_filter\nresolve_connection_named\nresolve_connection_order_by\nresolve_connection_pagination_args\nresolve_connection_to_conn\nresolve_connection_to_node\nresolve_error_connection_edge_no_field\nresolve_error_connection_edge_node_no_field\nresolve_error_connection_no_field\nresolve_error_from_parser\nresolve_error_mutation_no_field\nresolve_error_node_no_field\nresolve_error_query_no_field\nresolve_fragment\nresolve_graphiql_schema\nresolve_one\nroundtrip_types\nrow_level_security\nsqli_connection\nstring_filters\ntest_error_anon_and_named_operations\ntest_error_invalid_offset\ntest_error_multiple_anon_operations\ntest_error_mutation_transpilation\ntest_error_operation_name_not_found\ntest_error_operation_names_not_unique\ntest_error_parsing\ntest_error_query_transpilation\ntest_error_subscription\ntest_query__type\ntotal_count\ntype_bigfloat\ntype_modifier_max_length\ntype_opaque\nvariable_default\nviews_integration'793pg_graphql-1.4.4> + psql -v ON_ERROR_STOP=1 -f test/fixtures.sql -d contrib_regression794pg_graphql-1.4.4> psql:test/fixtures.sql:1: NOTICE:  extension "pg_graphql" does not exist, skipping795pg_graphql-1.4.4> DROP EXTENSION796pg_graphql-1.4.4> CREATE EXTENSION797pg_graphql-1.4.4> COMMENT798pg_graphql-1.4.4> CREATE FUNCTION799pg_graphql-1.4.4> + /nix/store/48l45fvi99n90x6p9i4cs1lmzby6cb73-postgresql-15.19/lib/pgxs/src/makefiles/../test/regress/pg_regress --use-existing --dbname=contrib_regression --inputdir=test aliases allow_camel_names array_args_and_return_types bigint_is_string builtin_directives comment_directive comment_directive_description compound_filters empty_mutations enum_mappings extend_type_with_function extend_type_with_function_relation extend_type_with_generated_column filter_by_node_id fragment_on_mutation fragment_on_query function_calls function_calls_unsupported function_return_row_is_selectable function_return_view_has_pkey inflection_fields inflection_function inflection_relationships inflection_types issue_163 issue_170 issue_225 issue_237_field_merging issue_237_field_merging_mismatched issue_300 issue_306 issue_312 issue_334_ambiguous_function issue_337 issue_339_function_return_json issue_339_function_return_table issue_353_too_many_fields issue_370_citext_as_string issue_373 issue_377_enum_search_path issue_444 issue_463 issue_fragment_spread_cycles json_is_stringified max_page_size max_rows_directive multi_column_primary_key multiple_mutations multiple_queries mutation_delete mutation_delete_variable mutation_insert mutation_update null_argument omit_exotic_types omit_weird_names operation_name override_enum_name override_field_name override_func_field_name override_relationship_field_name override_type_name page_info permissions_connection_column permissions_functions permissions_node_column permissions_table_level permissions_types primary_key_is_required relationship_one_to_one resolve___schema resolve___type resolve___typename resolve_array_type resolve_connection_filter resolve_connection_named resolve_connection_order_by resolve_connection_pagination_args resolve_connection_to_conn resolve_connection_to_node resolve_error_connection_edge_no_field resolve_error_connection_edge_node_no_field resolve_error_connection_no_field resolve_error_from_parser resolve_error_mutation_no_field resolve_error_node_no_field resolve_error_query_no_field resolve_fragment resolve_graphiql_schema resolve_one roundtrip_types row_level_security sqli_connection string_filters test_error_anon_and_named_operations test_error_invalid_offset test_error_multiple_anon_operations test_error_mutation_transpilation test_error_operation_name_not_found test_error_operation_names_not_unique test_error_parsing test_error_query_transpilation test_error_subscription test_query__type total_count type_bigfloat type_modifier_max_length type_opaque variable_default views_integration800pg_graphql-1.4.4> (using postmaster on /build/tmp.CGKIJFPjWL, default port)801pg_graphql-1.4.4> ============== running regression test queries        ==============802pg_graphql-1.4.4> test aliases                      ... ok           55 ms803pg_graphql-1.4.4> test allow_camel_names            ... ok           55 ms804pg_graphql-1.4.4> test array_args_and_return_types  ... ok         1559 ms805pg_graphql-1.4.4> test bigint_is_string             ... ok           54 ms806pg_graphql-1.4.4> test builtin_directives           ... ok           71 ms807pg_graphql-1.4.4> test comment_directive            ... ok            9 ms808pg_graphql-1.4.4> test comment_directive_description ... ok           48 ms809pg_graphql-1.4.4> test compound_filters             ... ok          253 ms810pg_graphql-1.4.4> test empty_mutations              ... ok           56 ms811pg_graphql-1.4.4> test enum_mappings                ... ok           56 ms812pg_graphql-1.4.4> test extend_type_with_function    ... ok           52 ms813pg_graphql-1.4.4> test extend_type_with_function_relation ... ok          139 ms814pg_graphql-1.4.4> test extend_type_with_generated_column ... ok           49 ms815pg_graphql-1.4.4> test filter_by_node_id            ... ok           56 ms816pg_graphql-1.4.4> test fragment_on_mutation         ... ok           48 ms817pg_graphql-1.4.4> test fragment_on_query            ... ok           66 ms818pg_graphql-1.4.4> test function_calls               ... ok         1327 ms819pg_graphql-1.4.4> test function_calls_unsupported   ... ok          291 ms820pg_graphql-1.4.4> test function_return_row_is_selectable ... ok           78 ms821pg_graphql-1.4.4> test function_return_view_has_pkey ... ok           74 ms822pg_graphql-1.4.4> test inflection_fields            ... ok          124 ms823pg_graphql-1.4.4> test inflection_function          ... ok          124 ms824pg_graphql-1.4.4> test inflection_relationships     ... ok          185 ms825pg_graphql-1.4.4> test inflection_types             ... ok          126 ms826pg_graphql-1.4.4> test issue_163                    ... ok           49 ms827pg_graphql-1.4.4> test issue_170                    ... ok           49 ms828pg_graphql-1.4.4> test issue_225                    ... ok           52 ms829pg_graphql-1.4.4> test issue_237_field_merging      ... ok           49 ms830pg_graphql-1.4.4> test issue_237_field_merging_mismatched ... ok           49 ms831pg_graphql-1.4.4> test issue_300                    ... ok           49 ms832pg_graphql-1.4.4> test issue_306                    ... ok           55 ms833pg_graphql-1.4.4> test issue_312                    ... ok           48 ms834pg_graphql-1.4.4> test issue_334_ambiguous_function ... ok           50 ms835pg_graphql-1.4.4> test issue_337                    ... ok           84 ms836pg_graphql-1.4.4> test issue_339_function_return_json ... ok           49 ms837pg_graphql-1.4.4> test issue_339_function_return_table ... ok           47 ms838pg_graphql-1.4.4> test issue_353_too_many_fields    ... ok           64 ms839pg_graphql-1.4.4> test issue_370_citext_as_string   ... ok           66 ms840pg_graphql-1.4.4> test issue_373                    ... ok           52 ms841pg_graphql-1.4.4> test issue_377_enum_search_path   ... ok           76 ms842pg_graphql-1.4.4> test issue_444                    ... ok           44 ms843pg_graphql-1.4.4> test issue_463                    ... ok           49 ms844pg_graphql-1.4.4> test issue_fragment_spread_cycles ... ok          202 ms845pg_graphql-1.4.4> test json_is_stringified          ... ok           53 ms846pg_graphql-1.4.4> test max_page_size                ... ok           49 ms847pg_graphql-1.4.4> test max_rows_directive           ... ok          101 ms848pg_graphql-1.4.4> test multi_column_primary_key     ... ok           62 ms849pg_graphql-1.4.4> test multiple_mutations           ... ok           50 ms850pg_graphql-1.4.4> test multiple_queries             ... ok           50 ms851pg_graphql-1.4.4> test mutation_delete              ... ok           60 ms852pg_graphql-1.4.4> test mutation_delete_variable     ... ok           50 ms853pg_graphql-1.4.4> test mutation_insert              ... ok           62 ms854pg_graphql-1.4.4> test mutation_update              ... ok           65 ms855pg_graphql-1.4.4> test null_argument                ... ok           48 ms856pg_graphql-1.4.4> test omit_exotic_types            ... ok           51 ms857pg_graphql-1.4.4> test omit_weird_names             ... ok           74 ms858pg_graphql-1.4.4> test operation_name               ... ok           51 ms859pg_graphql-1.4.4> test override_enum_name           ... ok           45 ms860pg_graphql-1.4.4> test override_field_name          ... ok           46 ms861pg_graphql-1.4.4> test override_func_field_name     ... ok           48 ms862pg_graphql-1.4.4> test override_relationship_field_name ... ok           51 ms863pg_graphql-1.4.4> test override_type_name           ... ok           48 ms864pg_graphql-1.4.4> test page_info                    ... ok           61 ms865pg_graphql-1.4.4> test permissions_connection_column ... ok           80 ms866pg_graphql-1.4.4> test permissions_functions        ... ok           73 ms867pg_graphql-1.4.4> test permissions_node_column      ... ok           83 ms868pg_graphql-1.4.4> test permissions_table_level      ... ok          159 ms869pg_graphql-1.4.4> test permissions_types            ... ok           98 ms870pg_graphql-1.4.4> test primary_key_is_required      ... ok           74 ms871pg_graphql-1.4.4> test relationship_one_to_one      ... ok           55 ms872pg_graphql-1.4.4> test resolve___schema             ... ok           59 ms873pg_graphql-1.4.4> test resolve___type               ... ok           50 ms874pg_graphql-1.4.4> test resolve___typename           ... ok           52 ms875pg_graphql-1.4.4> test resolve_array_type           ... ok           54 ms876pg_graphql-1.4.4> test resolve_connection_filter    ... ok          111 ms877pg_graphql-1.4.4> test resolve_connection_named     ... ok           52 ms878pg_graphql-1.4.4> test resolve_connection_order_by  ... ok           90 ms879pg_graphql-1.4.4> test resolve_connection_pagination_args ... ok          110 ms880pg_graphql-1.4.4> test resolve_connection_to_conn   ... ok           54 ms881pg_graphql-1.4.4> test resolve_connection_to_node   ... ok           54 ms882pg_graphql-1.4.4> test resolve_error_connection_edge_no_field ... ok           46 ms883pg_graphql-1.4.4> test resolve_error_connection_edge_node_no_field ... ok           47 ms884pg_graphql-1.4.4> test resolve_error_connection_no_field ... ok           46 ms885pg_graphql-1.4.4> test resolve_error_from_parser    ... ok           11 ms886pg_graphql-1.4.4> test resolve_error_mutation_no_field ... ok           42 ms887pg_graphql-1.4.4> test resolve_error_node_no_field  ... ok           49 ms888pg_graphql-1.4.4> test resolve_error_query_no_field ... ok           43 ms889pg_graphql-1.4.4> test resolve_fragment             ... ok           56 ms890pg_graphql-1.4.4> test resolve_graphiql_schema      ... ok          143 ms891pg_graphql-1.4.4> test resolve_one                  ... ok          106 ms892pg_graphql-1.4.4> test roundtrip_types              ... ok           65 ms893pg_graphql-1.4.4> test row_level_security           ... ok           51 ms894pg_graphql-1.4.4> test sqli_connection              ... ok           60 ms895pg_graphql-1.4.4> test string_filters               ... ok           60 ms896pg_graphql-1.4.4> test test_error_anon_and_named_operations ... ok           42 ms897pg_graphql-1.4.4> test test_error_invalid_offset    ... ok           75 ms898pg_graphql-1.4.4> test test_error_multiple_anon_operations ... ok           70 ms899pg_graphql-1.4.4> test test_error_mutation_transpilation ... ok           81 ms900pg_graphql-1.4.4> test test_error_operation_name_not_found ... ok           43 ms901pg_graphql-1.4.4> test test_error_operation_names_not_unique ... ok           43 ms902pg_graphql-1.4.4> test test_error_parsing           ... ok           11 ms903pg_graphql-1.4.4> test test_error_query_transpilation ... ok           52 ms904pg_graphql-1.4.4> test test_error_subscription      ... ok           42 ms905pg_graphql-1.4.4> test test_query__type             ... ok           42 ms906pg_graphql-1.4.4> test total_count                  ... ok           76 ms907pg_graphql-1.4.4> test type_bigfloat                ... ok           52 ms908pg_graphql-1.4.4> test type_modifier_max_length     ... ok           52 ms909pg_graphql-1.4.4> test type_opaque                  ... ok           53 ms910pg_graphql-1.4.4> test variable_default             ... ok           52 ms911pg_graphql-1.4.4> test views_integration            ... ok          170 ms912pg_graphql-1.4.4> 913pg_graphql-1.4.4> =======================914pg_graphql-1.4.4>  All 110 tests passed. 915pg_graphql-1.4.4> =======================916pg_graphql-1.4.4> 917pg_graphql-1.4.4> + pg_ctl stop -m i918pg_graphql-1.4.4> waiting for server to shut down....2026-10-06 14:09:28.073 UTC [2889] LOG:  received immediate shutdown request919pg_graphql-1.4.4> 2026-10-06 14:09:28.079 UTC [2889] LOG:  database system is shut down920pg_graphql-1.4.4>  done921pg_graphql-1.4.4> server stopped922pg_graphql-1.4.4> checkPhase completed in 31 seconds923pg_graphql-1.4.4> Running phase: installPhase924pg_graphql-1.4.4> Executing buildPgrxExtension install925pg_graphql-1.4.4> Running phase: fixupPhase926pg_graphql-1.4.4> shrinking RPATHs of ELF executables and libraries in /nix/store/hyw1qcydkijl3gg63d8n161v8ha50a8c-pg_graphql-1.4.4927pg_graphql-1.4.4> shrinking /nix/store/hyw1qcydkijl3gg63d8n161v8ha50a8c-pg_graphql-1.4.4/lib/pg_graphql-1.4.4.so928pg_graphql-1.4.4> checking for references to /build/ in /nix/store/hyw1qcydkijl3gg63d8n161v8ha50a8c-pg_graphql-1.4.4...929pg_graphql-1.4.4> patching script interpreter paths in /nix/store/hyw1qcydkijl3gg63d8n161v8ha50a8c-pg_graphql-1.4.4930pg_graphql-1.4.4> stripping (with command strip and flags -S -p) in  /nix/store/hyw1qcydkijl3gg63d8n161v8ha50a8c-pg_graphql-1.4.4/lib931pg_graphql-1.4.4> stripping (with command strip and flags -s -p) in  /nix/store/hyw1qcydkijl3gg63d8n161v8ha50a8c-pg_graphql-1.4.4/lib932pg_graphql-1.5.11>     Finished `release` profile [optimized] target(s) in 4m 55s933pg_graphql-1.5.11>   Installing extension934pg_graphql-1.5.11>      Copying control file to /nix/store/n4siqglb731191bw720w8d6fqana48pn-pg_graphql-1.5.11/nix/store/wq2kfr0rkb0hdmf1iwi3mi8pxycakzmq-postgresql-17_22/share/postgresql/extension/pg_graphql.control935pg_graphql-1.5.11>      Copying shared library to /nix/store/n4siqglb731191bw720w8d6fqana48pn-pg_graphql-1.5.11/nix/store/03bgys654wi361a6pkpx6nvzv3ygd5m8-postgresql-17_22-lib/lib/pg_graphql.so936pg_graphql-1.5.11>   Discovered 5 SQL entities: 0 schemas (0 unique), 1 functions, 0 types, 0 enums, 4 sqls, 0 ords, 0 hashes, 0 aggregates, 0 triggers937pg_graphql-1.5.11>   Rebuilding pgrx_embed, in debug mode, for SQL generation with features  pg17938pg_graphql-1.5.11>    Compiling proc-macro2 v1.0.93939pg_graphql-1.5.11>    Compiling unicode-ident v1.0.16940pg_graphql-1.5.11>    Compiling libc v0.2.169941pg_graphql-1.5.11>    Compiling quote v1.0.38942pg_graphql-1.5.11>    Compiling syn v2.0.98943pg_graphql-1.5.11>    Compiling stable_deref_trait v1.2.0944pg_graphql-1.5.11>    Compiling memchr v2.7.4945pg_graphql-1.5.11>    Compiling cfg-if v1.0.0946pg_graphql-1.5.11>    Compiling serde v1.0.217947pg_graphql-1.5.11>    Compiling equivalent v1.0.1948pg_graphql-1.5.11>    Compiling writeable v0.5.5949pg_graphql-1.5.11>    Compiling litemap v0.7.4950pg_graphql-1.5.11>    Compiling hashbrown v0.15.2951pg_graphql-1.5.11>    Compiling indexmap v2.7.1952pg_graphql-1.5.11>    Compiling thiserror v1.0.69953pg_graphql-1.5.11>    Compiling icu_locid_transform_data v1.5.0954pg_graphql-1.5.11>    Compiling once_cell v1.20.2955pg_graphql-1.5.11>    Compiling eyre v0.6.12956pg_graphql-1.5.11>    Compiling icu_properties_data v1.5.0957pg_graphql-1.5.11>    Compiling write16 v1.0.0958pg_graphql-1.5.11>    Compiling thiserror v2.0.11959pg_graphql-1.5.11>    Compiling utf8_iter v1.0.4960pg_graphql-1.5.11>    Compiling indenter v0.3.3961pg_graphql-1.5.11>    Compiling glob v0.3.2962pg_graphql-1.5.11>    Compiling synstructure v0.13.1963pg_graphql-1.5.11>    Compiling shlex v1.3.0964pg_graphql-1.5.11>    Compiling smallvec v1.13.2965pg_graphql-1.5.11>    Compiling utf16_iter v1.0.5966pg_graphql-1.5.11>    Compiling icu_normalizer_data v1.5.0967pg_graphql-1.5.11>    Compiling clang-sys v1.8.1968pg_graphql-1.5.11>    Compiling winnow v0.7.0969pg_graphql-1.5.11>    Compiling zerofrom-derive v0.1.5970pg_graphql-1.5.11>    Compiling yoke-derive v0.7.5971pg_graphql-1.5.11>    Compiling zerofrom v0.1.5972pg_graphql-1.5.11>    Compiling zerovec-derive v0.10.3973pg_graphql-1.5.11>    Compiling yoke v0.7.5974pg_graphql-1.5.11>    Compiling serde_derive v1.0.217975pg_graphql-1.5.11>    Compiling zerovec v0.10.4976pg_graphql-1.5.11>    Compiling displaydoc v0.2.5977pg_graphql-1.5.11>    Compiling tinystr v0.7.6978pg_graphql-1.5.11>    Compiling icu_locid v1.5.0979pg_graphql-1.5.11>    Compiling icu_provider_macros v1.5.0980pg_graphql-1.5.11>    Compiling icu_provider v1.5.0981pg_graphql-1.5.11>    Compiling thiserror-impl v1.0.69982pg_graphql-1.5.11>    Compiling icu_locid_transform v1.5.0983pg_graphql-1.5.11>    Compiling icu_collections v1.5.0984pg_graphql-1.5.11>    Compiling toml_datetime v0.6.8985pg_graphql-1.5.11>    Compiling serde_spanned v0.6.8986pg_graphql-1.5.11>    Compiling thiserror-impl v2.0.11987pg_graphql-1.5.11>    Compiling icu_properties v1.5.1988pg_graphql-1.5.11>    Compiling anyhow v1.0.95989pg_graphql-1.5.11>    Compiling serde_json v1.0.138990pg_graphql-1.5.11>    Compiling is_ci v1.2.0991pg_graphql-1.5.11>    Compiling toml_edit v0.22.23992pg_graphql-1.5.11>    Compiling icu_normalizer v1.5.0993pg_graphql-1.5.11>    Compiling idna_adapter v1.2.0994pg_graphql-1.5.11>    Compiling cc v1.2.11995pg_graphql-1.5.11>    Compiling is-terminal v0.4.15996pg_graphql-1.5.11>    Compiling itoa v1.0.14997pg_graphql-1.5.11>    Compiling ucd-trie v0.1.7998pg_graphql-1.5.11>    Compiling owo-colors v4.1.0999pg_graphql-1.5.11>    Compiling minimal-lexical v0.2.11000pg_graphql-1.5.11>    Compiling percent-encoding v2.3.11001pg_graphql-1.5.11>    Compiling regex-syntax v0.8.51002pg_graphql-1.5.11>    Compiling ryu v1.0.191003pg_graphql-1.5.11>    Compiling nom v7.1.31004pg_graphql-1.5.11>    Compiling regex-automata v0.4.91005pg_graphql-1.5.11>    Compiling form_urlencoded v1.2.11006pg_graphql-1.5.11>    Compiling pest v2.7.151007pg_graphql-1.5.11>    Compiling supports-color v2.1.01008pg_graphql-1.5.11>    Compiling toml v0.8.191009pg_graphql-1.5.11>    Compiling idna v1.0.31010pg_graphql-1.5.11>    Compiling supports-color v3.0.21011pg_graphql-1.5.11>    Compiling libloading v0.8.61012pg_graphql-1.5.11>    Compiling either v1.13.01013pg_graphql-1.5.11>    Compiling byteorder v1.5.01014pg_graphql-1.5.11>    Compiling bindgen v0.70.11015pg_graphql-1.5.11>    Compiling syn v1.0.1091016pg_graphql-1.5.11>    Compiling unicode-width v0.1.141017pg_graphql-1.5.11>    Compiling yansi-term v0.1.21018pg_graphql-1.5.11>    Compiling annotate-snippets v0.9.21019pg_graphql-1.5.11>    Compiling itertools v0.13.01020pg_graphql-1.5.11>    Compiling pathsearch v0.2.01021pg_graphql-1.5.11>    Compiling url v2.5.41022pg_graphql-1.5.11>    Compiling cargo_toml v0.19.21023pg_graphql-1.5.11>    Compiling regex v1.11.11024pg_graphql-1.5.11>    Compiling semver-parser v0.10.31025pg_graphql-1.5.11>    Compiling cexpr v0.6.01026pg_graphql-1.5.11>    Compiling same-file v1.0.61027pg_graphql-1.5.11>    Compiling home v0.5.111028pg_graphql-1.5.11>    Compiling rustc-hash v1.1.01029pg_graphql-1.5.11>    Compiling unicode-segmentation v1.12.01030pg_graphql-1.5.11>    Compiling bitflags v2.8.01031pg_graphql-1.5.11>    Compiling fixedbitset v0.4.21032pg_graphql-1.5.11>    Compiling petgraph v0.6.51033pg_graphql-1.5.11>    Compiling pgrx-pg-config v0.12.91034pg_graphql-1.5.11>    Compiling convert_case v0.6.01035pg_graphql-1.5.11>    Compiling walkdir v2.5.01036pg_graphql-1.5.11>    Compiling semver v0.11.01037pg_graphql-1.5.11>    Compiling getrandom v0.2.151038pg_graphql-1.5.11>    Compiling ident_case v1.0.11039pg_graphql-1.5.11>    Compiling fnv v1.0.71040pg_graphql-1.5.11>    Compiling unescape v0.1.01041pg_graphql-1.5.11>    Compiling strsim v0.10.01042pg_graphql-1.5.11>    Compiling pgrx-bindgen v0.12.91043pg_graphql-1.5.11>    Compiling darling_core v0.14.41044pg_graphql-1.5.11>    Compiling rustc_version v0.3.31045pg_graphql-1.5.11>    Compiling cee-scape v0.2.01046pg_graphql-1.5.11>    Compiling zerocopy-derive v0.7.351047pg_graphql-1.5.11>    Compiling radium v0.7.01048pg_graphql-1.5.11>    Compiling zerocopy v0.7.351049pg_graphql-1.5.11>    Compiling darling_macro v0.14.41050pg_graphql-1.5.11>    Compiling atomic-traits v0.3.01051pg_graphql-1.5.11>    Compiling pgrx-pg-sys v0.12.91052pg_graphql-1.5.11>    Compiling pgrx-sql-entity-graph v0.12.91053pg_graphql-1.5.11>    Compiling tap v1.0.11054pg_graphql-1.5.11>    Compiling heapless v0.8.01055pg_graphql-1.5.11>    Compiling wyz v0.5.11056pg_graphql-1.5.11>    Compiling pgrx-macros v0.12.91057pg_graphql-1.5.11>    Compiling ppv-lite86 v0.2.201058pg_graphql-1.5.11>    Compiling darling v0.14.41059pg_graphql-1.5.11>    Compiling rand_core v0.6.41060pg_graphql-1.5.11>    Compiling hash32 v0.3.11061pg_graphql-1.5.11>    Compiling enum-map-derive v0.17.01062pg_graphql-1.5.11>    Compiling half v1.8.31063pg_graphql-1.5.11>    Compiling bytes v1.10.01064pg_graphql-1.5.11>    Compiling sptr v0.3.21065pg_graphql-1.5.11>    Compiling funty v2.0.01066pg_graphql-1.5.11>    Compiling bitvec v1.0.11067pg_graphql-1.5.11>    Compiling combine v4.6.71068pg_graphql-1.5.11>    Compiling serde_cbor v0.11.21069pg_graphql-1.5.11>    Compiling enum-map v2.7.31070pg_graphql-1.5.11>    Compiling rand_chacha v0.3.11071pg_graphql-1.5.11>    Compiling cached_proc_macro v0.18.11072pg_graphql-1.5.11>    Compiling uuid v1.12.11073pg_graphql-1.5.11>    Compiling instant v0.1.131074pg_graphql-1.5.11>    Compiling seahash v4.1.01075pg_graphql-1.5.11>    Compiling hashbrown v0.14.51076pg_graphql-1.5.11>    Compiling cached_proc_macro_types v0.1.11077pg_graphql-1.5.11>    Compiling cached v0.46.11078pg_graphql-1.5.11>    Compiling itertools v0.10.51079pg_graphql-1.5.11>    Compiling rand v0.8.51080pg_graphql-1.5.11>    Compiling graphql-parser v0.4.11081pg_graphql-1.5.11>    Compiling pgrx v0.12.91082pg_graphql-1.5.11>    Compiling bimap v0.6.31083pg_graphql-1.5.11>    Compiling base64 v0.13.11084pg_graphql-1.5.11>    Compiling lazy_static v1.5.01085pg_graphql-1.5.11>    Compiling pg_graphql v1.5.11 (/build/source)1086pg_graphql-1.5.11>     Finished `dev` profile [unoptimized + debuginfo] target(s) in 3m 29s1087pg_graphql-1.5.11>      Writing SQL entities to /nix/store/n4siqglb731191bw720w8d6fqana48pn-pg_graphql-1.5.11/nix/store/wq2kfr0rkb0hdmf1iwi3mi8pxycakzmq-postgresql-17_22/share/postgresql/extension/pg_graphql--1.5.11.sql1088pg_graphql-1.5.11>     Finished installing pg_graphql1089pg_graphql-1.5.11> buildPhase completed in 8 minutes 29 seconds1090pg_graphql-1.5.11> Running phase: checkPhase1091pg_graphql-1.5.11>    Validating /nix/store/wq2kfr0rkb0hdmf1iwi3mi8pxycakzmq-postgresql-17_22/bin/pg_config1092pg_graphql-1.5.11>  Initializing data directory at /build/tmp.MerJ2kwqow/data-171093pg_graphql-1.5.11> waiting for server to start....2026-10-06 14:13:48.828 GMT [4925] LOG:  starting PostgreSQL 17.11 on aarch64-unknown-linux-gnu, compiled by gcc (GCC) 15.2.0, 64-bit1094pg_graphql-1.5.11> 2026-10-06 14:13:48.856 GMT [4925] LOG:  listening on Unix socket "/build/tmp.NrFVvUVMyk/.s.PGSQL.5432"1095pg_graphql-1.5.11> 2026-10-06 14:13:48.866 GMT [4928] LOG:  database system was shut down at 2026-10-06 14:13:48 GMT1096pg_graphql-1.5.11> 2026-10-06 14:13:48.872 GMT [4925] LOG:  database system is ready to accept connections1097pg_graphql-1.5.11>  done1098pg_graphql-1.5.11> server started1099pg_graphql-1.5.11> createuser: error: connection to server at "localhost" (127.0.0.1), port 5432 failed: Connection refused1100pg_graphql-1.5.11> 	Is the server running on that host and accepting TCP/IP connections?1101pg_graphql-1.5.11> waiting for server to shut down....2026-10-06 14:13:48.905 GMT [4925] LOG:  received fast shutdown request1102pg_graphql-1.5.11> 2026-10-06 14:13:48.907 GMT [4925] LOG:  aborting any active transactions1103pg_graphql-1.5.11> 2026-10-06 14:13:48.912 GMT [4925] LOG:  background worker "logical replication launcher" (PID 4931) exited with exit code 11104pg_graphql-1.5.11> 2026-10-06 14:13:48.912 GMT [4926] LOG:  shutting down1105pg_graphql-1.5.11> 2026-10-06 14:13:48.915 GMT [4926] LOG:  checkpoint starting: shutdown immediate1106pg_graphql-1.5.11> 2026-10-06 14:13:48.932 GMT [4926] LOG:  checkpoint complete: wrote 3 buffers (0.0%); 0 WAL file(s) added, 0 removed, 0 recycled; write=0.004 s, sync=0.002 s, total=0.020 s; sync files=2, longest=0.001 s, average=0.001 s; distance=0 kB, estimate=0 kB; lsn=0/14EC910, redo lsn=0/14EC9101107pg_graphql-1.5.11> 2026-10-06 14:13:48.936 GMT [4925] LOG:  database system is shut down1108pg_graphql-1.5.11>  done1109pg_graphql-1.5.11> server stopped1110pg_graphql-1.5.11>    Validating /build/tmp.0Qym5nqGtj/17/bin/pg_config1111pg_graphql-1.5.11>  Initializing data directory at /build/tmp.0Qym5nqGtj/data-171112pg_graphql-1.5.11>        Using PgConfig("pg17") and `pg_config` from /build/tmp.0Qym5nqGtj/17/bin/pg_config1113pg_graphql-1.5.11>     Building extension with features pg171114pg_graphql-1.5.11>      Running command "/nix/store/hxlcfmjxs6akpyya3k1d4qk1ghbw11ij-rust-default-1.81.0/bin/cargo" "build" "--lib" "--release" "--features" "pg17" "--no-default-features" "--message-format=json-render-diagnostics" "--frozen" "-j" "2"1115pg_graphql-1.5.11>     Finished `release` profile [optimized] target(s) in 0.15s1116pg_graphql-1.5.11>   Installing extension1117pg_graphql-1.5.11>      Copying control file to /build/tmp.0Qym5nqGtj/17/share/postgresql/extension/pg_graphql.control1118pg_graphql-1.5.11>      Copying shared library to /build/tmp.0Qym5nqGtj/17/lib/pg_graphql.so1119pg_graphql-1.5.11>   Discovered 5 SQL entities: 0 schemas (0 unique), 1 functions, 0 types, 0 enums, 4 sqls, 0 ords, 0 hashes, 0 aggregates, 0 triggers1120pg_graphql-1.5.11>   Rebuilding pgrx_embed, in debug mode, for SQL generation with features pg171121pg_graphql-1.5.11>    Compiling pg_graphql v1.5.11 (/build/source)1122pg_graphql-1.5.11>     Finished `dev` profile [unoptimized + debuginfo] target(s) in 23.33s1123pg_graphql-1.5.11>      Writing SQL entities to /build/tmp.0Qym5nqGtj/17/share/postgresql/extension/pg_graphql--1.5.11.sql1124pg_graphql-1.5.11>     Finished installing pg_graphql1125pg_graphql-1.5.11> ++ mktemp -d1126pg_graphql-1.5.11> + TMPDIR=/build/tmp.atwQrfj7VW1127pg_graphql-1.5.11> + export PGDATA=/build/tmp.atwQrfj7VW1128pg_graphql-1.5.11> + PGDATA=/build/tmp.atwQrfj7VW1129pg_graphql-1.5.11> + export PGHOST=/build/tmp.atwQrfj7VW1130pg_graphql-1.5.11> + PGHOST=/build/tmp.atwQrfj7VW1131pg_graphql-1.5.11> + export PGUSER=postgres1132pg_graphql-1.5.11> + PGUSER=postgres1133pg_graphql-1.5.11> + export PGDATABASE=postgres1134pg_graphql-1.5.11> + PGDATABASE=postgres1135pg_graphql-1.5.11> + export PGTZ=UTC1136pg_graphql-1.5.11> + PGTZ=UTC1137pg_graphql-1.5.11> + export PG_COLOR=auto1138pg_graphql-1.5.11> + PG_COLOR=auto1139pg_graphql-1.5.11> + trap 'pg_ctl stop -m i' sigint sigterm exit1140pg_graphql-1.5.11> + rm -rf /build/tmp.atwQrfj7VW1141pg_graphql-1.5.11> + initdb --no-locale --encoding=UTF8 --nosync -U postgres1142pg_graphql-1.5.11> The files belonging to this database system will be owned by user "nixbld".1143pg_graphql-1.5.11> This user must also own the server process.1144pg_graphql-1.5.11> 1145pg_graphql-1.5.11> The database cluster will be initialized with locale "C".1146pg_graphql-1.5.11> The default text search configuration will be set to "english".1147pg_graphql-1.5.11> 1148pg_graphql-1.5.11> Data page checksums are disabled.1149pg_graphql-1.5.11> 1150pg_graphql-1.5.11> creating directory /build/tmp.atwQrfj7VW ... ok1151pg_graphql-1.5.11> creating subdirectories ... ok1152pg_graphql-1.5.11> selecting dynamic shared memory implementation ... posix1153pg_graphql-1.5.11> selecting default "max_connections" ... 1001154pg_graphql-1.5.11> selecting default "shared_buffers" ... 128MB1155pg_graphql-1.5.11> selecting default time zone ... UTC1156pg_graphql-1.5.11> creating configuration files ... ok1157pg_graphql-1.5.11> running bootstrap script ... ok1158pg_graphql-1.5.11> performing post-bootstrap initialization ... ok1159pg_graphql-1.5.11> 1160pg_graphql-1.5.11> Sync to disk skipped.1161pg_graphql-1.5.11> The data directory might become corrupt if the operating system crashes.1162pg_graphql-1.5.11> 1163pg_graphql-1.5.11> initdb: warning: enabling "trust" authentication for local connections1164pg_graphql-1.5.11> initdb: hint: You can change this by editing pg_hba.conf or using the option -A, or --auth-local and --auth-host, the next time you run initdb.1165pg_graphql-1.5.11> 1166pg_graphql-1.5.11> Success. You can now start the database server using:1167pg_graphql-1.5.11> 1168pg_graphql-1.5.11>     /build/tmp.0Qym5nqGtj/17/bin/pg_ctl -D /build/tmp.atwQrfj7VW -l logfile start1169pg_graphql-1.5.11> 1170pg_graphql-1.5.11> + pg_ctl start -o '-F -c listen_addresses="" -c log_min_messages=WARNING -k /build/tmp.atwQrfj7VW'1171pg_graphql-1.5.11> waiting for server to start....2026-10-06 14:14:15.072 UTC [5202] LOG:  starting PostgreSQL 17.11 on aarch64-unknown-linux-gnu, compiled by gcc (GCC) 15.2.0, 64-bit1172pg_graphql-1.5.11> 2026-10-06 14:14:15.072 UTC [5202] LOG:  listening on Unix socket "/build/tmp.atwQrfj7VW/.s.PGSQL.5432"1173pg_graphql-1.5.11> 2026-10-06 14:14:15.074 UTC [5205] LOG:  database system was shut down at 2026-10-06 14:14:15 UTC1174pg_graphql-1.5.11> 2026-10-06 14:14:15.078 UTC [5202] LOG:  database system is ready to accept connections1175pg_graphql-1.5.11>  done1176pg_graphql-1.5.11> server started1177pg_graphql-1.5.11> + createdb contrib_regression1178pg_graphql-1.5.11> + TESTDIR=test1179pg_graphql-1.5.11> +++ pg_config --pgxs1180pg_graphql-1.5.11> ++ dirname /nix/store/wq2kfr0rkb0hdmf1iwi3mi8pxycakzmq-postgresql-17_22/lib/pgxs/src/makefiles/pgxs.mk1181pg_graphql-1.5.11> + PGXS=/nix/store/wq2kfr0rkb0hdmf1iwi3mi8pxycakzmq-postgresql-17_22/lib/pgxs/src/makefiles1182pg_graphql-1.5.11> + REGRESS=/nix/store/wq2kfr0rkb0hdmf1iwi3mi8pxycakzmq-postgresql-17_22/lib/pgxs/src/makefiles/../test/regress/pg_regress1183pg_graphql-1.5.11> + '[' 0 -ne 0 ']'1184pg_graphql-1.5.11> ++ ls test/sql1185pg_graphql-1.5.11> ++ sed -e 's/\..*$//'1186pg_graphql-1.5.11> ++ sort1187pg_graphql-1.5.11> + TESTS=$'aliases\nallow_camel_names\narray_args_and_return_types\nbigint_is_string\nbuiltin_directives\ncomment_directive\ncomment_directive_description\ncompound_filters\nempty_mutations\nenum_mappings\nextend_type_with_function\nextend_type_with_function_relation\nextend_type_with_generated_column\nfilter_by_node_id\nfragment_on_mutation\nfragment_on_query\nfunction_calls\nfunction_calls_default_args\nfunction_calls_unsupported\nfunction_return_row_is_selectable\nfunction_return_view_has_pkey\ninflection_fields\ninflection_function\ninflection_relationships\ninflection_types\nissue_163\nissue_170\nissue_225\nissue_237_field_merging\nissue_237_field_merging_mismatched\nissue_300\nissue_306\nissue_312\nissue_334_ambiguous_function\nissue_337\nissue_339_function_return_json\nissue_339_function_return_table\nissue_353_too_many_fields\nissue_370_citext_as_string\nissue_373\nissue_377_enum_search_path\nissue_409_fkey_rls_nullability\nissue_444\nissue_463\nissue_511\nissue_533\nissue_542_partial_unique\nissue_551_too_many_fields\nissue_557_1_to_1_nullability\nissue_fragment_spread_cycles\njson_is_stringified\nmax_page_size\nmax_rows_directive\nmulti_column_primary_key\nmultiple_mutations\nmultiple_queries\nmutation_delete\nmutation_delete_variable\nmutation_insert\nmutation_update\nnull_argument\nomit_exotic_types\nomit_weird_names\noperation_name\noverride_enum_name\noverride_field_name\noverride_func_field_name\noverride_relationship_field_name\noverride_type_name\npage_info\npermissions_connection_column\npermissions_functions\npermissions_node_column\npermissions_table_level\npermissions_types\nprimary_key_is_required\nrelationship_one_to_one\nresolve___schema\nresolve___type\nresolve___typename\nresolve_array_type\nresolve_connection_filter\nresolve_connection_named\nresolve_connection_order_by\nresolve_connection_pagination_args\nresolve_connection_to_conn\nresolve_connection_to_node\nresolve_error_connection_edge_no_field\nresolve_error_connection_edge_node_no_field\nresolve_error_connection_no_field\nresolve_error_from_parser\nresolve_error_mutation_no_field\nresolve_error_node_no_field\nresolve_error_query_no_field\nresolve_fragment\nresolve_graphiql_schema\nresolve_one\nroundtrip_types\nrow_level_security\nsqli_connection\nstring_filters\ntest_error_anon_and_named_operations\ntest_error_invalid_offset\ntest_error_multiple_anon_operations\ntest_error_mutation_transpilation\ntest_error_operation_name_not_found\ntest_error_operation_names_not_unique\ntest_error_query_transpilation\ntest_error_subscription\ntest_query__type\ntotal_count\ntype_bigfloat\ntype_modifier_max_length\ntype_opaque\nvariable_default\nviews_integration'1188pg_graphql-1.5.11> + psql -v ON_ERROR_STOP=1 -f test/fixtures.sql -d contrib_regression1189pg_graphql-1.5.11> psql:test/fixtures.sql:1: NOTICE:  extension "pg_graphql" does not exist, skipping1190pg_graphql-1.5.11> DROP EXTENSION1191pg_graphql-1.5.11> CREATE EXTENSION1192pg_graphql-1.5.11> COMMENT1193pg_graphql-1.5.11> CREATE FUNCTION1194pg_graphql-1.5.11> + /nix/store/wq2kfr0rkb0hdmf1iwi3mi8pxycakzmq-postgresql-17_22/lib/pgxs/src/makefiles/../test/regress/pg_regress --use-existing --dbname=contrib_regression --inputdir=test aliases allow_camel_names array_args_and_return_types bigint_is_string builtin_directives comment_directive comment_directive_description compound_filters empty_mutations enum_mappings extend_type_with_function extend_type_with_function_relation extend_type_with_generated_column filter_by_node_id fragment_on_mutation fragment_on_query function_calls function_calls_default_args function_calls_unsupported function_return_row_is_selectable function_return_view_has_pkey inflection_fields inflection_function inflection_relationships inflection_types issue_163 issue_170 issue_225 issue_237_field_merging issue_237_field_merging_mismatched issue_300 issue_306 issue_312 issue_334_ambiguous_function issue_337 issue_339_function_return_json issue_339_function_return_table issue_353_too_many_fields issue_370_citext_as_string issue_373 issue_377_enum_search_path issue_409_fkey_rls_nullability issue_444 issue_463 issue_511 issue_533 issue_542_partial_unique issue_551_too_many_fields issue_557_1_to_1_nullability issue_fragment_spread_cycles json_is_stringified max_page_size max_rows_directive multi_column_primary_key multiple_mutations multiple_queries mutation_delete mutation_delete_variable mutation_insert mutation_update null_argument omit_exotic_types omit_weird_names operation_name override_enum_name override_field_name override_func_field_name override_relationship_field_name override_type_name page_info permissions_connection_column permissions_functions permissions_node_column permissions_table_level permissions_types primary_key_is_required relationship_one_to_one resolve___schema resolve___type resolve___typename resolve_array_type resolve_connection_filter resolve_connection_named resolve_connection_order_by resolve_connection_pagination_args resolve_connection_to_conn resolve_connection_to_node resolve_error_connection_edge_no_field resolve_error_connection_edge_node_no_field resolve_error_connection_no_field resolve_error_from_parser resolve_error_mutation_no_field resolve_error_node_no_field resolve_error_query_no_field resolve_fragment resolve_graphiql_schema resolve_one roundtrip_types row_level_security sqli_connection string_filters test_error_anon_and_named_operations test_error_invalid_offset test_error_multiple_anon_operations test_error_mutation_transpilation test_error_operation_name_not_found test_error_operation_names_not_unique test_error_query_transpilation test_error_subscription test_query__type total_count type_bigfloat type_modifier_max_length type_opaque variable_default views_integration1195pg_graphql-1.5.11> # using postmaster on /build/tmp.atwQrfj7VW, default port1196pg_graphql-1.5.11> ok 1         - aliases                                    55 ms1197pg_graphql-1.5.11> ok 2         - allow_camel_names                          54 ms1198pg_graphql-1.5.11> ok 3         - array_args_and_return_types              1519 ms1199pg_graphql-1.5.11> ok 4         - bigint_is_string                           51 ms1200pg_graphql-1.5.11> ok 5         - builtin_directives                         60 ms1201pg_graphql-1.5.11> ok 6         - comment_directive                          10 ms1202pg_graphql-1.5.11> ok 7         - comment_directive_description              53 ms1203pg_graphql-1.5.11> ok 8         - compound_filters                          288 ms1204pg_graphql-1.5.11> ok 9         - empty_mutations                            49 ms1205pg_graphql-1.5.11> ok 10        - enum_mappings                              54 ms1206pg_graphql-1.5.11> ok 11        - extend_type_with_function                  58 ms1207pg_graphql-1.5.11> ok 12        - extend_type_with_function_relation        140 ms1208pg_graphql-1.5.11> ok 13        - extend_type_with_generated_column          48 ms1209pg_graphql-1.5.11> ok 14        - filter_by_node_id                          53 ms1210pg_graphql-1.5.11> ok 15        - fragment_on_mutation                       54 ms1211pg_graphql-1.5.11> ok 16        - fragment_on_query                          49 ms1212pg_graphql-1.5.11> ok 17        - function_calls                           1323 ms1213pg_graphql-1.5.11> ok 18        - function_calls_default_args                95 ms1214pg_graphql-1.5.11> ok 19        - function_calls_unsupported                300 ms1215pg_graphql-1.5.11> ok 20        - function_return_row_is_selectable          82 ms1216pg_graphql-1.5.11> ok 21        - function_return_view_has_pkey              72 ms1217pg_graphql-1.5.11> ok 22        - inflection_fields                         124 ms1218pg_graphql-1.5.11> ok 23        - inflection_function                       124 ms1219pg_graphql-1.5.11> ok 24        - inflection_relationships                  186 ms1220pg_graphql-1.5.11> ok 25        - inflection_types                          128 ms1221pg_graphql-1.5.11> ok 26        - issue_163                                  45 ms1222pg_graphql-1.5.11> ok 27        - issue_170                                  48 ms1223pg_graphql-1.5.11> ok 28        - issue_225                                  50 ms1224pg_graphql-1.5.11> ok 29        - issue_237_field_merging                   109 ms1225pg_graphql-1.5.11> ok 30        - issue_237_field_merging_mismatched         86 ms1226pg_graphql-1.5.11> ok 31        - issue_300                                  55 ms1227pg_graphql-1.5.11> ok 32        - issue_306                                  56 ms1228pg_graphql-1.5.11> ok 33        - issue_312                                  48 ms1229pg_graphql-1.5.11> ok 34        - issue_334_ambiguous_function               58 ms1230pg_graphql-1.5.11> ok 35        - issue_337                                  94 ms1231pg_graphql-1.5.11> ok 36        - issue_339_function_return_json             48 ms1232pg_graphql-1.5.11> ok 37        - issue_339_function_return_table            56 ms1233pg_graphql-1.5.11> ok 38        - issue_353_too_many_fields                  64 ms1234pg_graphql-1.5.11> ok 39        - issue_370_citext_as_string                 63 ms1235pg_graphql-1.5.11> ok 40        - issue_373                                  51 ms1236pg_graphql-1.5.11> ok 41        - issue_377_enum_search_path                 75 ms1237pg_graphql-1.5.11> ok 42        - issue_409_fkey_rls_nullability            105 ms1238pg_graphql-1.5.11> ok 43        - issue_444                                  43 ms1239pg_graphql-1.5.11> ok 44        - issue_463                                  49 ms1240pg_graphql-1.5.11> ok 45        - issue_511                                  55 ms1241pg_graphql-1.5.11> ok 46        - issue_533                                  97 ms1242pg_graphql-1.5.11> ok 47        - issue_542_partial_unique                   78 ms1243pg_graphql-1.5.11> ok 48        - issue_551_too_many_fields                  66 ms1244pg_graphql-1.5.11> ok 49        - issue_557_1_to_1_nullability               55 ms1245pg_graphql-1.5.11> ok 50        - issue_fragment_spread_cycles              205 ms1246pg_graphql-1.5.11> ok 51        - json_is_stringified                        53 ms1247pg_graphql-1.5.11> ok 52        - max_page_size                              47 ms1248pg_graphql-1.5.11> ok 53        - max_rows_directive                         98 ms1249pg_graphql-1.5.11> ok 54        - multi_column_primary_key                   59 ms1250pg_graphql-1.5.11> ok 55        - multiple_mutations                         49 ms1251pg_graphql-1.5.11> ok 56        - multiple_queries                           50 ms1252pg_graphql-1.5.11> ok 57        - mutation_delete                            60 ms1253pg_graphql-1.5.11> ok 58        - mutation_delete_variable                   49 ms1254pg_graphql-1.5.11> ok 59        - mutation_insert                            60 ms1255pg_graphql-1.5.11> ok 60        - mutation_update                            64 ms1256pg_graphql-1.5.11> ok 61        - null_argument                              46 ms1257pg_graphql-1.5.11> ok 62        - omit_exotic_types                          48 ms1258pg_graphql-1.5.11> ok 63        - omit_weird_names                           73 ms1259pg_graphql-1.5.11> ok 64        - operation_name                             49 ms1260pg_graphql-1.5.11> ok 65        - override_enum_name                         49 ms1261pg_graphql-1.5.11> ok 66        - override_field_name                        46 ms1262pg_graphql-1.5.11> ok 67        - override_func_field_name                   47 ms1263pg_graphql-1.5.11> ok 68        - override_relationship_field_name           49 ms1264pg_graphql-1.5.11> ok 69        - override_type_name                         47 ms1265pg_graphql-1.5.11> ok 70        - page_info                                  67 ms1266pg_graphql-1.5.11> ok 71        - permissions_connection_column              79 ms1267pg_graphql-1.5.11> ok 72        - permissions_functions                      75 ms1268pg_graphql-1.5.11> ok 73        - permissions_node_column                    83 ms1269pg_graphql-1.5.11> ok 74        - permissions_table_level                   161 ms1270pg_graphql-1.5.11> ok 75        - permissions_types                          95 ms1271pg_graphql-1.5.11> ok 76        - primary_key_is_required                    72 ms1272pg_graphql-1.5.11> ok 77        - relationship_one_to_one                    51 ms1273pg_graphql-1.5.11> ok 78        - resolve___schema                           56 ms1274pg_graphql-1.5.11> ok 79        - resolve___type                             46 ms1275pg_graphql-1.5.11> ok 80        - resolve___typename                         50 ms1276pg_graphql-1.5.11> ok 81        - resolve_array_type                         52 ms1277pg_graphql-1.5.11> ok 82        - resolve_connection_filter                 104 ms1278pg_graphql-1.5.11> ok 83        - resolve_connection_named                   47 ms1279pg_graphql-1.5.11> ok 84        - resolve_connection_order_by                77 ms1280pg_graphql-1.5.11> ok 85        - resolve_connection_pagination_args         96 ms1281pg_graphql-1.5.11> ok 86        - resolve_connection_to_conn                 53 ms1282pg_graphql-1.5.11> ok 87        - resolve_connection_to_node                 52 ms1283pg_graphql-1.5.11> ok 88        - resolve_error_connection_edge_no_field       45 ms1284pg_graphql-1.5.11> ok 89        - resolve_error_connection_edge_node_no_field       46 ms1285pg_graphql-1.5.11> ok 90        - resolve_error_connection_no_field          53 ms1286pg_graphql-1.5.11> ok 91        - resolve_error_from_parser                  11 ms1287pg_graphql-1.5.11> ok 92        - resolve_error_mutation_no_field            42 ms1288pg_graphql-1.5.11> ok 93        - resolve_error_node_no_field                47 ms1289pg_graphql-1.5.11> ok 94        - resolve_error_query_no_field               41 ms1290pg_graphql-1.5.11> ok 95        - resolve_fragment                           48 ms1291pg_graphql-1.5.11> ok 96        - resolve_graphiql_schema                   108 ms1292pg_graphql-1.5.11> ok 97        - resolve_one                                87 ms1293pg_graphql-1.5.11> ok 98        - roundtrip_types                            62 ms1294pg_graphql-1.5.11> ok 99        - row_level_security                         52 ms1295pg_graphql-1.5.11> ok 100       - sqli_connection                            58 ms1296pg_graphql-1.5.11> ok 101       - string_filters                             57 ms1297pg_graphql-1.5.11> ok 102       - test_error_anon_and_named_operations       40 ms1298pg_graphql-1.5.11> ok 103       - test_error_invalid_offset                  73 ms1299pg_graphql-1.5.11> ok 104       - test_error_multiple_anon_operations        41 ms1300pg_graphql-1.5.11> ok 105       - test_error_mutation_transpilation          47 ms1301pg_graphql-1.5.11> ok 106       - test_error_operation_name_not_found        40 ms1302pg_graphql-1.5.11> ok 107       - test_error_operation_names_not_unique       40 ms1303pg_graphql-1.5.11> ok 108       - test_error_query_transpilation             49 ms1304pg_graphql-1.5.11> ok 109       - test_error_subscription                    40 ms1305pg_graphql-1.5.11> ok 110       - test_query__type                           40 ms1306pg_graphql-1.5.11> ok 111       - total_count                                76 ms1307pg_graphql-1.5.11> ok 112       - type_bigfloat                              50 ms1308pg_graphql-1.5.11> ok 113       - type_modifier_max_length                   50 ms1309pg_graphql-1.5.11> ok 114       - type_opaque                                51 ms1310pg_graphql-1.5.11> ok 115       - variable_default                           49 ms1311pg_graphql-1.5.11> ok 116       - views_integration                         167 ms1312pg_graphql-1.5.11> 1..1161313pg_graphql-1.5.11> # All 116 tests passed.1314pg_graphql-1.5.11> + pg_ctl stop -m i1315pg_graphql-1.5.11> waiting for server to shut down....2026-10-06 14:14:26.265 UTC [5202] LOG:  received immediate shutdown request1316pg_graphql-1.5.11> 2026-10-06 14:14:26.271 UTC [5202] LOG:  database system is shut down1317pg_graphql-1.5.11>  done1318pg_graphql-1.5.11> server stopped1319pg_graphql-1.5.11> checkPhase completed in 38 seconds1320pg_graphql-1.5.11> Running phase: installPhase1321pg_graphql-1.5.11> Executing buildPgrxExtension install1322pg_graphql-1.5.11> Running phase: fixupPhase1323pg_graphql-1.5.11> shrinking RPATHs of ELF executables and libraries in /nix/store/n4siqglb731191bw720w8d6fqana48pn-pg_graphql-1.5.111324pg_graphql-1.5.11> shrinking /nix/store/n4siqglb731191bw720w8d6fqana48pn-pg_graphql-1.5.11/lib/pg_graphql-1.5.11.so1325pg_graphql-1.5.11> checking for references to /build/ in /nix/store/n4siqglb731191bw720w8d6fqana48pn-pg_graphql-1.5.11...1326pg_graphql-1.5.11> patching script interpreter paths in /nix/store/n4siqglb731191bw720w8d6fqana48pn-pg_graphql-1.5.111327pg_graphql-1.5.11> stripping (with command strip and flags -S -p) in  /nix/store/n4siqglb731191bw720w8d6fqana48pn-pg_graphql-1.5.11/lib1328pg_graphql-1.5.11> stripping (with command strip and flags -s -p) in  /nix/store/n4siqglb731191bw720w8d6fqana48pn-pg_graphql-1.5.11/lib1329building '/nix/store/0n0iaya9csx9by2pimrx1yglzw8dp4zs-pg_net-0.13.0.drv' on 'ssh-ng://nixbot-remote-build@78.232.36.247'1330building '/nix/store/g6nfp5n056kw2jvfzldzxrrrxfpfcka0-pg_net-0.13.0.drv' on 'ssh-ng://nixbot-remote-build@78.232.36.247'1331building '/nix/store/0n0iaya9csx9by2pimrx1yglzw8dp4zs-pg_net-0.13.0.drv'1332pg_net-0.13.0> Running phase: unpackPhase1333pg_net-0.13.0> unpacking source archive /nix/store/bxdzbzjn4yi7ch55dlcgzk6npzx2p4jz-source1334pg_net-0.13.0> source root is source1335pg_net-0.13.0> Running phase: patchPhase1336pg_net-0.13.0> Running phase: updateAutotoolsGnuConfigScriptsPhase1337pg_net-0.13.0> Running phase: configurePhase1338pg_net-0.13.0> no configure script, doing nothing1339pg_net-0.13.0> Running phase: buildPhase1340building '/nix/store/g6nfp5n056kw2jvfzldzxrrrxfpfcka0-pg_net-0.13.0.drv'1341pg_net-0.13.0> gcc -Wall -Wmissing-prototypes -Wpointer-arith -Wdeclaration-after-statement -Werror=vla -Wendif-labels -Wmissing-format-attribute -Wimplicit-fallthrough=3 -Wcast-function-type -Wformat-security -fno-strict-aliasing -fwrapv -fexcess-precision=standard -Wno-deprecated-non-prototype -Wno-format-truncation -Wno-stringop-truncation -g -O2 -std=gnu17 -std=c11 -Werror -Wno-declaration-after-statement -fPIC  -DEXTVERSION=\"0.13.0\" -I. -I./ -I/nix/store/48l45fvi99n90x6p9i4cs1lmzby6cb73-postgresql-15.19/include/server -I/nix/store/48l45fvi99n90x6p9i4cs1lmzby6cb73-postgresql-15.19/include/internal -D_GNU_SOURCE  -I/nix/store/p17klc3qq4nl9ihfwqfpi8cnqvcf92xz-libxml2-2.15.1-dev/include/libxml2 -I/nix/store/mglbi4dy4kpx7v1dcgf6iincp5x38hsc-lz4-1.10.0-dev/include -I/nix/store/g41q9md9rdcr3lkydi6f8zd6fza3h1q4-zstd-1.5.7-dev/include -I/nix/store/n2vnr7ycfk6midbzxcwd28qj3bgb50cz-icu4c-75.1-dev/include  -c -o src/worker.o src/worker.c1342pg_net-0.13.0> Running phase: unpackPhase1343pg_net-0.13.0> unpacking source archive /nix/store/bxdzbzjn4yi7ch55dlcgzk6npzx2p4jz-source1344pg_net-0.13.0> source root is source1345pg_net-0.13.0> Running phase: patchPhase1346pg_net-0.13.0> Running phase: updateAutotoolsGnuConfigScriptsPhase1347pg_net-0.13.0> Running phase: configurePhase1348pg_net-0.13.0> no configure script, doing nothing1349pg_net-0.13.0> Running phase: buildPhase1350pg_net-0.13.0> gcc -Wall -Wmissing-prototypes -Wpointer-arith -Wdeclaration-after-statement -Werror=vla -Wendif-labels -Wmissing-format-attribute -Wimplicit-fallthrough=3 -Wcast-function-type -Wshadow=compatible-local -Wformat-security -fno-strict-aliasing -fwrapv -fexcess-precision=standard -Wno-format-truncation -Wno-stringop-truncation -g -O2 -std=c11 -Werror -Wno-declaration-after-statement -fPIC -fvisibility=hidden  -DEXTVERSION=\"0.13.0\" -I. -I./ -I/nix/store/9q4p23a2y63xn8safzzn6lbn07bnkshs-postgresql-17.11/include/server -I/nix/store/9q4p23a2y63xn8safzzn6lbn07bnkshs-postgresql-17.11/include/internal -D_GNU_SOURCE  -I/nix/store/p17klc3qq4nl9ihfwqfpi8cnqvcf92xz-libxml2-2.15.1-dev/include/libxml2 -I/nix/store/mglbi4dy4kpx7v1dcgf6iincp5x38hsc-lz4-1.10.0-dev/include -I/nix/store/g41q9md9rdcr3lkydi6f8zd6fza3h1q4-zstd-1.5.7-dev/include -I/nix/store/n2vnr7ycfk6midbzxcwd28qj3bgb50cz-icu4c-75.1-dev/include  -c -o src/worker.o src/worker.c1351pg_net-0.13.0> gcc -Wall -Wmissing-prototypes -Wpointer-arith -Wdeclaration-after-statement -Werror=vla -Wendif-labels -Wmissing-format-attribute -Wimplicit-fallthrough=3 -Wcast-function-type -Wformat-security -fno-strict-aliasing -fwrapv -fexcess-precision=standard -Wno-deprecated-non-prototype -Wno-format-truncation -Wno-stringop-truncation -g -O2 -std=gnu17 -std=c11 -Werror -Wno-declaration-after-statement -fPIC  -DEXTVERSION=\"0.13.0\" -I. -I./ -I/nix/store/48l45fvi99n90x6p9i4cs1lmzby6cb73-postgresql-15.19/include/server -I/nix/store/48l45fvi99n90x6p9i4cs1lmzby6cb73-postgresql-15.19/include/internal -D_GNU_SOURCE  -I/nix/store/p17klc3qq4nl9ihfwqfpi8cnqvcf92xz-libxml2-2.15.1-dev/include/libxml2 -I/nix/store/mglbi4dy4kpx7v1dcgf6iincp5x38hsc-lz4-1.10.0-dev/include -I/nix/store/g41q9md9rdcr3lkydi6f8zd6fza3h1q4-zstd-1.5.7-dev/include -I/nix/store/n2vnr7ycfk6midbzxcwd28qj3bgb50cz-icu4c-75.1-dev/include  -c -o src/util.o src/util.c1352pg_net-0.13.0> gcc -Wall -Wmissing-prototypes -Wpointer-arith -Wdeclaration-after-statement -Werror=vla -Wendif-labels -Wmissing-format-attribute -Wimplicit-fallthrough=3 -Wcast-function-type -Wformat-security -fno-strict-aliasing -fwrapv -fexcess-precision=standard -Wno-deprecated-non-prototype -Wno-format-truncation -Wno-stringop-truncation -g -O2 -std=gnu17 -std=c11 -Werror -Wno-declaration-after-statement -fPIC  -DEXTVERSION=\"0.13.0\" -I. -I./ -I/nix/store/48l45fvi99n90x6p9i4cs1lmzby6cb73-postgresql-15.19/include/server -I/nix/store/48l45fvi99n90x6p9i4cs1lmzby6cb73-postgresql-15.19/include/internal -D_GNU_SOURCE  -I/nix/store/p17klc3qq4nl9ihfwqfpi8cnqvcf92xz-libxml2-2.15.1-dev/include/libxml2 -I/nix/store/mglbi4dy4kpx7v1dcgf6iincp5x38hsc-lz4-1.10.0-dev/include -I/nix/store/g41q9md9rdcr3lkydi6f8zd6fza3h1q4-zstd-1.5.7-dev/include -I/nix/store/n2vnr7ycfk6midbzxcwd28qj3bgb50cz-icu4c-75.1-dev/include  -c -o src/core.o src/core.c1353pg_net-0.13.0> gcc -Wall -Wmissing-prototypes -Wpointer-arith -Wdeclaration-after-statement -Werror=vla -Wendif-labels -Wmissing-format-attribute -Wimplicit-fallthrough=3 -Wcast-function-type -Wshadow=compatible-local -Wformat-security -fno-strict-aliasing -fwrapv -fexcess-precision=standard -Wno-format-truncation -Wno-stringop-truncation -g -O2 -std=c11 -Werror -Wno-declaration-after-statement -fPIC -fvisibility=hidden  -DEXTVERSION=\"0.13.0\" -I. -I./ -I/nix/store/9q4p23a2y63xn8safzzn6lbn07bnkshs-postgresql-17.11/include/server -I/nix/store/9q4p23a2y63xn8safzzn6lbn07bnkshs-postgresql-17.11/include/internal -D_GNU_SOURCE  -I/nix/store/p17klc3qq4nl9ihfwqfpi8cnqvcf92xz-libxml2-2.15.1-dev/include/libxml2 -I/nix/store/mglbi4dy4kpx7v1dcgf6iincp5x38hsc-lz4-1.10.0-dev/include -I/nix/store/g41q9md9rdcr3lkydi6f8zd6fza3h1q4-zstd-1.5.7-dev/include -I/nix/store/n2vnr7ycfk6midbzxcwd28qj3bgb50cz-icu4c-75.1-dev/include  -c -o src/util.o src/util.c1354pg_net-0.13.0> gcc -Wall -Wmissing-prototypes -Wpointer-arith -Wdeclaration-after-statement -Werror=vla -Wendif-labels -Wmissing-format-attribute -Wimplicit-fallthrough=3 -Wcast-function-type -Wshadow=compatible-local -Wformat-security -fno-strict-aliasing -fwrapv -fexcess-precision=standard -Wno-format-truncation -Wno-stringop-truncation -g -O2 -std=c11 -Werror -Wno-declaration-after-statement -fPIC -fvisibility=hidden  -DEXTVERSION=\"0.13.0\" -I. -I./ -I/nix/store/9q4p23a2y63xn8safzzn6lbn07bnkshs-postgresql-17.11/include/server -I/nix/store/9q4p23a2y63xn8safzzn6lbn07bnkshs-postgresql-17.11/include/internal -D_GNU_SOURCE  -I/nix/store/p17klc3qq4nl9ihfwqfpi8cnqvcf92xz-libxml2-2.15.1-dev/include/libxml2 -I/nix/store/mglbi4dy4kpx7v1dcgf6iincp5x38hsc-lz4-1.10.0-dev/include -I/nix/store/g41q9md9rdcr3lkydi6f8zd6fza3h1q4-zstd-1.5.7-dev/include -I/nix/store/n2vnr7ycfk6midbzxcwd28qj3bgb50cz-icu4c-75.1-dev/include  -c -o src/core.o src/core.c1355pg_net-0.13.0> In file included from src/core.c:23:1356pg_net-0.13.0> In function 'init_curl_handle',1357pg_net-0.13.0>     inlined from 'consume_request_queue' at src/core.c:273:5:1358pg_net-0.13.0> src/util.h:6:11: warning: call to 'Wcurl_easy_setopt_err_long' declared with attribute warning: curl_easy_setopt expects a long argument [-Wattribute-warning]1359pg_net-0.13.0>     6 |       if (curl_easy_setopt(hdl, opt, prm) != CURLE_OK) \1360pg_net-0.13.0>       |           ^~~~~~~~~~~~~~~~1361pg_net-0.13.0> src/core.c:94:7: note: in expansion of macro 'CURL_EZ_SETOPT'1362pg_net-0.13.0>    94 |       CURL_EZ_SETOPT(curl_ez_handle, CURLOPT_POST, 1);1363pg_net-0.13.0>       |       ^~~~~~~~~~~~~~1364pg_net-0.13.0> src/util.h:6:11: warning: call to 'Wcurl_easy_setopt_err_long' declared with attribute warning: curl_easy_setopt expects a long argument [-Wattribute-warning]1365pg_net-0.13.0>     6 |       if (curl_easy_setopt(hdl, opt, prm) != CURLE_OK) \1366pg_net-0.13.0>       |           ^~~~~~~~~~~~~~~~1367pg_net-0.13.0> src/core.c:95:7: note: in expansion of macro 'CURL_EZ_SETOPT'1368pg_net-0.13.0>    95 |       CURL_EZ_SETOPT(curl_ez_handle, CURLOPT_POSTFIELDSIZE, 0);1369pg_net-0.13.0>       |       ^~~~~~~~~~~~~~1370pg_net-0.13.0> src/util.h:6:11: warning: call to 'Wcurl_easy_setopt_err_long' declared with attribute warning: curl_easy_setopt expects a long argument [-Wattribute-warning]1371pg_net-0.13.0>     6 |       if (curl_easy_setopt(hdl, opt, prm) != CURLE_OK) \1372pg_net-0.13.0>       |           ^~~~~~~~~~~~~~~~1373pg_net-0.13.0> src/core.c:108:3: note: in expansion of macro 'CURL_EZ_SETOPT'1374pg_net-0.13.0>   108 |   CURL_EZ_SETOPT(curl_ez_handle, CURLOPT_TIMEOUT_MS, timeout_milliseconds);1375pg_net-0.13.0>       |   ^~~~~~~~~~~~~~1376pg_net-0.13.0> src/util.h:6:11: warning: call to 'Wcurl_easy_setopt_err_long' declared with attribute warning: curl_easy_setopt expects a long argument [-Wattribute-warning]1377pg_net-0.13.0>     6 |       if (curl_easy_setopt(hdl, opt, prm) != CURLE_OK) \1378pg_net-0.13.0>       |           ^~~~~~~~~~~~~~~~1379pg_net-0.13.0> src/core.c:110:3: note: in expansion of macro 'CURL_EZ_SETOPT'1380pg_net-0.13.0>   110 |   CURL_EZ_SETOPT(curl_ez_handle, CURLOPT_FOLLOWLOCATION, true);1381pg_net-0.13.0>       |   ^~~~~~~~~~~~~~1382pg_net-0.13.0> gcc -Wall -Wmissing-prototypes -Wpointer-arith -Wdeclaration-after-statement -Werror=vla -Wendif-labels -Wmissing-format-attribute -Wimplicit-fallthrough=3 -Wcast-function-type -Wformat-security -fno-strict-aliasing -fwrapv -fexcess-precision=standard -Wno-deprecated-non-prototype -Wno-format-truncation -Wno-stringop-truncation -g -O2 -std=gnu17 -std=c11 -Werror -Wno-declaration-after-statement -fPIC  -DEXTVERSION=\"0.13.0\" -I. -I./ -I/nix/store/48l45fvi99n90x6p9i4cs1lmzby6cb73-postgresql-15.19/include/server -I/nix/store/48l45fvi99n90x6p9i4cs1lmzby6cb73-postgresql-15.19/include/internal -D_GNU_SOURCE  -I/nix/store/p17klc3qq4nl9ihfwqfpi8cnqvcf92xz-libxml2-2.15.1-dev/include/libxml2 -I/nix/store/mglbi4dy4kpx7v1dcgf6iincp5x38hsc-lz4-1.10.0-dev/include -I/nix/store/g41q9md9rdcr3lkydi6f8zd6fza3h1q4-zstd-1.5.7-dev/include -I/nix/store/n2vnr7ycfk6midbzxcwd28qj3bgb50cz-icu4c-75.1-dev/include  -c -o src/event.o src/event.c1383pg_net-0.13.0> In file included from /nix/store/jviasb44hibgh09829gbmbssbz2jjnhz-curl-8.17.0-dev/include/curl/curl.h:3333,1384pg_net-0.13.0>                  from /nix/store/jviasb44hibgh09829gbmbssbz2jjnhz-curl-8.17.0-dev/include/curl/multi.h:51,1385pg_net-0.13.0>                  from src/event.h:4,1386pg_net-0.13.0>                  from src/event.c:6:1387pg_net-0.13.0> /nix/store/jviasb44hibgh09829gbmbssbz2jjnhz-curl-8.17.0-dev/include/curl/multi.h:429:23: error: expected identifier or '(' before '__extension__'1388pg_net-0.13.0>   429 | CURL_EXTERN CURLMcode curl_multi_setopt(CURLM *multi_handle,1389pg_net-0.13.0>       |                       ^~~~~~~~~~~~~~~~~1390pg_net-0.13.0> /nix/store/jviasb44hibgh09829gbmbssbz2jjnhz-curl-8.17.0-dev/include/curl/multi.h:429:23: error: expected identifier or '(' before ')' token1391pg_net-0.13.0>   429 | CURL_EXTERN CURLMcode curl_multi_setopt(CURLM *multi_handle,1392pg_net-0.13.0>       |                       ^~~~~~~~~~~~~~~~~1393pg_net-0.13.0> make: *** [<builtin>: src/event.o] Error 11394error: build of '/nix/store/0n0iaya9csx9by2pimrx1yglzw8dp4zs-pg_net-0.13.0.drv' on 'ssh-ng://nixbot-remote-build@78.232.36.247' failed: Cannot build '/nix/store/0n0iaya9csx9by2pimrx1yglzw8dp4zs-pg_net-0.13.0.drv'.1395       Reason: builder failed with exit code 2.1396       Output paths:1397         /nix/store/14dkr1mhbrh869r2k75r03ngw6q7c4ma-pg_net-0.13.01398       Last 25 log lines:1399       >       |       ^~~~~~~~~~~~~~1400       > src/util.h:6:11: warning: call to 'Wcurl_easy_setopt_err_long' declared with attribute warning: curl_easy_setopt expects a long argument [-Wattribute-warning]1401       >     6 |       if (curl_easy_setopt(hdl, opt, prm) != CURLE_OK) \1402       >       |           ^~~~~~~~~~~~~~~~1403       > src/core.c:108:3: note: in expansion of macro 'CURL_EZ_SETOPT'1404       >   108 |   CURL_EZ_SETOPT(curl_ez_handle, CURLOPT_TIMEOUT_MS, timeout_milliseconds);1405       >       |   ^~~~~~~~~~~~~~1406       > src/util.h:6:11: warning: call to 'Wcurl_easy_setopt_err_long' declared with attribute warning: curl_easy_setopt expects a long argument [-Wattribute-warning]1407       >     6 |       if (curl_easy_setopt(hdl, opt, prm) != CURLE_OK) \1408       >       |           ^~~~~~~~~~~~~~~~1409       > src/core.c:110:3: note: in expansion of macro 'CURL_EZ_SETOPT'1410       >   110 |   CURL_EZ_SETOPT(curl_ez_handle, CURLOPT_FOLLOWLOCATION, true);1411       >       |   ^~~~~~~~~~~~~~1412       > gcc -Wall -Wmissing-prototypes -Wpointer-arith -Wdeclaration-after-statement -Werror=vla -Wendif-labels -Wmissing-format-attribute -Wimplicit-fallthrough=3 -Wcast-function-type -Wformat-security -fno-strict-aliasing -fwrapv -fexcess-precision=standard -Wno-deprecated-non-prototype -Wno-format-truncation -Wno-stringop-truncation -g -O2 -std=gnu17 -std=c11 -Werror -Wno-declaration-after-statement -fPIC  -DEXTVERSION=\"0.13.0\" -I. -I./ -I/nix/store/48l45fvi99n90x6p9i4cs1lmzby6cb73-postgresql-15.19/include/server -I/nix/store/48l45fvi99n90x6p9i4cs1lmzby6cb73-postgresql-15.19/include/internal -D_GNU_SOURCE  -I/nix/store/p17klc3qq4nl9ihfwqfpi8cnqvcf92xz-libxml2-2.15.1-dev/include/libxml2 -I/nix/store/mglbi4dy4kpx7v1dcgf6iincp5x38hsc-lz4-1.10.0-dev/include -I/nix/store/g41q9md9rdcr3lkydi6f8zd6fza3h1q4-zstd-1.5.7-dev/include -I/nix/store/n2vnr7ycfk6midbzxcwd28qj3bgb50cz-icu4c-75.1-dev/include  -c -o src/event.o src/event.c1413       > In file included from /nix/store/jviasb44hibgh09829gbmbssbz2jjnhz-curl-8.17.0-dev/include/curl/curl.h:3333,1414       >                  from /nix/store/jviasb44hibgh09829gbmbssbz2jjnhz-curl-8.17.0-dev/include/curl/multi.h:51,1415       >                  from src/event.h:4,1416       >                  from src/event.c:6:1417       > /nix/store/jviasb44hibgh09829gbmbssbz2jjnhz-curl-8.17.0-dev/include/curl/multi.h:429:23: error: expected identifier or '(' before '__extension__'1418       >   429 | CURL_EXTERN CURLMcode curl_multi_setopt(CURLM *multi_handle,1419       >       |                       ^~~~~~~~~~~~~~~~~1420       > /nix/store/jviasb44hibgh09829gbmbssbz2jjnhz-curl-8.17.0-dev/include/curl/multi.h:429:23: error: expected identifier or '(' before ')' token1421       >   429 | CURL_EXTERN CURLMcode curl_multi_setopt(CURLM *multi_handle,1422       >       |                       ^~~~~~~~~~~~~~~~~1423       > make: *** [<builtin>: src/event.o] Error 11424       For full logs, run:1425         nix log /nix/store/0n0iaya9csx9by2pimrx1yglzw8dp4zs-pg_net-0.13.0.drv1426error: Cannot build '/nix/store/0n0iaya9csx9by2pimrx1yglzw8dp4zs-pg_net-0.13.0.drv'.1427       Reason: builder failed with exit code 1.1428       Output paths:1429         /nix/store/14dkr1mhbrh869r2k75r03ngw6q7c4ma-pg_net-0.13.01430pg_net-0.13.0> In file included from src/core.c:23:1431pg_net-0.13.0> In function 'init_curl_handle',1432pg_net-0.13.0>     inlined from 'consume_request_queue' at src/core.c:273:5:1433pg_net-0.13.0> src/util.h:6:11: warning: call to 'Wcurl_easy_setopt_err_long' declared with attribute warning: curl_easy_setopt expects a long argument [-Wattribute-warning]1434pg_net-0.13.0>     6 |       if (curl_easy_setopt(hdl, opt, prm) != CURLE_OK) \1435pg_net-0.13.0>       |           ^~~~~~~~~~~~~~~~1436pg_net-0.13.0> src/core.c:94:7: note: in expansion of macro 'CURL_EZ_SETOPT'1437pg_net-0.13.0>    94 |       CURL_EZ_SETOPT(curl_ez_handle, CURLOPT_POST, 1);1438pg_net-0.13.0>       |       ^~~~~~~~~~~~~~1439pg_net-0.13.0> src/util.h:6:11: warning: call to 'Wcurl_easy_setopt_err_long' declared with attribute warning: curl_easy_setopt expects a long argument [-Wattribute-warning]1440pg_net-0.13.0>     6 |       if (curl_easy_setopt(hdl, opt, prm) != CURLE_OK) \1441pg_net-0.13.0>       |           ^~~~~~~~~~~~~~~~1442pg_net-0.13.0> src/core.c:95:7: note: in expansion of macro 'CURL_EZ_SETOPT'1443pg_net-0.13.0>    95 |       CURL_EZ_SETOPT(curl_ez_handle, CURLOPT_POSTFIELDSIZE, 0);1444pg_net-0.13.0>       |       ^~~~~~~~~~~~~~1445pg_net-0.13.0> src/util.h:6:11: warning: call to 'Wcurl_easy_setopt_err_long' declared with attribute warning: curl_easy_setopt expects a long argument [-Wattribute-warning]1446pg_net-0.13.0>     6 |       if (curl_easy_setopt(hdl, opt, prm) != CURLE_OK) \1447pg_net-0.13.0>       |           ^~~~~~~~~~~~~~~~1448pg_net-0.13.0> src/core.c:108:3: note: in expansion of macro 'CURL_EZ_SETOPT'1449pg_net-0.13.0>   108 |   CURL_EZ_SETOPT(curl_ez_handle, CURLOPT_TIMEOUT_MS, timeout_milliseconds);1450pg_net-0.13.0>       |   ^~~~~~~~~~~~~~1451pg_net-0.13.0> src/util.h:6:11: warning: call to 'Wcurl_easy_setopt_err_long' declared with attribute warning: curl_easy_setopt expects a long argument [-Wattribute-warning]1452pg_net-0.13.0>     6 |       if (curl_easy_setopt(hdl, opt, prm) != CURLE_OK) \1453pg_net-0.13.0>       |           ^~~~~~~~~~~~~~~~1454pg_net-0.13.0> src/core.c:110:3: note: in expansion of macro 'CURL_EZ_SETOPT'1455pg_net-0.13.0>   110 |   CURL_EZ_SETOPT(curl_ez_handle, CURLOPT_FOLLOWLOCATION, true);1456pg_net-0.13.0>       |   ^~~~~~~~~~~~~~1457pg_net-0.13.0> gcc -Wall -Wmissing-prototypes -Wpointer-arith -Wdeclaration-after-statement -Werror=vla -Wendif-labels -Wmissing-format-attribute -Wimplicit-fallthrough=3 -Wcast-function-type -Wshadow=compatible-local -Wformat-security -fno-strict-aliasing -fwrapv -fexcess-precision=standard -Wno-format-truncation -Wno-stringop-truncation -g -O2 -std=c11 -Werror -Wno-declaration-after-statement -fPIC -fvisibility=hidden  -DEXTVERSION=\"0.13.0\" -I. -I./ -I/nix/store/9q4p23a2y63xn8safzzn6lbn07bnkshs-postgresql-17.11/include/server -I/nix/store/9q4p23a2y63xn8safzzn6lbn07bnkshs-postgresql-17.11/include/internal -D_GNU_SOURCE  -I/nix/store/p17klc3qq4nl9ihfwqfpi8cnqvcf92xz-libxml2-2.15.1-dev/include/libxml2 -I/nix/store/mglbi4dy4kpx7v1dcgf6iincp5x38hsc-lz4-1.10.0-dev/include -I/nix/store/g41q9md9rdcr3lkydi6f8zd6fza3h1q4-zstd-1.5.7-dev/include -I/nix/store/n2vnr7ycfk6midbzxcwd28qj3bgb50cz-icu4c-75.1-dev/include  -c -o src/event.o src/event.c1458pg_net-0.13.0> In file included from /nix/store/jviasb44hibgh09829gbmbssbz2jjnhz-curl-8.17.0-dev/include/curl/curl.h:3333,1459pg_net-0.13.0>                  from /nix/store/jviasb44hibgh09829gbmbssbz2jjnhz-curl-8.17.0-dev/include/curl/multi.h:51,1460pg_net-0.13.0>                  from src/event.h:4,1461pg_net-0.13.0>                  from src/event.c:6:1462pg_net-0.13.0> /nix/store/jviasb44hibgh09829gbmbssbz2jjnhz-curl-8.17.0-dev/include/curl/multi.h:429:23: error: expected identifier or '(' before '__extension__'1463pg_net-0.13.0>   429 | CURL_EXTERN CURLMcode curl_multi_setopt(CURLM *multi_handle,1464pg_net-0.13.0>       |                       ^~~~~~~~~~~~~~~~~1465pg_net-0.13.0> /nix/store/jviasb44hibgh09829gbmbssbz2jjnhz-curl-8.17.0-dev/include/curl/multi.h:429:23: error: expected identifier or '(' before ')' token1466pg_net-0.13.0>   429 | CURL_EXTERN CURLMcode curl_multi_setopt(CURLM *multi_handle,1467pg_net-0.13.0>       |                       ^~~~~~~~~~~~~~~~~1468pg_net-0.13.0> make: *** [<builtin>: src/event.o] Error 11469error: build of '/nix/store/g6nfp5n056kw2jvfzldzxrrrxfpfcka0-pg_net-0.13.0.drv' on 'ssh-ng://nixbot-remote-build@78.232.36.247' failed: Cannot build '/nix/store/g6nfp5n056kw2jvfzldzxrrrxfpfcka0-pg_net-0.13.0.drv'.1470       Reason: builder failed with exit code 2.1471       Output paths:1472         /nix/store/0z6qc5i8vhckm5s9j7br24f5kfxsgds5-pg_net-0.13.01473       Last 25 log lines:1474       >       |       ^~~~~~~~~~~~~~1475       > src/util.h:6:11: warning: call to 'Wcurl_easy_setopt_err_long' declared with attribute warning: curl_easy_setopt expects a long argument [-Wattribute-warning]1476       >     6 |       if (curl_easy_setopt(hdl, opt, prm) != CURLE_OK) \1477       >       |           ^~~~~~~~~~~~~~~~1478       > src/core.c:108:3: note: in expansion of macro 'CURL_EZ_SETOPT'1479       >   108 |   CURL_EZ_SETOPT(curl_ez_handle, CURLOPT_TIMEOUT_MS, timeout_milliseconds);1480       >       |   ^~~~~~~~~~~~~~1481       > src/util.h:6:11: warning: call to 'Wcurl_easy_setopt_err_long' declared with attribute warning: curl_easy_setopt expects a long argument [-Wattribute-warning]1482       >     6 |       if (curl_easy_setopt(hdl, opt, prm) != CURLE_OK) \1483       >       |           ^~~~~~~~~~~~~~~~1484       > src/core.c:110:3: note: in expansion of macro 'CURL_EZ_SETOPT'1485       >   110 |   CURL_EZ_SETOPT(curl_ez_handle, CURLOPT_FOLLOWLOCATION, true);1486       >       |   ^~~~~~~~~~~~~~1487       > gcc -Wall -Wmissing-prototypes -Wpointer-arith -Wdeclaration-after-statement -Werror=vla -Wendif-labels -Wmissing-format-attribute -Wimplicit-fallthrough=3 -Wcast-function-type -Wshadow=compatible-local -Wformat-security -fno-strict-aliasing -fwrapv -fexcess-precision=standard -Wno-format-truncation -Wno-stringop-truncation -g -O2 -std=c11 -Werror -Wno-declaration-after-statement -fPIC -fvisibility=hidden  -DEXTVERSION=\"0.13.0\" -I. -I./ -I/nix/store/9q4p23a2y63xn8safzzn6lbn07bnkshs-postgresql-17.11/include/server -I/nix/store/9q4p23a2y63xn8safzzn6lbn07bnkshs-postgresql-17.11/include/internal -D_GNU_SOURCE  -I/nix/store/p17klc3qq4nl9ihfwqfpi8cnqvcf92xz-libxml2-2.15.1-dev/include/libxml2 -I/nix/store/mglbi4dy4kpx7v1dcgf6iincp5x38hsc-lz4-1.10.0-dev/include -I/nix/store/g41q9md9rdcr3lkydi6f8zd6fza3h1q4-zstd-1.5.7-dev/include -I/nix/store/n2vnr7ycfk6midbzxcwd28qj3bgb50cz-icu4c-75.1-dev/include  -c -o src/event.o src/event.c1488       > In file included from /nix/store/jviasb44hibgh09829gbmbssbz2jjnhz-curl-8.17.0-dev/include/curl/curl.h:3333,1489       >                  from /nix/store/jviasb44hibgh09829gbmbssbz2jjnhz-curl-8.17.0-dev/include/curl/multi.h:51,1490       >                  from src/event.h:4,1491       >                  from src/event.c:6:1492       > /nix/store/jviasb44hibgh09829gbmbssbz2jjnhz-curl-8.17.0-dev/include/curl/multi.h:429:23: error: expected identifier or '(' before '__extension__'1493       >   429 | CURL_EXTERN CURLMcode curl_multi_setopt(CURLM *multi_handle,1494       >       |                       ^~~~~~~~~~~~~~~~~1495       > /nix/store/jviasb44hibgh09829gbmbssbz2jjnhz-curl-8.17.0-dev/include/curl/multi.h:429:23: error: expected identifier or '(' before ')' token1496       >   429 | CURL_EXTERN CURLMcode curl_multi_setopt(CURLM *multi_handle,1497       >       |                       ^~~~~~~~~~~~~~~~~1498       > make: *** [<builtin>: src/event.o] Error 11499       For full logs, run:1500         nix log /nix/store/g6nfp5n056kw2jvfzldzxrrrxfpfcka0-pg_net-0.13.0.drv1501error: Cannot build '/nix/store/g6nfp5n056kw2jvfzldzxrrrxfpfcka0-pg_net-0.13.0.drv'.1502       Reason: builder failed with exit code 1.1503       Output paths:1504         /nix/store/0z6qc5i8vhckm5s9j7br24f5kfxsgds5-pg_net-0.13.01505building '/nix/store/lbqp8bfrqa2xm82ma6wyq1gijyajh6kh-pg_net-0.13.0.drv' on 'ssh-ng://nixbot-remote-build@78.232.36.247'1506building '/nix/store/lbqp8bfrqa2xm82ma6wyq1gijyajh6kh-pg_net-0.13.0.drv'1507pg_net-0.13.0> Running phase: unpackPhase1508pg_net-0.13.0> unpacking source archive /nix/store/bxdzbzjn4yi7ch55dlcgzk6npzx2p4jz-source1509pg_net-0.13.0> source root is source1510pg_net-0.13.0> Running phase: patchPhase1511pg_net-0.13.0> Running phase: updateAutotoolsGnuConfigScriptsPhase1512pg_net-0.13.0> Running phase: configurePhase1513pg_net-0.13.0> no configure script, doing nothing1514pg_net-0.13.0> Running phase: buildPhase1515pg_net-0.13.0> gcc -Wall -Wmissing-prototypes -Wpointer-arith -Wdeclaration-after-statement -Werror=vla -Wendif-labels -Wmissing-format-attribute -Wimplicit-fallthrough=3 -Wcast-function-type -Wshadow=compatible-local -Wformat-security -fno-strict-aliasing -fwrapv -fexcess-precision=standard -Wno-format-truncation -Wno-stringop-truncation -moutline-atomics -g -O2 -std=c11 -Werror -Wno-declaration-after-statement -fPIC -fvisibility=hidden  -DEXTVERSION=\"0.13.0\" -I. -I./ -I/nix/store/wq2kfr0rkb0hdmf1iwi3mi8pxycakzmq-postgresql-17_22/include/server -I/nix/store/wq2kfr0rkb0hdmf1iwi3mi8pxycakzmq-postgresql-17_22/include/internal -D_GNU_SOURCE  -I/nix/store/p17klc3qq4nl9ihfwqfpi8cnqvcf92xz-libxml2-2.15.1-dev/include/libxml2 -I/nix/store/mglbi4dy4kpx7v1dcgf6iincp5x38hsc-lz4-1.10.0-dev/include -I/nix/store/g41q9md9rdcr3lkydi6f8zd6fza3h1q4-zstd-1.5.7-dev/include -I/nix/store/n2vnr7ycfk6midbzxcwd28qj3bgb50cz-icu4c-75.1-dev/include  -c -o src/worker.o src/worker.c1516pg_net-0.13.0> gcc -Wall -Wmissing-prototypes -Wpointer-arith -Wdeclaration-after-statement -Werror=vla -Wendif-labels -Wmissing-format-attribute -Wimplicit-fallthrough=3 -Wcast-function-type -Wshadow=compatible-local -Wformat-security -fno-strict-aliasing -fwrapv -fexcess-precision=standard -Wno-format-truncation -Wno-stringop-truncation -moutline-atomics -g -O2 -std=c11 -Werror -Wno-declaration-after-statement -fPIC -fvisibility=hidden  -DEXTVERSION=\"0.13.0\" -I. -I./ -I/nix/store/wq2kfr0rkb0hdmf1iwi3mi8pxycakzmq-postgresql-17_22/include/server -I/nix/store/wq2kfr0rkb0hdmf1iwi3mi8pxycakzmq-postgresql-17_22/include/internal -D_GNU_SOURCE  -I/nix/store/p17klc3qq4nl9ihfwqfpi8cnqvcf92xz-libxml2-2.15.1-dev/include/libxml2 -I/nix/store/mglbi4dy4kpx7v1dcgf6iincp5x38hsc-lz4-1.10.0-dev/include -I/nix/store/g41q9md9rdcr3lkydi6f8zd6fza3h1q4-zstd-1.5.7-dev/include -I/nix/store/n2vnr7ycfk6midbzxcwd28qj3bgb50cz-icu4c-75.1-dev/include  -c -o src/util.o src/util.c1517pg_net-0.13.0> gcc -Wall -Wmissing-prototypes -Wpointer-arith -Wdeclaration-after-statement -Werror=vla -Wendif-labels -Wmissing-format-attribute -Wimplicit-fallthrough=3 -Wcast-function-type -Wshadow=compatible-local -Wformat-security -fno-strict-aliasing -fwrapv -fexcess-precision=standard -Wno-format-truncation -Wno-stringop-truncation -moutline-atomics -g -O2 -std=c11 -Werror -Wno-declaration-after-statement -fPIC -fvisibility=hidden  -DEXTVERSION=\"0.13.0\" -I. -I./ -I/nix/store/wq2kfr0rkb0hdmf1iwi3mi8pxycakzmq-postgresql-17_22/include/server -I/nix/store/wq2kfr0rkb0hdmf1iwi3mi8pxycakzmq-postgresql-17_22/include/internal -D_GNU_SOURCE  -I/nix/store/p17klc3qq4nl9ihfwqfpi8cnqvcf92xz-libxml2-2.15.1-dev/include/libxml2 -I/nix/store/mglbi4dy4kpx7v1dcgf6iincp5x38hsc-lz4-1.10.0-dev/include -I/nix/store/g41q9md9rdcr3lkydi6f8zd6fza3h1q4-zstd-1.5.7-dev/include -I/nix/store/n2vnr7ycfk6midbzxcwd28qj3bgb50cz-icu4c-75.1-dev/include  -c -o src/core.o src/core.c1518pg_net-0.13.0> In file included from src/core.c:23:1519pg_net-0.13.0> In function 'init_curl_handle',1520pg_net-0.13.0>     inlined from 'consume_request_queue' at src/core.c:273:5:1521pg_net-0.13.0> src/util.h:6:11: warning: call to 'Wcurl_easy_setopt_err_long' declared with attribute warning: curl_easy_setopt expects a long argument [-Wattribute-warning]1522pg_net-0.13.0>     6 |       if (curl_easy_setopt(hdl, opt, prm) != CURLE_OK) \1523pg_net-0.13.0>       |           ^~~~~~~~~~~~~~~~1524pg_net-0.13.0> src/core.c:94:7: note: in expansion of macro 'CURL_EZ_SETOPT'1525pg_net-0.13.0>    94 |       CURL_EZ_SETOPT(curl_ez_handle, CURLOPT_POST, 1);1526pg_net-0.13.0>       |       ^~~~~~~~~~~~~~1527pg_net-0.13.0> src/util.h:6:11: warning: call to 'Wcurl_easy_setopt_err_long' declared with attribute warning: curl_easy_setopt expects a long argument [-Wattribute-warning]1528pg_net-0.13.0>     6 |       if (curl_easy_setopt(hdl, opt, prm) != CURLE_OK) \1529pg_net-0.13.0>       |           ^~~~~~~~~~~~~~~~1530pg_net-0.13.0> src/core.c:95:7: note: in expansion of macro 'CURL_EZ_SETOPT'1531pg_net-0.13.0>    95 |       CURL_EZ_SETOPT(curl_ez_handle, CURLOPT_POSTFIELDSIZE, 0);1532pg_net-0.13.0>       |       ^~~~~~~~~~~~~~1533pg_net-0.13.0> src/util.h:6:11: warning: call to 'Wcurl_easy_setopt_err_long' declared with attribute warning: curl_easy_setopt expects a long argument [-Wattribute-warning]1534pg_net-0.13.0>     6 |       if (curl_easy_setopt(hdl, opt, prm) != CURLE_OK) \1535pg_net-0.13.0>       |           ^~~~~~~~~~~~~~~~1536pg_net-0.13.0> src/core.c:108:3: note: in expansion of macro 'CURL_EZ_SETOPT'1537pg_net-0.13.0>   108 |   CURL_EZ_SETOPT(curl_ez_handle, CURLOPT_TIMEOUT_MS, timeout_milliseconds);1538pg_net-0.13.0>       |   ^~~~~~~~~~~~~~1539pg_net-0.13.0> src/util.h:6:11: warning: call to 'Wcurl_easy_setopt_err_long' declared with attribute warning: curl_easy_setopt expects a long argument [-Wattribute-warning]1540pg_net-0.13.0>     6 |       if (curl_easy_setopt(hdl, opt, prm) != CURLE_OK) \1541pg_net-0.13.0>       |           ^~~~~~~~~~~~~~~~1542pg_net-0.13.0> src/core.c:110:3: note: in expansion of macro 'CURL_EZ_SETOPT'1543pg_net-0.13.0>   110 |   CURL_EZ_SETOPT(curl_ez_handle, CURLOPT_FOLLOWLOCATION, true);1544pg_net-0.13.0>       |   ^~~~~~~~~~~~~~1545pg_net-0.13.0> gcc -Wall -Wmissing-prototypes -Wpointer-arith -Wdeclaration-after-statement -Werror=vla -Wendif-labels -Wmissing-format-attribute -Wimplicit-fallthrough=3 -Wcast-function-type -Wshadow=compatible-local -Wformat-security -fno-strict-aliasing -fwrapv -fexcess-precision=standard -Wno-format-truncation -Wno-stringop-truncation -moutline-atomics -g -O2 -std=c11 -Werror -Wno-declaration-after-statement -fPIC -fvisibility=hidden  -DEXTVERSION=\"0.13.0\" -I. -I./ -I/nix/store/wq2kfr0rkb0hdmf1iwi3mi8pxycakzmq-postgresql-17_22/include/server -I/nix/store/wq2kfr0rkb0hdmf1iwi3mi8pxycakzmq-postgresql-17_22/include/internal -D_GNU_SOURCE  -I/nix/store/p17klc3qq4nl9ihfwqfpi8cnqvcf92xz-libxml2-2.15.1-dev/include/libxml2 -I/nix/store/mglbi4dy4kpx7v1dcgf6iincp5x38hsc-lz4-1.10.0-dev/include -I/nix/store/g41q9md9rdcr3lkydi6f8zd6fza3h1q4-zstd-1.5.7-dev/include -I/nix/store/n2vnr7ycfk6midbzxcwd28qj3bgb50cz-icu4c-75.1-dev/include  -c -o src/event.o src/event.c1546pg_net-0.13.0> In file included from /nix/store/jviasb44hibgh09829gbmbssbz2jjnhz-curl-8.17.0-dev/include/curl/curl.h:3333,1547pg_net-0.13.0>                  from /nix/store/jviasb44hibgh09829gbmbssbz2jjnhz-curl-8.17.0-dev/include/curl/multi.h:51,1548pg_net-0.13.0>                  from src/event.h:4,1549pg_net-0.13.0>                  from src/event.c:6:1550pg_net-0.13.0> /nix/store/jviasb44hibgh09829gbmbssbz2jjnhz-curl-8.17.0-dev/include/curl/multi.h:429:23: error: expected identifier or '(' before '__extension__'1551pg_net-0.13.0>   429 | CURL_EXTERN CURLMcode curl_multi_setopt(CURLM *multi_handle,1552pg_net-0.13.0>       |                       ^~~~~~~~~~~~~~~~~1553pg_net-0.13.0> /nix/store/jviasb44hibgh09829gbmbssbz2jjnhz-curl-8.17.0-dev/include/curl/multi.h:429:23: error: expected identifier or '(' before ')' token1554pg_net-0.13.0>   429 | CURL_EXTERN CURLMcode curl_multi_setopt(CURLM *multi_handle,1555pg_net-0.13.0>       |                       ^~~~~~~~~~~~~~~~~1556pg_net-0.13.0> make: *** [<builtin>: src/event.o] Error 11557error: build of '/nix/store/lbqp8bfrqa2xm82ma6wyq1gijyajh6kh-pg_net-0.13.0.drv' on 'ssh-ng://nixbot-remote-build@78.232.36.247' failed: Cannot build '/nix/store/lbqp8bfrqa2xm82ma6wyq1gijyajh6kh-pg_net-0.13.0.drv'.1558       Reason: builder failed with exit code 2.1559       Output paths:1560         /nix/store/517wbr5c7xb4fvch9kn0zim5j3hnjzpa-pg_net-0.13.01561       Last 25 log lines:1562       >       |       ^~~~~~~~~~~~~~1563       > src/util.h:6:11: warning: call to 'Wcurl_easy_setopt_err_long' declared with attribute warning: curl_easy_setopt expects a long argument [-Wattribute-warning]1564       >     6 |       if (curl_easy_setopt(hdl, opt, prm) != CURLE_OK) \1565       >       |           ^~~~~~~~~~~~~~~~1566       > src/core.c:108:3: note: in expansion of macro 'CURL_EZ_SETOPT'1567       >   108 |   CURL_EZ_SETOPT(curl_ez_handle, CURLOPT_TIMEOUT_MS, timeout_milliseconds);1568       >       |   ^~~~~~~~~~~~~~1569       > src/util.h:6:11: warning: call to 'Wcurl_easy_setopt_err_long' declared with attribute warning: curl_easy_setopt expects a long argument [-Wattribute-warning]1570       >     6 |       if (curl_easy_setopt(hdl, opt, prm) != CURLE_OK) \1571       >       |           ^~~~~~~~~~~~~~~~1572       > src/core.c:110:3: note: in expansion of macro 'CURL_EZ_SETOPT'1573       >   110 |   CURL_EZ_SETOPT(curl_ez_handle, CURLOPT_FOLLOWLOCATION, true);1574       >       |   ^~~~~~~~~~~~~~1575       > gcc -Wall -Wmissing-prototypes -Wpointer-arith -Wdeclaration-after-statement -Werror=vla -Wendif-labels -Wmissing-format-attribute -Wimplicit-fallthrough=3 -Wcast-function-type -Wshadow=compatible-local -Wformat-security -fno-strict-aliasing -fwrapv -fexcess-precision=standard -Wno-format-truncation -Wno-stringop-truncation -moutline-atomics -g -O2 -std=c11 -Werror -Wno-declaration-after-statement -fPIC -fvisibility=hidden  -DEXTVERSION=\"0.13.0\" -I. -I./ -I/nix/store/wq2kfr0rkb0hdmf1iwi3mi8pxycakzmq-postgresql-17_22/include/server -I/nix/store/wq2kfr0rkb0hdmf1iwi3mi8pxycakzmq-postgresql-17_22/include/internal -D_GNU_SOURCE  -I/nix/store/p17klc3qq4nl9ihfwqfpi8cnqvcf92xz-libxml2-2.15.1-dev/include/libxml2 -I/nix/store/mglbi4dy4kpx7v1dcgf6iincp5x38hsc-lz4-1.10.0-dev/include -I/nix/store/g41q9md9rdcr3lkydi6f8zd6fza3h1q4-zstd-1.5.7-dev/include -I/nix/store/n2vnr7ycfk6midbzxcwd28qj3bgb50cz-icu4c-75.1-dev/include  -c -o src/event.o src/event.c1576       > In file included from /nix/store/jviasb44hibgh09829gbmbssbz2jjnhz-curl-8.17.0-dev/include/curl/curl.h:3333,1577       >                  from /nix/store/jviasb44hibgh09829gbmbssbz2jjnhz-curl-8.17.0-dev/include/curl/multi.h:51,1578       >                  from src/event.h:4,1579       >                  from src/event.c:6:1580       > /nix/store/jviasb44hibgh09829gbmbssbz2jjnhz-curl-8.17.0-dev/include/curl/multi.h:429:23: error: expected identifier or '(' before '__extension__'1581       >   429 | CURL_EXTERN CURLMcode curl_multi_setopt(CURLM *multi_handle,1582       >       |                       ^~~~~~~~~~~~~~~~~1583       > /nix/store/jviasb44hibgh09829gbmbssbz2jjnhz-curl-8.17.0-dev/include/curl/multi.h:429:23: error: expected identifier or '(' before ')' token1584       >   429 | CURL_EXTERN CURLMcode curl_multi_setopt(CURLM *multi_handle,1585       >       |                       ^~~~~~~~~~~~~~~~~1586       > make: *** [<builtin>: src/event.o] Error 11587       For full logs, run:1588         nix log /nix/store/lbqp8bfrqa2xm82ma6wyq1gijyajh6kh-pg_net-0.13.0.drv1589error: Cannot build '/nix/store/lbqp8bfrqa2xm82ma6wyq1gijyajh6kh-pg_net-0.13.0.drv'.1590       Reason: builder failed with exit code 1.1591       Output paths:1592         /nix/store/517wbr5c7xb4fvch9kn0zim5j3hnjzpa-pg_net-0.13.0